{"text_format":"3","workbook":"xlsx","n_sheets":49,"sheets":["目次","受付表","申一面","申二面","申三面","申四面","申五面","申六面","委任状","別紙追加様式","概一面","概二面","概三面","工一面","工二面","工三面","工四面","滋賀敷調表1・2","滋賀敷調表3","京市敷調1・2","京都基礎","軽微変更","計画変更一面","選定届 ","建築主等変更","中間一面","中間二面","中間三面","中間四面","中間ﾁｪｯｸA表","B表【基礎】","C1表【木造軸組】","C2表【2×4】","C3表【S・SRC】","C4表【RC・SRC】","C5表【PC】","C6表【組積造】","C7表【補強CB造】","C8表【丸太組】","完了一面","完了二面","完了三面","完了四面","完了ﾁｪｯｸ（123号）","完了ﾁｪｯｸ（4号）","受付用","確認台帳一覧(データ取込用)","Sheet1","Sheet2"],"not_rendered":{"macros":1,"defined_names":45,"comments":4},"read":"whole","date_system":"1900"}

{"sheet":"目次","index":0,"n_rows":40,"n_cols":16,"rows_kept":40,"merged":[[2,14,2,16]]}
[{"$nulls":6},"目次",null,"入力したいシートのボタンを押してください"]
[]
[]
[{"$nulls":15},"平成"]
[{"$nulls":15},"令和"]
{"$rows_empty":33}
[{"$nulls":9},"株式会社確認検査機構アネックス　2019.05.01"]
[{"$nulls":9},"アネックス用"]

{"sheet":"受付表","index":1,"n_rows":99,"n_cols":58,"rows_kept":99,"merged":[[1,0,1,25],[1,26,1,40],[1,41,1,44],[1,45,1,46],[1,49,1,55],[3,0,3,8],[3,9,3,25],[3,26,3,47],[3,48,3,55],[4,0,5,8],[4,9,5,25],[4,26,5,47],[4,48,5,53],[4,54,5,55],[6,0,6,8],[6,9,6,25],[6,26,6,40],[6,41,6,55],[7,0,8,8],[7,9,8,25],[7,26,8,40],[7,41,8,55],[9,0,23,1],[10,42,10,55],[12,2,12,4],[12,5,12,7],[12,8,12,18],[12,19,12,21],[12,22,12,24],[12,25,12,35],[12,36,12,38],[12,39,12,41],[12,42,12,55],[13,2,13,4],[13,5,13,7],[13,8,13,18],[13,19,13,21],[13,22,13,24],[13,25,13,35],[13,36,13,38],[13,39,13,41],[13,42,13,55],[14,2,14,4],[14,5,14,7],[14,8,14,18],[14,19,14,21],[14,22,14,24],[14,25,14,35],[14,36,14,38],[14,39,14,41],[14,42,14,55],[15,2,15,4],[15,5,15,7],[15,8,15,18],[15,19,15,21],[15,22,15,24],[15,25,15,35],[15,36,15,38],[15,39,15,41],[15,42,15,55],[15,57,23,75],[16,2,16,4],[16,5,16,7],[16,8,16,18],[16,19,16,21],[16,22,16,24],[16,25,16,35],[16,36,16,38],[16,39,16,41],[16,42,16,55],[17,2,17,4],[17,5,17,7],[17,8,17,18],[17,19,17,21],[17,22,17,24],[17,25,17,35],[17,36,17,38],[17,39,17,41],[17,42,17,55],[18,2,18,4],[18,5,18,7],[18,8,18,18],[18,19,18,21],[18,22,18,24],[18,25,18,35],[18,36,18,38],[18,39,18,41],[18,42,18,55],[19,2,19,4],[19,5,19,7],[19,8,19,18],[19,19,19,21],[19,22,19,24],[19,25,19,35],[19,36,19,38],[19,39,19,41],[19,42,19,55],[20,2,20,4],[20,5,20,7],[20,8,20,18],[20,19,20,21],[20,22,20,24],[20,25,20,35],[20,36,20,38],[20,39,20,41],[20,42,20,55],[21,2,21,4],[21,5,21,7],[21,8,21,18],[21,19,21,21],[21,22,21,24],[21,25,21,35],[21,36,21,38],[21,39,21,41],[21,42,21,44],[21,45,21,54],[22,2,22,4],[22,5,22,7],[22,8,22,18],[22,19,22,21],[22,22,22,24],[22,25,22,35],[22,36,22,38],[22,39,22,41],[22,42,22,55],[23,2,23,4],[23,5,23,7],[23,8,23,18],[23,19,23,21],[23,22,23,24],[23,25,23,35],[23,36,23,38],[23,39,23,41],[23,42,23,55],[25,0,25,41],[25,42,25,55],[27,0,29,1],[28,3,28,5],[28,29,28,31],[29,3,29,5],[32,0,33,1],[33,3,33,5],[36,0,37,1],[37,3,37,5],[37,21,37,23],[40,0,41,1],[41,3,41,5],[41,21,41,23],[44,0,47,1],[45,3,45,5],[46,3,46,5],[47,3,47,5],[47,29,47,31],[50,0,52,1],[51,3,51,5],[51,18,51,20],[51,34,51,36],[52,3,52,5],[52,18,52,20],[52,34,52,36],[55,0,56,1],[56,3,56,5],[59,0,60,1],[60,3,60,5],[63,0,64,1],[64,3,64,5],[64,29,64,31],[67,0,68,1],[67,39,68,45],[67,46,68,55],[68,3,68,5],[71,0,72,1],[72,3,72,5],[72,29,72,31],[75,0,76,1],[75,39,76,45],[75,46,76,55],[76,3,76,5],[79,0,81,1],[80,3,80,5],[81,3,81,5],[84,0,87,1],[85,3,85,5],[85,29,85,31],[86,3,86,5],[87,3,87,5],[89,26,89,35],[89,36,89,41],[89,42,89,55],[90,26,91,35],[90,36,91,39],[90,40,91,41],[90,42,91,55],[92,26,92,28],[92,29,92,41],[92,42,92,55],[93,26,93,28],[93,29,93,41],[93,42,94,55],[94,26,94,28],[94,29,94,41]]}
[]
["受　　理　　審　　査　　表　",{"$nulls":25},"管理番号",{"$nulls":18},{"$f":"IF(受付用!B9=\"滋\",\"S\",IF(受付用!B9=\"京\",\"K\",IF(受付用!B9=\"大\",\"O\",IF(受付用!B9=\"奈\",\"N\",\"\"))))","v":""},null,"-"]
[]
["受　付　日",{"$nulls":8},"申　請　者",{"$nulls":16},"　　代理者（設計者）事務所名",{"$nulls":21},"ご担当者"]
[{"$nulls":9},{"$f":"IF(申二面!J7=\"\",\"\",IF(申一面!T20=\"\",申一面!T21,申一面!T20&\"　\n\"&申一面!T21))","v":""},{"$nulls":16},{"$f":"IF(申二面!J17=\"\",\"\",申二面!J17)","v":""},{"$nulls":27},"様"]
[]
["主　要　用　途",{"$nulls":8},"申　請　地",{"$nulls":16},"TEL",{"$nulls":14},"FAX"]
[{"$f":"IF(申三面!N27=\"\",\"\",申三面!N27)","v":""},{"$nulls":8},{"$f":"IF(申三面!G3=\"\",\"\",申三面!G3)","v":""}]
[]
[0]
[{"$nulls":3},"● 提出図書（アンダーラインは全てに必要な書類）     ※事前欄にチェックください。",{"$nulls":38},"事前受付担当者（　　　　　　　　）"]
[]
[null,null,"事前",null,null,"受理",null,null,"図　書　名",{"$nulls":10},"事前",null,null,"受理",null,null,"図　書　名",{"$nulls":10},"事前",null,null,"受理",null,null,"図　書　名"]
[null,null,"□",{"$nulls":5},"事前申請用　（　　　　部）",{"$nulls":10},"□",null,null,"□",null,null,"委任状",{"$nulls":10},"□",null,null,"□",null,null,"工場危険物調書"]
[null,null,"□",{"$nulls":5},"構造計算書　（　　　　部）",{"$nulls":13},"□",null,null,"制限業種確認書",{"$nulls":10},"□",null,null,"□",null,null,"法53条の2第3項に係る報告書"]
[null,null,"□",null,null,"□",null,null,"正本",{"$nulls":10},"□",null,null,"□",null,null,"（滋）敷地調査報告書",{"$nulls":10},"□",null,null,"□",null,null,"既存不適格調書",{"$nulls":14},"※　黄色着色部分にチェック および 記入ください。\n（図書名に記載のないものについて添付される際は、黄色着色空欄部分をご利用ください。）\n\n※　申請書にご連絡が表示されない場合につきましては、memo欄のご連絡先欄をご利用ください。"]
[null,null,"□",null,null,"□",null,null,"副本",{"$nulls":10},"□",null,null,"□",null,null,"（京都市）事前調査報告書",{"$nulls":10},"□",null,null,"□",null,null,"（京都府）基礎の構造関係チェックシート"]
[null,null,"□",null,null,"□",null,null,"消防用（大津市・京都市は不要）",{"$nulls":10},"□",null,null,"□",null,null,"（京都府）意見書、協議書",{"$nulls":10},"□",null,null,"□",null,null,"（京都市）狭あい道路整備要綱　届出書"]
[null,null,"□",null,null,"□",null,null,"建築計画概要書",{"$nulls":10},"□",null,null,"□",null,null,"（大）調査報告書、経由印",{"$nulls":10},"□",null,null,"□",null,null,"（大）工事監理者届"]
[null,null,"□",null,null,"□",null,null,"建築工事届",{"$nulls":10},"□",null,null,"□",null,null,"浄化槽設置調書",{"$nulls":10},"□",null,null,"□",null,null,"(枚方・東大阪）申請カード"]
[null,null,"□",null,null,"□",null,null,"構造適合判定通知書の写し",{"$nulls":10},"□",null,null,"□",null,null,"消防用設備設置計画書",{"$nulls":10},"□",null,null,"□",null,null,"（奈良県）敷地断面図"]
[null,null,"□",null,null,"□",null,null,"構造判定申請書・図書（副本）",{"$nulls":10},"□",null,null,"□",null,null,"構造計算安全証明書",{"$nulls":10},"□",null,null,"□",null,null,"その他（",{"$nulls":12},"）"]
[null,null,"□",null,null,"□",null,null,"他機関省エネ適合判定通知書の写し",{"$nulls":10},"□",null,null,"□",{"$nulls":13},"□",null,null,"□"]
[null,null,"□",null,null,"□",null,null,"他機関省エネ判定申請書・図書（副本）",{"$nulls":10},"□",null,null,"□",{"$nulls":13},"□",null,null,"□"]
[]
["　　　　　　　　　　　　　　　　　　　確　認　内　容",{"$nulls":41},"※ 機関チェック欄"]
[]
[1,null,null,"● 相互の整合性を確認"]
[{"$nulls":3},"□",null,null,"正本及び副本の添付書類の整合性",{"$nulls":22},"□",null,null,"申請書第2面の記載と委任状との確認"]
[{"$nulls":3},"□",null,null,"施行規則第1条の3、表1に掲げる図書の添付の有無"]
[]
[]
[2,null,null,"● 設計者及び監理者の業務範囲を確認"]
[{"$nulls":3},"□",null,null,"設計者及び監理者の資格に応じた業務範囲の確認"]
[]
[]
[3,null,null,"● 設計者の業務範囲を確認　（構造設計一級建築士）"]
[{"$nulls":3},"□",null,null,"自ら設計を行ったもの",{"$nulls":14},"□",null,null,"法適合確認を行ったもの"]
[]
[]
[4,null,null,"● 設計者の業務範囲を確認　（設備設計一級建築士）"]
[{"$nulls":3},"□",null,null,"自ら設計を行ったもの",{"$nulls":14},"□",null,null,"法適合確認を行ったもの"]
[]
[]
[5,null,null,"● 設計者及び監理者の資格を確認　"]
[{"$nulls":3},"□",null,null,"設計者の建築士免許証のデータベースでの確認 （申請書に記載されている全ての設計者）"]
[{"$nulls":3},"□",null,null,"監理者の建築士免許証のデータベースでの確認 （申請書に記載されている全ての監理者）"]
[{"$nulls":3},"□",null,null,"構造設計一級建築士免許証のデータベースでの確認",{"$nulls":22},"□",null,null,"設備設計一級建築士免許証のデータベースでの確認"]
[]
[]
[6,null,null,"● 設計者の記入及び押印を確認"]
[{"$nulls":3},"□",null,null,"申請書第1面",{"$nulls":11},"□",null,null,"計算書の表紙",{"$nulls":12},"□",null,null,"構造関係規定　（構造設計一級建築士）"]
[{"$nulls":3},"□",null,null,"設計図書",{"$nulls":27},"□",null,null,"設備関係規定　（設備設計一級建築士）"]
[]
[]
[7,null,null,"● 認定型式・認証型式部材・法38条認定等を有する建築物"]
[{"$nulls":3},"□",null,null,"認定型式、認証型式部材、構造認定、法38条の規定に係る認定書等の写しの添付の確認"]
[]
[]
[8,null,null,"● 構造計算によって建築物の安全性を確かめた旨の証明書　（構造設計一級建築士が関与しない物件のみ）"]
[{"$nulls":3},"□",null,null,"証明書の写し（証明書と構造計算書に割印）"]
[]
[]
[9,null,null,"● 構造計算適合判定及び構造計算ルート２の有無を確認"]
[{"$nulls":3},"□",null,null,"「証明書の写し」により確認（構造設計一級が関与しない物件）",{"$nulls":22},"□",null,null,"構造計算書により確認（構造設計一級が関与する物件）"]
[]
[]
[10,null,null,"● 構造適合判定通知書等との整合性を確認",{"$nulls":35},"構造適判ﾁｪｯｸ\n終了日",{"$nulls":6},"　　　年　　　月　　　日"]
[{"$nulls":3},"□",null,null,"確認申請書・図書と適合判定通知書・判定申請書・図書の記載事項の整合性の確認"]
[]
[]
[11,null,null,"● 省エネ適合判定の義務対象の有無を確認"]
[{"$nulls":3},"□",null,null,"設計図書により確認　（用途及び面積）",{"$nulls":22},"□",null,null," 施工日に係る適用の対象であることの確認"]
[]
[]
[12,null,null,"● 省エネ適合判定を受けた建築物の計画との整合性を確認",{"$nulls":35},"省エネ適判ﾁｪｯｸ\n終了日",{"$nulls":6},"　　　年　　　月　　　日"]
[{"$nulls":3},"□",null,null,"確認申請書・図書と適合判定通知書・判定申請書・図書等の記載事項の整合性の確認"]
[]
[]
[13,null,null,"● 施行規則第1条の3第10項の適用を受ける場合（既存建築物（現行法適合）にEXP.Jを介して増築する場合）"]
[{"$nulls":3},"□",null,null,"EXP.J等で接する計画のうち増築又は改築に係る部分以外の検査済証の写し"]
[{"$nulls":3},"□",null,null,"直前の確認に要した図書及び書類並びに申請書等"]
[]
[]
[14,null,null,"● 建築基準関係規定の証明書等の写し"]
[{"$nulls":3},"□",null,null,"都市計画法の規定に基づく許可証の写し・・・①",{"$nulls":22},"□",null,null,"都市計画法以外の関係規定の証明書の写し"]
[{"$nulls":3},"□",null,null,"都市計画法の規定に基づくの検査済証の写し（接道要件に係るもの）・・・②"]
[{"$nulls":3},"□",null,null,"都市計画法施行規則第60条の規定に基づく証明書（①②以外のもの）"]
[]
["ｍｅｍｏ（※機関記入）",{"$nulls":25},"ご連絡先",{"$nulls":9},"ご担当者",{"$nulls":5},"チェック終了日"]
[{"$nulls":40},"様"]
[]
[{"$nulls":26},"TEL",{"$nulls":15},"担　当　者"]
[{"$nulls":26},"FAX"]
[]
[]
[]
[null,null,"□"]
[null,null,"■"]

{"sheet":"申一面","index":2,"n_rows":39,"n_cols":55,"rows_kept":39,"merged":[[16,23,16,24],[16,25,16,26],[16,34,16,35],[16,36,16,42],[19,19,19,30],[20,19,20,28],[23,19,23,30],[24,19,24,28],[35,0,35,1],[35,24,35,25],[37,0,37,2],[37,24,37,26]]}
["第二号様式（第一条の三､第三条､第三条の三関係）（A4）"]
[{"$nulls":33},"シートの保護を解除すると編集が可能になります（パスワードなし）",{"$nulls":20},"（注意）"]
[{"$nulls":54},"申請時に記載内容の確認をお願いします。セル内のリンクや計算式の不具合による記載間違いに"]
["確認申請書（建築物）",{"$nulls":53},"ついて当社は責任は負いません。"]
[{"$nulls":54},"共通：　数字は算用数字を、単位はメートル法を用いてください。"]
["（第一面）",{"$nulls":53},"①　申請者又は設計者の氏名の記載を自署で行う場合においては、押印を省略することができます。"]
[{"$nulls":54},"②　※印のある欄は記入しないでください。"]
[]
[]
["　建築基準法第６条第1項又は第６条の２第1項の規定による確認を申請します。　この申請書及び添付図書に"]
["記載の事項は、事実に相違ありません。"]
[]
[]
["指定確認検査機関"]
["株式会社　確認検査機構アネックス  　様"]
[]
[{"$nulls":23},"令和",{"$nulls":3},"年",null,"月",null,"日",null,null,"本日",null,{"$f":"TODAY()","v":"2019-06-03"}]
[]
[]
[]
[{"$nulls":14},"申請者氏名",{"$nulls":15},"印"]
[]
[]
[]
[{"$nulls":14},"設計者氏名",{"$nulls":15},"印"]
[]
[]
["※","手数料欄"]
[]
[]
[]
[]
["※受付欄",{"$nulls":7},"※消防関係同意欄",{"$nulls":7},"※決裁欄",{"$nulls":7},"※確認番号欄"]
[]
[]
[{"$f":"IF(X17=\"\",\"\",X17)","v":"令和"},null,null,"年",null,"月",null,"日",{"$nulls":16},{"$f":"IF(X17=\"\",\"\",X17)","v":"令和"},null,null,"年",null,"月",null,"日"]
["第",{"$nulls":5},"確申建機構ア",{"$f":"IF(受付用!B9=\"\",\"\",受付用!B9)","v":""},{"$nulls":16},"第",{"$nulls":5},"確認建機構ア",{"$f":"IF(受付用!B9=\"\",\"\",受付用!B9)","v":""}]
[{"$f":"IF(受付用!C9=\"\",\"\",受付用!C9)","v":""},{"$nulls":6},"号",{"$nulls":16},{"$f":"IF(受付用!C9=\"\",\"\",受付用!C9)","v":""},{"$nulls":6},"号"]
["係員印",{"$nulls":23},"係員印"]

{"sheet":"申二面","index":3,"n_rows":206,"n_cols":53,"rows_kept":206,"merged":[[5,9,5,31],[5,33,5,48],[6,9,6,31],[6,33,6,48],[7,10,7,15],[8,9,8,31],[9,9,9,15],[13,10,13,11],[13,19,13,22],[13,27,13,30],[14,9,14,31],[15,10,15,11],[15,19,15,21],[15,27,15,30],[16,9,16,31],[17,10,17,15],[18,9,18,31],[19,9,19,15],[24,10,24,11],[24,19,24,22],[24,27,24,30],[25,9,25,31],[26,10,26,11],[26,19,26,21],[26,27,26,30],[27,9,27,31],[28,10,28,15],[29,9,29,31],[30,9,30,15],[31,12,31,31],[34,10,34,11],[34,19,34,22],[34,27,34,30],[35,9,35,31],[36,10,36,11],[36,19,36,21],[36,27,36,30],[37,9,37,31],[38,10,38,15],[39,9,39,31],[40,9,40,15],[41,12,41,31],[43,10,43,11],[43,19,43,22],[43,27,43,30],[44,9,44,31],[45,10,45,11],[45,19,45,21],[45,27,45,30],[46,9,46,31],[47,10,47,15],[48,9,48,31],[49,9,49,15],[50,12,50,31],[52,10,52,11],[52,19,52,22],[52,27,52,30],[53,9,53,31],[54,10,54,11],[54,19,54,21],[54,27,54,30],[55,9,55,31],[56,10,56,15],[57,9,57,31],[58,9,58,15],[59,12,59,31],[65,7,65,22],[66,17,66,21],[68,7,68,22],[69,17,69,21],[71,7,71,22],[72,17,72,21],[73,7,73,22],[74,17,74,21],[75,7,75,22],[76,17,76,21],[78,7,78,22],[79,17,79,21],[80,7,80,22],[81,17,81,21],[82,7,82,22],[83,17,83,21],[88,7,88,31],[89,7,89,31],[90,8,90,13],[91,7,91,31],[92,7,92,13],[93,7,93,13],[94,11,94,31],[97,7,97,31],[98,7,98,31],[99,8,99,13],[100,7,100,31],[101,7,101,13],[102,7,102,13],[103,11,103,31],[105,7,105,31],[106,7,106,31],[107,8,107,13],[108,7,108,31],[109,7,109,13],[110,7,110,13],[111,11,111,31],[113,7,113,31],[114,7,114,31],[115,8,115,13],[116,7,116,31],[117,7,117,13],[118,7,118,13],[119,11,119,31],[124,10,124,11],[124,19,124,22],[124,27,124,30],[125,9,125,31],[126,10,126,11],[126,19,126,21],[126,27,126,30],[127,9,127,31],[128,10,128,15],[129,9,129,31],[130,9,130,15],[131,11,131,31],[134,10,134,11],[134,19,134,22],[134,27,134,30],[135,9,135,31],[136,10,136,11],[136,19,136,21],[136,27,136,30],[137,9,137,31],[138,10,138,15],[139,9,139,31],[140,9,140,15],[141,11,141,31],[143,10,143,11],[143,19,143,22],[143,27,143,30],[144,9,144,31],[145,10,145,11],[145,19,145,21],[145,27,145,30],[146,9,146,31],[147,10,147,15],[148,9,148,31],[149,9,149,15],[150,11,150,31],[152,10,152,11],[152,19,152,22],[152,27,152,30],[153,9,153,31],[154,10,154,11],[154,19,154,21],[154,27,154,30],[155,9,155,31],[156,10,156,15],[157,9,157,31],[158,9,158,15],[159,11,159,31],[163,7,163,31],[164,13,164,16],[164,19,164,25],[165,7,165,31],[166,8,166,13],[167,7,167,31],[168,7,168,13],[172,8,172,30],[173,8,173,30],[178,8,178,30],[179,8,179,30],[180,8,180,30],[183,4,183,31],[184,4,184,31],[185,4,185,31],[187,4,187,21]]}
[]
["（第二面）",{"$nulls":50},"シートの保護を解除すると編集が可能になります（パスワードなし）"]
[null,"建築主等の概要"]
[]
["【1.建築主】",{"$nulls":50},"（注意）第二面"]
[null,"【イ.氏名のフリガナ】",{"$nulls":31},"氏名のフリガナ",{"$nulls":17},"①　建築主が２以上のときは、１欄は代表となる建築主について記入し、"]
[null,"【ロ.氏名】",{"$nulls":31},{"$f":"IF(J7=\"\",\"\",ASC(PHONETIC(J7)))","v":""},{"$nulls":18},"別紙に他の建築主についてそれぞれ必要な事項を記入して添えてください。"]
[null,"【ハ.郵便番号】",{"$nulls":7},"〒",{"$nulls":41},"②　建築主からの委任を受けて申請を行う者がいる場合においては、２欄に記入してください。"]
[null,"【ニ.住所】",{"$nulls":49},"③　２欄、３欄及び５欄は、代理者、設計者又は工事監理者が建築士事務所に属しているときは、"]
[null,"【ホ.電話番号】",{"$nulls":50},"その名称を書き、建築士事務所に属していないときは、所在地はそれぞれ代理者、設計者又"]
[{"$nulls":52},"は工事監理者の住所を書いてください。"]
[]
["【2.代理者】",{"$nulls":50},"④　３欄の｢ト｣は、作成した又は建築士法第20条の２第３項若しくは第20条の３第３項の表示をし"]
[null,"【イ.資格】",{"$nulls":7},"（",null,null,"）","建築士",{"$nulls":4},"（",{"$nulls":4},"）","登録",null,"第",{"$nulls":4},"号",{"$nulls":20},"た図書について記入してください。"]
[null,"【ロ.氏名】",{"$nulls":49},"⑤　３欄、４欄及び５欄は、それぞれ代表となる設計者、建築設備の設計に関し意見を聴いた者及"]
[null,"【ハ.建築士事務所名】",{"$nulls":7},"（",null,null,"）","建築士事務所",{"$nulls":4},"（",{"$nulls":3},"）","知事登録第",{"$nulls":7},"号",{"$nulls":20},"び工事監理者並びに申請に係る建築物に係る他のすべての設計者、建築設備の設計に関し"]
[{"$nulls":52},"意見を聴いた者及び工事監理者について記入してください。３欄の設計者のうち、構造設計一"]
[null,"【ニ.郵便番号】",{"$nulls":7},"〒",{"$nulls":42},"級建築士又は設備設計一級建築士である旨の表示をした者がいる場合は、該当するチェックボッ"]
[null,"【ホ.所在地】",{"$nulls":50},"クスに｢レ｣マークを入れてください。記入欄が不足する場合には、別紙に必要な事項を記入して"]
[null,"【へ.電話番号】",{"$nulls":50},"添えてください。"]
[]
[]
["【3.設計者】",{"$nulls":50},"⑥　４欄は、建築士法第20条第５項に規定する場合（設計に係る場合に限る。）に、同項に定める"]
[null,"(代表となる設計者)",{"$nulls":50},"資格を有する者について記入し、所在地は、その者が勤務しているときは勤務先の所在地を、"]
[null,"【イ.資格】",{"$nulls":7},"（",null,null,"）","建築士",{"$nulls":4},"（",{"$nulls":4},"）","登録",null,"第",{"$nulls":4},"号",null,"←","3年ごとの建築士定期講習について確認してください。",{"$nulls":17},"勤務していないときはその者の住所を、登録番号は建築士法施行規則　第17条の35第1項の"]
[null,"【ロ.氏名】",{"$nulls":50},"規定による登録を受けている場合の当該登録番号を書いてください。"]
[null,"【ハ.建築士事務所名】",{"$nulls":7},"（",null,null,"）","建築士事務所",{"$nulls":4},"（",{"$nulls":3},"）","知事登録第",{"$nulls":7},"号",{"$nulls":19},"⑦　５欄及び６欄は、それぞれ工事監理者又は工事施工者が未定のときは、後で定まってから工"]
[{"$nulls":52},"事着手前に届け出てください。"]
[null,"【ニ.郵便番号】",{"$nulls":7},"〒",{"$nulls":41},"⑧　６欄は、工事施工者が２以上のときは、代表となる工事施工者について記入し、別紙に他の工"]
[null,"【ホ.所在地】",{"$nulls":50},"事施工者について棟別にそれぞれ必要な事項を記入して添えてください。"]
[null,"【へ.電話番号】",{"$nulls":49},"⑨","７欄は、該当するチェックボックスに「レ」マークを入れ、申請済の場合には、申請をした都道府"]
[null,"【ト.作成又は確認した設計図書】",{"$nulls":50},"県名又は指定構造計算適合性判定機関の名称及び事務所の所在地を記入してください。未"]
[{"$nulls":52},"申請の場合には、申請する予定の都道府県名又は指定構造計算適合性判定機関の名称及び"]
[null,"(その他の設計者)",{"$nulls":50},"事務所の所在地を記入し、申請をした後に、遅滞なく、申請をした旨（申請先を変更した場合に"]
[null,"【イ.資格】",{"$nulls":7},"（",null,null,"）","建築士",{"$nulls":4},"（",{"$nulls":4},"）","登録",null,"第",{"$nulls":4},"号",{"$nulls":20},"おいては、申請をした都道府県名又は指定構造計算適合性判定機関の名称及び事務所の所"]
[null,"【ロ.氏名】",{"$nulls":50},"在地を含む。）を届け出てください。なお、所在地については、○○県○○市、郡○○町、村、"]
[null,"【ハ.建築士事務所名】",{"$nulls":7},"（",null,null,"）","建築士事務所",{"$nulls":4},"（",{"$nulls":3},"）","知事登録第",{"$nulls":7},"号",{"$nulls":20},"程度で結構です。"]
[{"$nulls":51},"⑩","８欄は、該当するチェックボックスに「レ」マークを入れ、提出済の場合には、提出をした所管行"]
[null,"【ニ.郵便番号】",{"$nulls":7},{"$f":"IF(K39=\"\",\"\",\"〒\")","v":""},{"$nulls":42},"政庁又は登録建築物エネルギー消費性能判定機関の名称及び事務所の所在地を記入してく"]
[null,"【ホ.所在地】",{"$nulls":50},"ださい。未提出の場合には、提出する予定の所管行政庁又は登録建築物エネルギー消費性能"]
[null,"【へ.電話番号】",{"$nulls":50},"判定機関の名称及び事務所の所在地を記入し、提出をした場合に、遅滞なく、提出をした旨（提"]
[null,"【ト.作成又は確認した設計図書】",{"$nulls":31},"←","構造設計図書の作成確認した者が明確になるようにして",{"$nulls":17},"出先を変更した場合においては、提出した所管行政庁又は登録建築物エネルギー消費性能判"]
[{"$nulls":34},"ください。",{"$nulls":17},"定機関の名称及び事務所の所在地を含む。）を届け出てください。なお、所在地については、○"]
[null,"【イ.資格】",{"$nulls":7},"（",null,null,"）","建築士",{"$nulls":4},"（",{"$nulls":4},"）","登録",null,"第",{"$nulls":4},"号",null,null,"（例：構造は別の者が作成確認した場合、",{"$nulls":17},"○県○○市、郡○○町、村、程度で結構です。"]
[null,"【ロ.氏名】",{"$nulls":32},"　設計図書一式（構造図、構造計算書を除く））",{"$nulls":17},"また、提出不要の場合には、建築物のエネルギー消費性能の向上に関する法律施行令第4条"]
[null,"【ハ.建築士事務所名】",{"$nulls":7},"（",null,null,"）","建築士事務所",{"$nulls":4},"（",{"$nulls":3},"）","知事登録第",{"$nulls":7},"号",{"$nulls":20},"第1項に規定する床面積を記入する等、提出が不要である理由を記入してください。特に必要が"]
[{"$nulls":52},"ある場合には、各階平面図等の図書によりその根拠を明らかにしてください。なお、延べ面積が"]
[null,"【ニ.郵便番号】",{"$nulls":7},{"$f":"IF(K48=\"\",\"\",\"〒\")","v":""},{"$nulls":42},"2,000平方メートル未満である場合、建築物のエネルギー消費性能の向上に関する法律第11条"]
[null,"【ホ.所在地】",{"$nulls":50},"第1項の規定による非住宅を有さない場合その他の提出が不要であることが明らかな場合は、記"]
[null,"【へ.電話番号】",{"$nulls":50},"入する必要はありません。"]
[null,"【ト.作成又は確認した設計図書】",{"$nulls":49},"⑪","建築物の名称又は工事名が定まっているときは、９欄に記入してください。"]
[]
[null,"【イ.資格】",{"$nulls":7},"（",null,null,"）","建築士",{"$nulls":4},"（",{"$nulls":4},"）","登録",null,"第",{"$nulls":4},"号"]
[null,"【ロ.氏名】"]
[null,"【ハ.建築士事務所名】",{"$nulls":7},"（",null,null,"）","建築士事務所",{"$nulls":4},"（",{"$nulls":3},"）","知事登録第",{"$nulls":7},"号"]
[]
[null,"【ニ.郵便番号】",{"$nulls":7},{"$f":"IF(K57=\"\",\"\",\"〒\")","v":""}]
[null,"【ホ.所在地】"]
[null,"【へ.電話番号】"]
[null,"【ト.作成又は確認した設計図書】"]
[]
[]
[null,"（構造設計一級建築士又は設備設計一級建築士である旨の表示をした者）"]
[null,null,"上記の設計者のうち、"]
[null,null,"□","建築士法第20条の２第１項の表示をした者",{"$nulls":29},"←","構造一級建築士である旨の表示をした者のうち"]
[null,null,"【イ.氏名】",{"$nulls":31},"構造設計を行った場合、建築士法第20条の２第１項の表示をした者に記載"]
[null,null,"【ロ.資格】構造設計一級建築士交付",{"$nulls":13},"第",{"$nulls":5},"号",{"$nulls":11},"構造関係規定に適法することを確認した場合、建築士法第20条の２第３項の表示をした者に記載"]
[null,null,"□","建築士法第20条の２第３項の表示をした者"]
[null,null,"【イ.氏名】"]
[null,null,"【ロ.資格】構造設計一級建築士交付",{"$nulls":13},"第",{"$nulls":5},"号"]
[null,null,"□","建築士法第20条の３第１項の表示をした者",{"$nulls":29},"←","設備一級建築士も上記同様"]
[null,null,"【イ.氏名】"]
[null,null,"【ロ.資格】設備設計一級建築士交付",{"$nulls":13},"第",{"$nulls":5},"号"]
[null,null,"【イ.氏名】"]
[null,null,"【ロ.資格】設備設計一級建築士交付",{"$nulls":13},"第",{"$nulls":5},"号"]
[null,null,"【イ.氏名】"]
[null,null,"【ロ.資格】設備設計一級建築士交付",{"$nulls":13},"第",{"$nulls":5},"号"]
[null,null,"□","建築士法第20条の３第３項の表示をした者"]
[null,null,"【イ.氏名】"]
[null,null,"【ロ.資格】設備設計一級建築士交付",{"$nulls":13},"第",{"$nulls":5},"号"]
[null,null,"【イ.氏名】"]
[null,null,"【ロ.資格】設備設計一級建築士交付",{"$nulls":13},"第",{"$nulls":5},"号"]
[null,null,"【イ.氏名】"]
[null,null,"【ロ.資格】設備設計一級建築士交付",{"$nulls":13},"第",{"$nulls":5},"号"]
[]
[]
["【4.建築設備の設計に関し意見を聴いた者】"]
[null,"(代表となる建築設備の設計に関し意見を聴いた者)"]
[null,"【イ.氏名】"]
[null,"【ロ.勤務先】"]
[null,"【ハ.郵便番号】",{"$nulls":5},{"$f":"IF(I91=\"\",\"\",\"〒\")","v":""}]
[null,"【ニ.所在地】"]
[null,"【ホ.電話番号】"]
[null,"【ヘ.登録番号】"]
[null,"【ト.意見を聴いた設計図書】"]
[]
[null,"(その他の建築設備の設計に関し意見を聴いた者)"]
[null,"【イ.氏名】"]
[null,"【ロ.勤務先】"]
[null,"【ハ.郵便番号】",{"$nulls":5},{"$f":"IF(I100=\"\",\"\",\"〒\")","v":""}]
[null,"【ニ.所在地】"]
[null,"【ホ.電話番号】"]
[null,"【ヘ.登録番号】"]
[null,"【ト.意見を聴いた設計図書】"]
[]
[null,"【イ.氏名】"]
[null,"【ロ.勤務先】"]
[null,"【ハ.郵便番号】",{"$nulls":5},{"$f":"IF(I108=\"\",\"\",\"〒\")","v":""}]
[null,"【ニ.所在地】"]
[null,"【ホ.電話番号】"]
[null,"【ヘ.登録番号】"]
[null,"【ト.意見を聴いた設計図書】"]
[]
[null,"【イ.氏名】"]
[null,"【ロ.勤務先】"]
[null,"【ハ.郵便番号】",{"$nulls":5},{"$f":"IF(I116=\"\",\"\",\"〒\")","v":""}]
[null,"【ニ.所在地】"]
[null,"【ホ.電話番号】"]
[null,"【ヘ.登録番号】"]
[null,"【ト.意見を聴いた設計図書】"]
[]
[]
["【5.工事監理者】"]
[null,"(代表となる工事監理者)"]
[null,"【イ.資格】",{"$nulls":7},"（",null,null,"）","建築士",{"$nulls":4},"（",{"$nulls":4},"）","登録",null,"第",{"$nulls":4},"号"]
[null,"【ロ.氏名】"]
[null,"【ハ.建築士事務所名】",{"$nulls":7},"（",null,null,"）","建築士事務所",{"$nulls":4},"（",{"$nulls":3},"）","知事登録第",{"$nulls":7},"号"]
[]
[null,"【ニ.郵便番号】",{"$nulls":7},"〒"]
[null,"【ホ.所在地】"]
[null,"【へ.電話番号】"]
[null,"【ト.工事と照合する設計図書】"]
[]
[null,"(その他の工事監理者)"]
[null,"【イ.資格】",{"$nulls":7},"（",null,null,"）","建築士",{"$nulls":4},"（",{"$nulls":4},"）","登録",null,"第",{"$nulls":4},"号"]
[null,"【ロ.氏名】"]
[null,"【ハ.建築士事務所名】",{"$nulls":7},"（",null,null,"）","建築士事務所",{"$nulls":4},"（",{"$nulls":3},"）","知事登録第",{"$nulls":7},"号"]
[]
[null,"【ニ.郵便番号】",{"$nulls":7},{"$f":"IF(K139=\"\",\"\",\"〒\")","v":""}]
[null,"【ホ.所在地】"]
[null,"【へ.電話番号】"]
[null,"【ト.工事と照合する設計図書】"]
[]
[null,"【イ.資格】",{"$nulls":7},"（",null,null,"）","建築士",{"$nulls":4},"（",{"$nulls":4},"）","登録",null,"第",{"$nulls":4},"号"]
[null,"【ロ.氏名】"]
[null,"【ハ.建築士事務所名】",{"$nulls":7},"（",null,null,"）","建築士事務所",{"$nulls":4},"（",{"$nulls":3},"）","知事登録第",{"$nulls":7},"号"]
[]
[null,"【ニ.郵便番号】",{"$nulls":7},{"$f":"IF(K148=\"\",\"\",\"〒\")","v":""}]
[null,"【ホ.所在地】"]
[null,"【へ.電話番号】"]
[null,"【ト.工事と照合する設計図書】"]
[]
[null,"【イ.資格】",{"$nulls":7},"（",null,null,"）","建築士",{"$nulls":4},"（",{"$nulls":4},"）","登録",null,"第",{"$nulls":4},"号"]
[null,"【ロ.氏名】"]
[null,"【ハ.建築士事務所名】",{"$nulls":7},"（",null,null,"）","建築士事務所",{"$nulls":4},"（",{"$nulls":3},"）","知事登録第",{"$nulls":7},"号"]
[]
[null,"【ニ.郵便番号】",{"$nulls":7},{"$f":"IF(K157=\"\",\"\",\"〒\")","v":""}]
[null,"【ホ.所在地】"]
[null,"【へ.電話番号】"]
[null,"【ト.工事と照合する設計図書】"]
[]
[]
["【6.工事施工者】"]
[null,"【イ.氏名】"]
[null,"【ロ.営業所名】",{"$nulls":5},"建設業の許可",{"$nulls":4},"（",{"$nulls":4},"）","第",{"$nulls":7},"号",{"$nulls":6},"←","5年ごとの更新"]
[]
[null,"【ハ.郵便番号】",{"$nulls":5},"〒"]
[null,"【ニ.所在地】"]
[null,"【ホ.電話番号】"]
[]
[]
["【7.構造計算適合性判定の申請】"]
[{"$nulls":3},"□","申請済",null,null,"(",{"$nulls":23},")"]
[{"$nulls":3},"□","未申請",null,null,"(",{"$nulls":23},")",{"$nulls":14},"申請者は、建築物エネルギー消費性能確保計画の提出が不要の場合（適合性判定が不要の場合）には、提出"]
[{"$nulls":3},"□","申請不要",{"$nulls":41},"不要である理由を「提出不要」のカッコ内に記入し、その根拠となる各階平面図等の図書を添付してください。"]
[]
[]
["【8.建築物エネルギー消費性能確保計画の提出】",{"$nulls":45},"【提出不要の場合の記載例】"]
[{"$nulls":3},"□","提出済",null,null,"(",{"$nulls":23},")",{"$nulls":14},"延べ面積が2,500㎡の非住宅建築物で、開放部分を除いた床面積が1,800㎡の場合、確認申請書には、次のよう"]
[{"$nulls":3},"□","未提出",null,null,"(",{"$nulls":23},")",{"$nulls":14},"に記入する。その上で、「開放部分、その床面積及び求積に必要な寸法・算式」や「常時外気に開放された開口"]
[{"$nulls":3},"□","提出不要",null,null,"(",{"$nulls":23},")",{"$nulls":14},"部の位置、その面積及び求積に必要な寸法・算式」を明示した各階平面図等を添付してください。"]
[]
[]
["【9.備考】",{"$nulls":45},"■","提出不要",null,null,"（開放部分を除いた非住宅部分の床面積が2,000㎡以下であるため）"]
[{"$nulls":33},"←","建築物の名称又は工事名(フリガナ）"]
[{"$nulls":33},"←","建築物の名称又は工事名"]
[]
[{"$nulls":3},"フリガナ",{"$f":"IF(E186=\"\",\"\",ASC(PHONETIC(E186)))","v":""}]
[]
[]
[null,"●滋賀県・京都府・奈良県●"]
[null,"一般財団法人 日本建築総合試験所　　大阪府大阪市中央区内本町2丁目4番7号"]
[null,"一般財団法人 日本建築センター　　大阪府大阪市中央区南本町1丁目7番15号"]
[null,"一般財団法人 日本建築センター　　東京都千代田区神田錦町1丁目9番地"]
[null,"●大阪府●"]
[null,"一般財団法人 日本建築総合試験所　　大阪府大阪市中央区内本町2丁目4番7号"]
[null,"一般財団法人 日本建築センター　　大阪府大阪市中央区南本町1丁目7番15号"]
[null,"一般財団法人 日本建築センター　　東京都千代田区神田錦町1丁目9番地"]
[null,"一般財団法人 大阪建築防災センター　 　大阪府大阪市中央区谷町3丁目1番17号"]
[null,"株式会社確認検査機構アネックス　　滋賀県大津市末広町7番1号"]
[]
[null,"滋賀県",null,null,"大臣",{"$nulls":4},"設計図書一式"]
[null,"京都府",null,null,"滋賀県知事",{"$nulls":4},"設計図書一式（構造図、構造計算書を除く）"]
[null,"大阪府",null,null,"京都府知事",{"$nulls":4},"構造図、構造計算書"]
[null,"奈良県",null,null,"大阪府知事"]
[{"$nulls":4},"奈良県知事"]

{"sheet":"申三面","index":4,"n_rows":125,"n_cols":82,"rows_kept":125,"merged":[[2,6,2,31],[3,6,3,31],[8,14,8,31],[9,1,9,31],[11,8,11,14],[11,15,11,19],[12,15,12,19],[14,9,14,11],[14,15,14,17],[14,21,14,23],[14,27,14,29],[15,9,15,11],[15,15,15,17],[15,21,15,23],[15,27,15,29],[16,9,16,12],[16,15,16,18],[16,21,16,24],[16,27,16,30],[18,9,18,11],[18,15,18,17],[18,21,18,23],[18,27,18,29],[20,9,20,11],[20,15,20,17],[20,21,20,23],[20,27,20,29],[21,12,21,16],[22,12,22,16],[23,23,23,27],[23,34,23,36],[23,37,23,41],[23,42,23,43],[24,23,24,27],[24,34,24,36],[24,37,24,41],[24,42,24,43],[25,5,25,30],[26,9,26,11],[26,13,26,30],[29,12,29,16],[29,19,29,23],[29,26,29,30],[30,12,30,15],[30,19,30,22],[30,26,30,29],[31,16,31,22],[32,12,32,16],[32,19,32,23],[32,26,32,30],[33,12,33,15],[33,19,33,22],[33,26,33,29],[35,12,35,15],[35,19,35,22],[35,26,35,29],[37,12,37,15],[37,19,37,22],[37,26,37,29],[39,12,39,15],[39,19,39,22],[39,26,39,29],[40,12,40,15],[40,19,40,22],[40,26,40,29],[41,12,41,15],[41,19,41,22],[41,26,41,29],[42,12,42,15],[42,19,42,22],[42,26,42,29],[44,12,44,15],[44,19,44,22],[44,26,44,29],[45,12,45,15],[45,19,45,22],[45,26,45,29],[46,12,46,15],[46,19,46,22],[46,26,46,29],[47,12,47,15],[47,19,47,22],[47,26,47,29],[49,12,49,15],[49,19,49,22],[49,26,49,29],[50,17,50,22],[51,17,51,22],[53,15,53,19],[54,15,54,19],[55,11,55,15],[55,18,55,22],[56,11,56,14],[56,18,56,21],[57,11,57,15],[57,18,57,22],[58,11,58,15],[58,18,58,22],[59,8,59,16],[59,18,59,19],[59,20,59,28],[64,2,64,31],[65,2,65,31],[66,2,66,31],[67,2,67,31],[68,11,68,12],[68,13,68,14],[68,16,68,17],[68,19,68,20],[69,11,69,12],[69,13,69,14],[69,16,69,17],[69,19,69,20],[71,7,71,8],[71,16,71,30],[72,7,72,8],[72,16,72,30],[73,7,73,8],[73,16,73,30],[75,2,75,31],[76,2,76,31],[77,2,77,31],[79,2,79,31],[80,2,80,31],[81,2,81,31],[82,2,82,31]]}
["（第三面）",{"$nulls":47},"シートの保護を解除すると編集が可能になります（パスワードなし）"]
["建築物及びその敷地に関する事項",{"$nulls":47},"（注意）第三面",{"$nulls":32},"●滋賀県●"]
["【1.地名地番】",{"$nulls":32},"←","こちらの市町村を間違えると他のシートに影響するので注意",{"$nulls":13},"①","住居表示が定まっているときは、２欄に記入してください。",{"$nulls":31},"土台、柱、梁及び筋かいを金物により接合する工事の工程"]
["【2.住居表示】",{"$nulls":32},"←","住居表示が定まっていなければ空欄",{"$nulls":13},"②","３欄は、該当するチェックボックスに「レ」マークを入れてください。ただし、建築物の敷地が都",{"$nulls":31},"壁を設置する工事の工程"]
["【3.都市計画区域及び準都市計画区域の内外の別等】",{"$nulls":48},"市計画区域、準都市計画区域又はこれらの区域以外の区域のうち２以上の区域にわたる場合",{"$nulls":31},"鉄骨の軸組を溶接し、又はボルト等により接合する工事(建て方)の工程"]
[null,"□","都市計画区域内",{"$nulls":5},"（ ","□","市街化区域",{"$nulls":4},"□","市街化調整区域",{"$nulls":6},"□","区域区分非設定",{"$nulls":5},"）",{"$nulls":18},"においては、当該敷地の過半の属する区域について記入してください。なお、当該敷地が３の",{"$nulls":31},"2階の床版の取付け又は床版の鉄筋を配置する工事の工程"]
[null,"□","準都市計画区域内",{"$nulls":6},"□","都市計画区域及び準都市計画区域外",{"$nulls":38},"区域にわたる場合で、かつ、当該敷地の過半の属する区域がない場合においては、都市計画",{"$nulls":31},"基礎及び地中梁に鉄筋を配置する工事の工程"]
["【4.防火地域】",{"$nulls":6},"□","防火地域",{"$nulls":3},"□","準防火地域",{"$nulls":4},"□","指定なし",null,null,"（","□","法第22条区域 ）",{"$nulls":24},"区域又は準都市計画区域のうち、当該敷地の属する面積が大きい区域について記入してくだ",{"$nulls":31},"2階の床及びこれを支持する梁に鉄筋を配置する工事の工程"]
["【5.その他の区域、地域、地区又は街区】",{"$nulls":48},"さい。",{"$nulls":31},"●京都市●"]
[{"$nulls":48},"③","４欄は、該当するチェックボックスに「レ」マークを入れてください。なお、建築物の敷地が防火",{"$nulls":31},"土台，柱，はり及び筋かいを金物等により接合する工事の工程"]
["【6.道路】",{"$nulls":48},"地域、準防火地域又は指定のない区域のうち２以上の地域又は区域にわたるときは、それぞれ",{"$nulls":31},"木材で組まれた枠組みを設置する工事の過程"]
[null,"【イ.幅員】",{"$nulls":18},"ｍ",{"$nulls":12},"←","4ｍ未満の2項道路の場合4.000ｍと記載",{"$nulls":14},"の地域又は区域について記入してください。",{"$nulls":31},"基礎又は地中はりの配筋工事の工程"]
[null,"【ロ.敷地と接している部分の長さ】",{"$nulls":18},"ｍ",{"$nulls":27},"④","５欄は、建築物の敷地が存する３欄及び４欄に掲げる区域及び地域以外の区域、地域、地区",{"$nulls":31},"最初の床版を取り付ける工事の工程"]
["【7.敷地面積】",{"$nulls":48},"又は街区を記入してください。なお、建築物の敷地が２以上の区域、地域、地区又は街区にわ",{"$nulls":31},"2階の床及びこれを支持するはりに鉄筋を配置する工事の工程"]
[null,"【イ.敷地面積】",{"$nulls":5},"（1）","（",{"$nulls":3},"㎡","）","（",{"$nulls":3},{"$f":"IF(P15=\"\",\"\",\"㎡\")","v":""},"）","（",{"$nulls":3},{"$f":"IF(V15=\"\",\"\",\"㎡\")","v":""},"）","（",{"$nulls":3},{"$f":"IF(AB15=\"\",\"\",\"㎡\")","v":""},"）",{"$nulls":17},"たる場合は、それぞれの区域、地域、地区又は街区を記入してください。",{"$nulls":31},"●宇治市●"]
[{"$nulls":7},"（2）","（",{"$nulls":3},{"$f":"IF(J16=\"\",\"\",\"㎡\")","v":""},"）","（",{"$nulls":3},{"$f":"IF(P16=\"\",\"\",\"㎡\")","v":""},"）","（",{"$nulls":3},{"$f":"IF(V16=\"\",\"\",\"㎡\")","v":""},"）","（",{"$nulls":3},{"$f":"IF(AB16=\"\",\"\",\"㎡\")","v":""},"）",{"$nulls":16},"⑤","６欄は、建築物の敷地が２メートル以上接している道路のうち最も幅員の大きなものについて記",{"$nulls":31},"木造の軸組を金物等により接合する工事の工程"]
[null,"【ロ.用途地域等】",{"$nulls":6},"（",{"$nulls":4},"）","（",{"$nulls":4},"）","（",{"$nulls":4},"）","（",{"$nulls":4},"）",{"$nulls":17},"入してください。",{"$nulls":31},"木材で組まれた枠組を設置する工事の工程"]
[null,"【ハ.建築基準法第52条第１項及び第２項の規定による建築物の容積率】",{"$nulls":46},"⑥","７欄の「イ」(1)は、建築物の敷地が、２以上の用途地域若しくは高層住居誘導地区、建築基準",{"$nulls":31},"2階の床の配筋工事の工程"]
[{"$nulls":8},"（",{"$nulls":3},"％","）","（",{"$nulls":3},{"$f":"IF(P19=\"\",\"\",\"％\")","v":""},"）","（",{"$nulls":3},{"$f":"IF(V19=\"\",\"\",\"％\")","v":""},"）","（",{"$nulls":3},{"$f":"IF(AB19=\"\",\"\",\"％\")","v":""},"）",null,"←","道路幅員による制限も考慮",{"$nulls":14},"法第52条第１項第１号から第６号までに規定する容積率の異なる地域、地区若しくは区域又は",{"$nulls":31},"2階のはりおよび床版の取付け工事の工程"]
[null,"【ニ.建築基準法第53条第１項の規定による建築物の建蔽率】",{"$nulls":47},"同法第53条第１項第１号から第６号までに規定する建蔽率若しくは高層住居誘導地区に関す",{"$nulls":31},"屋根床版の配筋工事または建方工事の工程"]
[{"$nulls":8},"（",{"$nulls":3},"％","）","（",{"$nulls":3},{"$f":"IF(P21=\"\",\"\",\"％\")","v":""},"）","（",{"$nulls":3},{"$f":"IF(V21=\"\",\"\",\"％\")","v":""},"）","（",{"$nulls":3},{"$f":"IF(AB21=\"\",\"\",\"％\")","v":""},"）",{"$nulls":17},"る都市計画において定められた建築物の建蔽率の最高限度の異なる地域、地区若しくは区",{"$nulls":31},"●京都府●"]
[null,"【ホ.敷地面積の合計】",{"$nulls":9},"（1）",{"$f":"IF(J15=\"\",\"\",J15+P15+V15+AB15)","v":""},{"$nulls":4},"㎡",{"$nulls":31},"域（以下「用途地域が異なる地域等」という。）にわたる場合においては、用途地域が異なる地",{"$nulls":31},"木造の軸組を金物等により接合する工事の工程"]
[{"$nulls":11},"（2）",{"$f":"IF(J16=\"\",\"\",J16+P16+V16+AB16)","v":""},{"$nulls":4},{"$f":"IF(M23=\"\",\"\",\"㎡\")","v":""},{"$nulls":16},"参考：加重平均による計算（（1）のみ）",{"$nulls":14},"域等ごとに、それぞれの用途地域が異なる地域等に対応する敷地の面積を記入してください。",{"$nulls":31},"耐力壁の設置工事の工程"]
[null,"【ヘ.敷地に建築可能な延べ面積を敷地面積で除した数値】",{"$nulls":26},{"$f":"IF(X24=\"\",\"\",\"％\")","v":""},{"$nulls":5},"ヘ欄",null,null,{"$f":"IF(M22=\"\",\"\",(J15*J19+P15*P19+V15*V19+AB15*AB19)/M22)","v":""},{"$nulls":4},"％",{"$nulls":6},"「イ」(2)は、同法第52条第12項の規定を適用する場合において、同条第13項の規定に基づき、",{"$nulls":31},"２階の床及びこれを支持するはりの配筋工事の工程"]
[null,"【ト.敷地に建築可能な建築面積を敷地面積で除した数値】",{"$nulls":26},{"$f":"IF(X25=\"\",\"\",\"％\")","v":""},{"$nulls":5},"ト欄",null,null,{"$f":"IF(M22=\"\",\"\",(J15*J21+P15*P21+V15*V21+AB15*AB21)/M22)","v":""},{"$nulls":4},"％",{"$nulls":6},"「イ」(1)で記入した敷地面積に対応する敷地の部分について、建築物の敷地のうち前面道路と",{"$nulls":31},"２階のはり及び床版の取付け工事の工程"]
[null,"【チ.備考】",{"$nulls":47},"壁面線又は壁面の位置の制限として定められた限度の線との間の部分を除いた敷地の面積を",{"$nulls":31},"屋根床版の配筋工事又は建方工事の工程"]
["【8.主要用途】",{"$nulls":5},"( 区分",{"$nulls":5},")",{"$nulls":20},"←","申請敷地の主たる用途",{"$nulls":14},"記入してください。",{"$nulls":31},"●大阪府・奈良県は直接入力してください●"]
["【9.工事種別】",{"$nulls":47},"⑦","７欄の「ロ」、「ハ」及び「ニ」は、「イ」に記入した敷地面積に対応する敷地の部分について、"]
[null,"□","新築",null,"□","増築",null,"□","改築",null,"□","移転",null,"□","用途変更",{"$nulls":3},"□","大規模の修繕",{"$nulls":4},"□","大規模の模様替",{"$nulls":23},"それぞれ記入してください。",{"$nulls":31},"大阪・奈良業務エリア特定行政庁"]
["【10.建築面積】",{"$nulls":10},"（","申請部分",{"$nulls":4},"）","（","申請以外の部分",{"$nulls":4},"）","（","合計",{"$nulls":4},"）",{"$nulls":16},"⑧","７欄の「ホ」(1)は、「イ」(1)の合計とし、「ホ」(2)は、「イ」(2)の合計とします。",{"$nulls":31},"大阪市"]
[null,"【イ.建築面積】",{"$nulls":9},"（",{"$nulls":4},"㎡","）","（",{"$nulls":4},{"$f":"IF(T31=\"\",\"\",\"㎡\")","v":""},"）","（",{"$f":"IF(M31+T31=0,\"\",M31+T31)","v":""},{"$nulls":3},"㎡","）",{"$nulls":16},"⑨","建築物の敷地が、建築基準法第52条第７項若しくは第９項に該当する場合又は同条第８項若",{"$nulls":31},"豊中市"]
[null,"【ロ.建蔽率】",{"$nulls":14},{"$f":"IF(AA31=\"\",\"\",ROUNDUP(AA31/M22*100,2))","v":""},{"$nulls":6},"％",{"$nulls":25},"しくは第12項の規定が適用される場合においては、７欄の「ヘ」に、同条第７項若しくは第９項",{"$nulls":31},"東大阪市"]
["【11.延べ面積】",{"$nulls":10},"（","申請部分",{"$nulls":4},"）","（","申請以外の部分",{"$nulls":4},"）","（","合計",{"$nulls":4},"）",{"$nulls":17},"の規定に基づき定められる当該建築物の容積率又は同条第８項若しくは第12項の規定が適",{"$nulls":31},"吹田市"]
[null,"【イ.建築物全体】",{"$nulls":9},"（",{"$nulls":4},"㎡","）","（",{"$nulls":4},{"$f":"IF(T34=\"\",\"\",\"㎡\")","v":""},"）","（",{"$f":"IF(M34+T34=0,\"\",M34+T34)","v":""},{"$nulls":3},"㎡","）",{"$nulls":17},"用される場合における当該建築物の容積率を記入してください。",{"$nulls":31},"高槻市"]
[null,"【ロ.地階の住宅又は老人ホーム、福祉ホームその他これらに類するものの部分】",{"$nulls":46},"⑩","建築物の敷地について、建築基準法第57条の２第４項の規定により現に特例容積率の限度が",{"$nulls":31},"守口市"]
[{"$nulls":11},"（",{"$nulls":4},{"$f":"IF(M36=\"\",\"\",\"㎡\")","v":""},"）","（",{"$nulls":4},{"$f":"IF(T36=\"\",\"\",\"㎡\")","v":""},"）","（",{"$f":"IF(M36+T36=0,\"\",M36+T36)","v":""},{"$nulls":3},{"$f":"IF(AA36=\"\",\"\",\"㎡\")","v":""},"）",{"$nulls":17},"公告されているときは、７欄の「チ」にその旨及び当該特例容積率の限度を記入してください。",{"$nulls":31},"枚方市"]
[null,"【ハ.エレベーターの昇降路の部分】",{"$nulls":46},"⑪","建築物の敷地が建築基準法第53条第２項若しくは同法第57条の５第２項に該当する場合又は",{"$nulls":31},"八尾市"]
[{"$nulls":11},"（",{"$nulls":4},{"$f":"IF(M38=\"\",\"\",\"㎡\")","v":""},"）","（",{"$nulls":4},{"$f":"IF(T38=\"\",\"\",\"㎡\")","v":""},"）","（",{"$f":"IF(M38+T38=0,\"\",M38+T38)","v":""},{"$nulls":3},{"$f":"IF(AA38=\"\",\"\",\"㎡\")","v":""},"）",{"$nulls":17},"建築物が同法第53条第３項、第５項若しくは第６項に該当する場合においては、７欄の「ト」に、",{"$nulls":31},"寝屋川市"]
[null,"【ニ.共同住宅の共用の廊下等の部分】",{"$nulls":47},"同条第２項、第３項、第５項又は第６項の規定に基づき定められる当該建築物の建蔽率を記入",{"$nulls":31},"茨木市"]
[{"$nulls":11},"（",{"$nulls":4},{"$f":"IF(M40=\"\",\"\",\"㎡\")","v":""},"）","（",{"$nulls":4},{"$f":"IF(T40=\"\",\"\",\"㎡\")","v":""},"）","（",{"$f":"IF(M40+T40=0,\"\",M40+T40)","v":""},{"$nulls":3},{"$f":"IF(AA40=\"\",\"\",\"㎡\")","v":""},"）",{"$nulls":17},"してください。",{"$nulls":31},"箕面市"]
[null,"【ホ.自動車車庫等の部分】",{"$nulls":9},"（",{"$nulls":4},{"$f":"IF(M41=\"\",\"\",\"㎡\")","v":""},"）","（",{"$nulls":4},{"$f":"IF(T41=\"\",\"\",\"㎡\")","v":""},"）","（",{"$f":"IF(M41+T41=0,\"\",M41+T41)","v":""},{"$nulls":3},{"$f":"IF(AA41=\"\",\"\",\"㎡\")","v":""},"）",{"$nulls":16},"⑫","８欄は、別紙の表の用途の区分に従い対応する記号を記入した上で、主要用途をできるだけ",{"$nulls":31},"門真市"]
[null,"【ヘ.備蓄倉庫の部分】",{"$nulls":9},"（",{"$nulls":4},{"$f":"IF(M42=\"\",\"\",\"㎡\")","v":""},"）","（",{"$nulls":4},{"$f":"IF(T42=\"\",\"\",\"㎡\")","v":""},"）","（",{"$f":"IF(M42+T42=0,\"\",M42+T42)","v":""},{"$nulls":3},{"$f":"IF(AA42=\"\",\"\",\"㎡\")","v":""},"）",{"$nulls":17},"具体的に記入してください。",{"$nulls":31},"池田市"]
[null,"【ト.蓄電池の設置部分】",{"$nulls":9},"（",{"$nulls":4},{"$f":"IF(M43=\"\",\"\",\"㎡\")","v":""},"）","（",{"$nulls":4},{"$f":"IF(T43=\"\",\"\",\"㎡\")","v":""},"）","（",{"$f":"IF(M43+T43=0,\"\",M43+T43)","v":""},{"$nulls":3},{"$f":"IF(AA43=\"\",\"\",\"㎡\")","v":""},"）",{"$nulls":16},"⑬","９欄は、該当するチェックボックスに「レ」マークを入れてください。",{"$nulls":31},"大阪府"]
[null,"【チ.自家発電設備の設置部分】",{"$nulls":46},"⑭","都市計画区域内、準都市計画区域内及び建築基準法第６８条の９第１項の規定に基づく条例",{"$nulls":31},"奈良市"]
[{"$nulls":11},"（",{"$nulls":4},{"$f":"IF(M45=\"\",\"\",\"㎡\")","v":""},"）","（",{"$nulls":4},{"$f":"IF(T45=\"\",\"\",\"㎡\")","v":""},"）","（",{"$f":"IF(M45+T45=0,\"\",M45+T45)","v":""},{"$nulls":3},{"$f":"IF(AA45=\"\",\"\",\"㎡\")","v":""},"）",{"$nulls":17},"により建築物の容積率の最高限度が定められた区域内においては、１１欄の「ロ」に建築物の地",{"$nulls":31},"生駒市"]
[null,"【リ.貯水槽の設置部分】",{"$nulls":9},"（",{"$nulls":4},{"$f":"IF(M46=\"\",\"\",\"㎡\")","v":""},"）","（",{"$nulls":4},{"$f":"IF(T46=\"\",\"\",\"㎡\")","v":""},"）","（",{"$f":"IF(M46+T46=0,\"\",M46+T46)","v":""},{"$nulls":3},{"$f":"IF(AA46=\"\",\"\",\"㎡\")","v":""},"）",{"$nulls":17},"階でその天井が地盤面からの高さ１メートル以下にあるものの住宅又は老人ホーム、福祉ホーム",{"$nulls":31},"橿原市"]
[null,"【ヌ.宅配ボックスの設置部分】",{"$nulls":9},"（",{"$nulls":4},{"$f":"IF(M47=\"\",\"\",\"㎡\")","v":""},"）","（",{"$nulls":4},{"$f":"IF(T47=\"\",\"\",\"㎡\")","v":""},"）","（",{"$f":"IF(M47+T47=0,\"\",M47+T47)","v":""},{"$nulls":3},{"$f":"IF(AA47=\"\",\"\",\"㎡\")","v":""},"）",{"$nulls":17},"その他これらに類するものの用途に供する部分、「ハ」にエレベーターの昇降路の部分、「ニ」に",{"$nulls":31},"奈良県"]
[null,"【ル.住宅の部分】",{"$nulls":9},"（",{"$nulls":4},{"$f":"IF(M48=\"\",\"\",\"㎡\")","v":""},"）","（",{"$nulls":4},{"$f":"IF(T48=\"\",\"\",\"㎡\")","v":""},"）","（",{"$f":"IF(M48+T48=0,\"\",M48+T48)","v":""},{"$nulls":3},{"$f":"IF(AA48=\"\",\"\",\"㎡\")","v":""},"）",{"$nulls":17},"「ニ」に共同住宅又は老人ホーム、福祉ホームその他これらに類するものの共用の廊下又は階"]
[null,"【ヲ.老人ホーム、福祉ホームその他これらに類するものの部分】",{"$nulls":47},"段の用に供する部分、「ホ」に自動車車庫その他の専ら自動車又は自転車の停留又は駐車の"]
[{"$nulls":11},"（",{"$nulls":4},{"$f":"IF(M50=\"\",\"\",\"㎡\")","v":""},"）","（",{"$nulls":4},{"$f":"IF(T50=\"\",\"\",\"㎡\")","v":""},"）","（",{"$f":"IF(M50+T50=0,\"\",M50+T50)","v":""},{"$nulls":3},{"$f":"IF(AA50=\"\",\"\",\"㎡\")","v":""},"）",{"$nulls":17},"ための施設（誘導車路、操車場所及び乗降場を含む。）の用途に供する部分、「ヘ」に専ら防災"]
[null,"【ワ.延べ面積】",{"$nulls":21},"㎡",{"$nulls":25},"のために設ける備蓄倉庫の用途に供する部分、「ト」に蓄電池（床に据え付けるものに限る。）を"]
[null,"【カ.容積率】",{"$nulls":14},{"$f":"IF(M51=\"\",\"\",ROUNDUP(AA51/M39*100,2))","v":""},{"$f":"IF(AA34=\"\",\"\",ROUNDUP(R51/M22*100,2))","v":""},{"$nulls":5},"％",{"$nulls":25},"設ける部分、「チ」に自家発電設備を設ける部分、「リ」に貯水槽を設ける部分、「ヌ」に宅配ボッ"]
["【12.建築物の数】",{"$nulls":48},"クス（配達された物品（荷受人が不在その他の事由により受け取ることができないものに限る。）の"]
[null,"【イ.申請に係る建築物の数】",{"$nulls":31},"←","10㎡以下の建物の数は含まない",{"$nulls":14},"供する部分、「ヲ」に老人ホーム、福祉ホームその他これらに類するものの用途に供する部分のそ"]
[null,"【ロ.同一敷地内の他の建築物の数】",{"$nulls":32},"10㎡以下の建物について【18.その他】欄に記入",{"$nulls":14},"れぞれの床面積を記入してください。"]
["【13.建築物の高さ等】",{"$nulls":9},"（","申請に係る建築物",{"$nulls":4},"）","（","他の建築物",{"$nulls":4},"）",{"$nulls":24},"⑮","住宅又は老人ホーム、福祉ホームその他これらに類するものについては、１１欄の「ロ」の床面"]
[null,"【イ.最高の高さ】",{"$nulls":8},"（",{"$nulls":4},"ｍ","）","（",{"$nulls":4},{"$f":"IF(S57=\"\",\"\",\"ｍ\")","v":""},"）",{"$nulls":25},"積は、その地階の住宅又は老人ホーム、福祉ホームその他これらに類するものの用途に供する"]
[null,"【ロ.階数】",{"$nulls":6},"地上",null,"（",{"$nulls":5},"）","（",{"$nulls":5},"）",{"$nulls":25},"部分の床面積から、その地階のエレベーターの昇降路の部分又は共同住宅若しくは老人ホーム、"]
[{"$nulls":8},"地下",null,"（",{"$nulls":5},"）","（",{"$nulls":5},"）",{"$nulls":25},"福祉ホームその他これらに類するものの共用の廊下若しくは階段の用に供する部分の床面積を除"]
[null,"【ハ.構造】",{"$nulls":16},"一部",{"$nulls":30},"いた面積とします。"]
[null,"【ニ.建築基準法第56条第7項の規定による特例の適用の有無】",{"$nulls":20},"□","有",null,"□","無",{"$nulls":6},"←","天空率適用の有無",{"$nulls":13},"⑯","１１欄の「ワ」の延べ面積及び「カ」の容積率の算定の基礎となる延べ面積は、各階の床面積の"]
[null,"【ホ.適用があるときは、特例の区分】",{"$nulls":47},"合計から「ロ」に記入した床面積（この面積が敷地内の建築物の住宅及び老人ホーム、福祉ホー"]
[{"$nulls":3},"□","道路高さ制限不適用",{"$nulls":7},"□","隣地高さ制限不適用",{"$nulls":7},"□","北側高さ制限不適用",{"$nulls":26},"ムその他これらに類するものの用途に供する部分（エレベーターの昇降路の部分又は共同住宅"]
["【14.許可・認定等】",{"$nulls":48},"若しくは老人ホーム、福祉ホームその他これらに類するものの共用の廊下若しくは階段の用に供"]
[{"$nulls":49},"する部分を除く。）の床面積の合計の３分の１を超える場合においては、敷地内の建築物の住宅"]
[{"$nulls":49},"及び老人ホーム、福祉ホームその他これらに類するものの用途に供する部分（エレベーターの昇"]
[{"$nulls":49},"降路の部分又は共同住宅若しくは老人ホーム、福祉ホームその他これらに類するものの共用の"]
[{"$nulls":49},"廊下若しくは階段の用に供する部分を除く。）の床面積の合計の３分の１の面積）、「ハ」及び「ニ」"]
["【15.工事着手予定年月日】",{"$nulls":10},"令和",{"$nulls":3},"年",null,null,"月",null,null,"日",{"$nulls":27},"に記入した床面積並びに「ホ」から「ヌ」までに記入した床面積（これらの面積が、次の(1)から(6)ま"]
["【16.工事完了予定年月日】",{"$nulls":10},"令和",{"$nulls":3},"年",null,null,"月",null,null,"日",{"$nulls":27},"でに掲げる建築物の部分の区分に応じ、敷地内の建築物の各階の床面積の合計にそれぞれ(1)"]
["【17.特定工程工事終了予定年月日】",{"$nulls":15},"（特定工程）",{"$nulls":32},"から(6)までに定める割合を乗じて得た面積を超える場合においては、敷地内の建築物の各階の"]
[null,null,"（ 第",null,null,"回 ）",null,"令和",null,null,"年",null,"月",null,"日","（",{"$nulls":15},"）",null,"←","特定行政庁により特定工程名称が異なります",{"$nulls":14},"床面積の合計にそれぞれ(1)から(5)までに定める割合を乗じて得た面積）を除いた面積とします。"]
[null,null,"（ 第",null,null,"回 ）",null,"令和",null,null,"年",null,"月",null,"日","（",{"$nulls":15},"）",null,null,"京都府（京都市、宇治市除く）の特定工程",{"$nulls":14},"また、建築基準法第５２条第１２項の規定を適用する場合においては、「カ」の容積率の算定の基"]
[null,null,"（ 第",null,null,"回 ）",null,"令和",null,null,"年",null,"月",null,"日","（",{"$nulls":15},"）",null,null,"名称がＨ28年６月より改正されております",{"$nulls":14},"礎となる敷地面積は、７欄「ホ」(2)によることとします。"]
["【18.その他必要な事項】",{"$nulls":48},"(1)　自動車車庫等の部分　５分の１"]
[{"$nulls":49},"(2)　備蓄倉庫の部分　50分の１"]
[{"$nulls":49},"(3)　蓄電池の設置部分　50分の１"]
[{"$nulls":49},"(4)　自家発電設備の設置部分　100分の１"]
["【19.備考】",{"$nulls":48},"(5)　貯水槽の設置部分　100分の１"]
[{"$nulls":33},"←","計画変更の場合、第三面に係る部分の",{"$nulls":14},"(6)  宅配ボックスの設置部分　100分の1"]
[{"$nulls":34},"【計画変更の概要】",{"$nulls":5},"記入",{"$nulls":7},"⑰","12欄の建築物の数は、延べ面積が10平方メートルを超えるものについて記入してください。"]
[{"$nulls":48},"⑱","13欄の「イ」及び「ロ」は、申請に係る建築物又は同一敷地内の他の建築物がそれぞれ２以上"]
[{"$nulls":49},"ある場合においては、最大のものを記入してください。"]
[{"$nulls":48},"⑲","13欄の「ハ」は、敷地内の建築物の主たる構造について記入してください。"]
[{"$nulls":48},"⑳","13欄の「ニ」は、該当するチェックボックスに「レ」マークを入れてください。"]
[{"$nulls":48},"㉑","13欄の「ホ」は、建築基準法第56条第７項第１号に掲げる規定が適用されない建築物について"]
[{"$nulls":49},"は「道路高さ制限不適用」、同項第２号に掲げる規定が適用されない建築物については「隣地"]
[{"$nulls":49},"高さ制限不適用」、同項第３号に掲げる規定が適用されない建築物については「北側高さ制限"]
[{"$nulls":49},"不適用」のチェックボックスに「レ」マークを入れてください。"]
[{"$nulls":48},"㉒","建築物及びその敷地に関して許可・認定等を受けた場合には、根拠となる法令及びその条"]
[{"$nulls":49},"項、当該許可・認定等の番号並びに許可・認定等を受けた日付について14欄又は別紙に記"]
[{"$nulls":49},"載して添えてください。"]
[{"$nulls":48},"㉓","７欄の「ハ」、「ニ」、「ヘ」及び「ト」、10欄の「ロ」並びに11欄の「カ」は、百分率を用いてください。"]
[{"$nulls":48},"㉔","建築基準法第86条の７又は同法第86条の８の規定の適用を受ける場合においては、工事の"]
[{"$nulls":49},"完了後においても引き続き同法第３条第２項（同法第86条の９第１項において準用する場合"]
[{"$nulls":49},"を含む。）の適用を受けない規定並びに当該規定に適合しないこととなった時期及び理由を"]
[{"$nulls":49},"18欄又は別紙に記載して添えてください。"]
[{"$nulls":48},"㉕","ここに書き表せない事項で特に確認を受けようとする事項は、18欄又は別紙に記載して添え"]
[{"$nulls":49},"てください。"]
[{"$nulls":48},"㉖","計画の変更申請の際は、19欄に第三面に係る部分の変更の概要について記入してください。"]
[]
[]
[]
[]
[null,"滋賀県",{"$nulls":3},"下水道処理区域",{"$nulls":7},"角地緩和",{"$nulls":5},"08010",{"$nulls":5},"造",{"$nulls":6},"住宅用火災警報器設置"]
[null,"京都府",{"$nulls":11},"加重平均",{"$nulls":11},"木造"]
[null,"大阪府",{"$nulls":3},"（法43条ただし書き）",{"$nulls":7},"風致地区による",{"$nulls":5},"一戸建ての住宅",{"$nulls":5},"木造（枠組壁工法）"]
[null,"奈良県",{"$nulls":23},"鉄骨造"]
[{"$nulls":25},"鉄筋コンクリート造"]
[{"$nulls":25},"壁式鉄筋コンクリート造"]
[null,"入力規則"]
[null,"第一種低層",{"$nulls":23},"一部"]
[null,"第二種低層"]
[null,"第一種中高層"]
[null,"第二種中高層"]
[null,"第一種住居"]
[null,"第二種住居"]
[null,"準住居地域"]
[null,"田園住居地域"]
[null,"近隣商業地域"]
[null,"商業地域"]
[null,"準工業地域"]
[null,"工業地域"]
[null,"工業専用地域"]
[null,"指定無し"]

{"sheet":"申四面","index":5,"n_rows":68,"n_cols":49,"rows_kept":68,"merged":[[2,8,2,10],[2,11,2,30],[3,8,3,10],[3,12,3,30],[4,8,4,10],[4,12,4,30],[5,8,5,10],[5,12,5,30],[6,8,6,10],[6,12,6,30],[7,8,7,10],[7,12,7,30],[10,5,10,13],[10,15,10,16],[10,17,10,25],[14,12,14,13],[15,12,15,13],[16,12,16,13],[17,12,17,13],[19,10,19,13],[20,10,20,13],[21,8,21,31],[26,22,26,26],[27,14,27,21],[30,14,30,21],[31,11,31,15],[31,18,31,22],[31,25,31,29],[32,6,32,7],[32,11,32,14],[32,18,32,21],[32,25,32,28],[33,6,33,7],[33,11,33,14],[33,18,33,21],[33,25,33,28],[34,6,34,7],[34,11,34,14],[34,18,34,21],[34,25,34,28],[35,6,35,7],[35,11,35,14],[35,18,35,21],[35,25,35,28],[36,6,36,7],[36,11,36,14],[36,18,36,21],[36,25,36,28],[37,6,37,7],[37,11,37,14],[37,18,37,21],[37,25,37,28],[38,11,38,14],[38,18,38,21],[38,25,38,28],[39,5,39,31],[40,5,40,31],[41,5,41,31],[42,9,42,31],[43,9,43,31],[44,9,44,31],[45,5,45,31],[46,1,46,31]]}
["（第四面）",{"$nulls":46},"シートの保護を解除すると編集が可能になります（パスワードなし）"]
["建築物別概要",{"$nulls":46},"（注意）第四面"]
["【1.番号】",{"$nulls":46},"①","この書類は、申請建築物ごと（延べ面積が10平方メートル以内のものを除く。以下同じ。）"]
["【2.用途】",{"$nulls":4},"（ 区分",{"$nulls":5},"）",{"$nulls":36},"に作成してください。"]
[{"$nulls":5},"（ 区分",{"$nulls":5},"）",{"$nulls":35},"②","この書類に記載する事項のうち、10欄から15欄までの事項については、別紙に明示して添"]
[{"$nulls":5},"（ 区分",{"$nulls":5},"）",{"$nulls":36},"付すれば記載する必要はありません。"]
[{"$nulls":5},"（ 区分",{"$nulls":5},"）",{"$nulls":35},"③","１欄は、建築物の数が１のときは「１」と記入し、建築物の数が２以上のときは、申請建築物"]
[{"$nulls":5},"（ 区分",{"$nulls":5},"）",{"$nulls":36},"ごとに通し番号を付し、その番号を記入してください。"]
["【3.工事種別】",{"$nulls":46},"④","２欄は、別紙の表の用途の区分に従い対応する記号を記入した上で、用途をできるだけ具"]
[null,null,"□","新築",null,"□","増築",null,"□","改築",null,"□","移転",null,"□","用途変更",null,null,"□","大規模の修繕",{"$nulls":4},"□","大規模の模様替",{"$nulls":22},"体的に書いてください。"]
["【4.構造】",{"$nulls":4},"造",{"$nulls":41},"⑤","３欄は、該当するチェックボックスに「レ」マークを入れてください。"]
["【5.耐火建築物】",{"$nulls":5},"□","耐火建築物",{"$nulls":3},"□","準耐火建築物（ｲ-1）",{"$nulls":5},"□","準耐火建築物（ｲ-2）",{"$nulls":5},"□","準耐火建築物（ﾛ-1）",{"$nulls":20},"⑥","５欄は、「耐火建築物」、「準耐火建築物（イ-１）」（建築基準法第２条第９号の３イに規定す"]
[{"$nulls":4},"□","準耐火建築物（ﾛ-2）",{"$nulls":5},"□","耐火構造建築物",{"$nulls":4},"□","特定避難時間倒壊等防止建築物",{"$nulls":9},"□","その他",{"$nulls":3},"←","法第27条第1項の規定に適合する特殊",{"$nulls":13},"る準耐火建築物で、同法施行令第１２９条の２の３第１項第１号ロに掲げる技術的基準に適"]
["【6.階数】",{"$nulls":33},"建築物の場合、耐火構造建築物もしくは",{"$nulls":13},"合するものをいう。）、「準耐火建築物（イ-２）」（同法第２条第９号の３イに規定する準耐火"]
[null,"【イ.地階を除く階数】",{"$nulls":12},"階",{"$nulls":19},"特定避難時間倒壊等防止建築物にチェック",{"$nulls":13},"建築物（準耐火建築物（イ-１）に該当するものを除く。）をいう。）「準耐火建築物（ロ-１）」"]
[null,"【ロ.地階の階数】",{"$nulls":12},{"$f":"IF(M16=\"\",\"\",\"階\")","v":""},{"$nulls":33},"（同法施行令第１０９条の３第１号に掲げる技術的基準に適合する準耐火建築物をいう。）、"]
[null,"【ハ.昇降機塔等の階の数】",{"$nulls":12},{"$f":"IF(M17=\"\",\"\",\"階\")","v":""},{"$nulls":33},"「準耐火建築物（ロ-２）」（同条第２号に掲げる技術的基準に適合する準耐火建築物をい"]
[null,"【ニ.地階の倉庫等の階の数】",{"$nulls":12},{"$f":"IF(M18=\"\",\"\",\"階\")","v":""},{"$nulls":33},"う。）、「耐火構造建築物」（同法第２７条第１項の規定に適合する特殊建築物（特定避難時"]
["【7.高さ】",{"$nulls":47},"間倒壊等防止建築物を除く。）をいう。）、「特定避難時間倒壊等防止建築物」又は「その他」"]
[null,"【イ.最高の高さ】",{"$nulls":12},"ｍ",{"$nulls":33},"のうち該当するチェックボックス全てに「レ」マークを入れてください。"]
[null,"【ロ.最高の軒の高さ】",{"$nulls":12},"ｍ",{"$nulls":32},"⑦","６欄の「ハ」は、建築基準法施行令第２条第１項第８号により階数に算入されない建築物"]
["【8.建築設備の種類】",{"$nulls":47},"の部分のうち昇降機塔、装飾塔、物見塔その他これらに類する建築物の屋上部分の階の"]
["【9.確認の特例】",{"$nulls":47},"数を記入してください。"]
[null,"【イ.建築基準法第６条の３第１項ただし書又は法第18条第４項ただし書の規定による審査の特例",{"$nulls":31},"←","構造計算ルート2の特例を受ける場合",{"$nulls":12},"⑧","６欄の「ニ」は、建築基準法施行令第２条第１項第８号により階数に算入されない建築物の"]
[null,"　　の適用の有無】",{"$nulls":16},"□","有",null,"□","無",{"$nulls":25},"部分のうち地階の倉庫、機械室その他これらに類する建築物の部分の階の数を記入して"]
[null,"【ロ.建築基準法第６条の４第１項の規定による確認の特例の適用の有無】",{"$nulls":23},"□","有",null,"□","無",{"$nulls":3},"←","2015/6/1改正以前の法6条の3第1項",{"$nulls":13},"ください。"]
[null,"【ハ.建築基準法施行令第10条各号に掲げる建築物の区分】",{"$nulls":19},"第",{"$nulls":5},"号",{"$nulls":6},"確認の特例はこちら",{"$nulls":12},"⑨","８欄は、別紙にその概要を記載して添えてください。ただし、当該建築設備が特定の建築"]
[null,"【ニ.認定型式の認定番号】",{"$nulls":11},"第",{"$nulls":8},"号",{"$nulls":25},"基準関係規定に適合していることを証する書面を添える場合には、当該建築基準関係規"]
[null,"【ホ.適合する一連の規定の区分】",{"$nulls":11},"□","建築基準法施行令第136条の2の11第一号イ",{"$nulls":33},"定に係る内容を概要として記載する必要はありません。"]
[{"$nulls":13},"□","建築基準法施行令第136条の2の11第一号ロ",{"$nulls":32},"⑩","９欄の「イ」及び「ロ」は、該当するチェックボックスに「レ」マークを入れてください。"]
[null,"【ヘ.認証型式部材等の認証番号】",{"$nulls":11},"第",{"$nulls":8},"号",{"$nulls":24},"⑪","９欄の「ハ」は、建築基準法第6条の4第1項の規定による確認の特例の適用がある場合に、"]
["【10.床面積】",{"$nulls":9},"（","申請部分",{"$nulls":4},"）","（","申請以外の部分",{"$nulls":4},"）","（","合計",{"$nulls":4},"）",{"$nulls":17},"建築基準法施行令第10条各号に掲げる建築物のうち、該当するものの号に数字を記入し"]
[null,"【イ.階別】",{"$nulls":3},"（",null,null,"階）",null,"（",{"$nulls":4},"㎡","）","（",{"$nulls":4},{"$f":"IF(S33=\"\",\"\",\"㎡\")","v":""},"）","（",{"$f":"IF(L33+S33=0,\"\",L33+S33)","v":""},{"$nulls":3},"㎡","）",null,null,"←","最上階から順に",{"$nulls":13},"てください。"]
[{"$nulls":5},"（",null,null,"階）",null,"（",{"$nulls":4},{"$f":"IF(L34=\"\",\"\",\"㎡\")","v":""},"）","（",{"$nulls":4},{"$f":"IF(S34=\"\",\"\",\"㎡\")","v":""},"）","（",{"$f":"IF(L34+S34=0,\"\",L34+S34)","v":""},{"$nulls":3},{"$f":"IF(Z34=\"\",\"\",\"㎡\")","v":""},"）",{"$nulls":16},"⑫","９欄の「ニ」は、建築基準法施行令第10条第一号または第二号に掲げる建築物に該当す"]
[{"$nulls":5},"（",null,null,"階）",null,"（",{"$nulls":4},{"$f":"IF(L35=\"\",\"\",\"㎡\")","v":""},"）","（",{"$nulls":4},"","）","（",{"$f":"IF(L35+S35=0,\"\",L35+S35)","v":""},{"$nulls":3},{"$f":"IF(Z35=\"\",\"\",\"㎡\")","v":""},"）",{"$nulls":17},"る場合にのみ記入してください。また、９欄の「ホ」は、同条第一号に掲げる建築物に該当"]
[{"$nulls":5},"（",null,null,"階）",null,"（",{"$nulls":4},{"$f":"IF(L36=\"\",\"\",\"㎡\")","v":""},"）","（",{"$nulls":4},"","）","（",{"$f":"IF(L36+S36=0,\"\",L36+S36)","v":""},{"$nulls":3},{"$f":"IF(Z36=\"\",\"\",\"㎡\")","v":""},"）",{"$nulls":17},"する場合に、該当するチェックボックスに「レ」マークを入れてください。"]
[{"$nulls":5},"（",null,null,"階）",null,"（",{"$nulls":4},{"$f":"IF(L37=\"\",\"\",\"㎡\")","v":""},"）","（",{"$nulls":4},"","）","（",{"$f":"IF(L37+S37=0,\"\",L37+S37)","v":""},{"$nulls":3},{"$f":"IF(Z37=\"\",\"\",\"㎡\")","v":""},"）",{"$nulls":16},"⑬","９欄の「へ」は、建築基準法第68条の20第1項に掲げる認証型式部材等に該当する場合"]
[{"$nulls":5},"（",null,null,"階）",null,"（",{"$nulls":4},{"$f":"IF(L38=\"\",\"\",\"㎡\")","v":""},"）","（",{"$nulls":4},"","）","（",{"$f":"IF(L38+S38=0,\"\",L38+S38)","v":""},{"$nulls":3},{"$f":"IF(Z38=\"\",\"\",\"㎡\")","v":""},"）",{"$nulls":17},"にのみ記入してください。当該認証番号を記入すれば、第10条の5の4第一号に該当する"]
[null,"【ロ.合計】",{"$nulls":8},"（",{"$f":"IF(SUM(L33:O38)=0,\"\",SUM(L33:O38))","v":""},{"$nulls":3},"㎡","）","（",{"$f":"IF(SUM(S33:V38)=0,\"\",SUM(S33:V38))","v":""},{"$nulls":3},"","）","（",{"$f":"IF(SUM(Z33:AC38)=0,\"\",SUM(Z33:AC38))","v":""},{"$nulls":3},"㎡","）",{"$nulls":17},"認証型式部材等の場合にあっては８欄の概要、９欄の「ニ」（屎尿浄化槽又は合併処理浄"]
["【11.屋根】",{"$nulls":47},"化槽並びに給水タンク又は貯水タンクで屋上又は屋内以外にあるものに係るものを除く。)"]
["【12.外壁】",{"$nulls":32},"←","防火構造等で認定を使う場合は認定の",{"$nulls":13},"並びに１１欄から１４欄まで及び第5面の３欄から６欄までの事項について、同条第二号に該"]
["【13.軒裏】",{"$nulls":33},"内容に適合する屋内側被覆材も記入",{"$nulls":13},"当する認証型式部材等の場合ににあっては９欄の「ニ」（当該認証型式部材等に係るものに"]
["【14.居室の床の高さ】",{"$nulls":47},"限る。）並びに１１欄から１４欄まで及び第5面の３欄から６欄までの事項について、同条第三"]
["【15.便所の種類】",{"$nulls":47},"号に該当する認証型式部材等の場合にあっては８欄の概要及び９欄の「ニ」「当該認証型式"]
["【16.その他必要な事項】",{"$nulls":47},"部材等に係るものに限る。）については記入する必要はありません。"]
["【17.備考】",{"$nulls":32},"←","計画変更の場合第四面に係る部分の",{"$nulls":12},"⑭","10欄の「イ」は、最上階から順に記入してください。記入欄が不足する場合には、別紙に必"]
[{"$nulls":34},"【計画変更の概要】",{"$nulls":6},"記入",{"$nulls":6},"要な事項を記入し添えてください。"]
[{"$nulls":47},"⑮","14欄は、最下階の居室の床が木造である場合に記入してください。"]
[{"$nulls":47},"⑯","15欄は、「水洗」、「くみ取り」又は「くみ取り（改良）」のうち該当するものを記入してください。"]
[{"$nulls":47},"⑰","ここに書き表せない事項で特に確認を受けようとする事項は、16欄又は別紙に記載して添"]
[{"$nulls":48},"えてください。"]
[{"$nulls":47},"⑱","申請建築物が高床式住宅（豪雪地において積雪対策のため通常より床を高くした住宅を"]
[{"$nulls":48},"いう。）である場合には、床面積の算定において床下部分の面積を除くものとし、17欄に、"]
[{"$nulls":48},"高床式住宅である旨及び床下部分の面積を記入してください。"]
[{"$nulls":47},"⑲","計画の変更申請の際は、17欄に第四面に係る部分の変更の概要について記入してくださ"]
[{"$nulls":48},"い。"]
[]
[]
[]
[null,"08010",{"$nulls":5},"造",{"$nulls":8},1,{"$nulls":4},"水洗（公共下水）",{"$nulls":8},"住宅用火災警報器設置"]
[{"$nulls":7},"木造",{"$nulls":8},2,{"$nulls":4},"水洗（農村下水）"]
[null,"一戸建ての住宅",{"$nulls":5},"木造（枠組壁工法）",{"$nulls":8},3,{"$nulls":4},"水洗（合併浄化槽）"]
[{"$nulls":7},"鉄骨造",{"$nulls":8},4,{"$nulls":4},"水洗（団地内浄化槽）"]
[{"$nulls":7},"鉄筋コンクリート造",{"$nulls":13},"くみ取り"]
[{"$nulls":7},"壁式鉄筋コンクリート造",{"$nulls":13},"くみ取り（改良）"]
[]
[{"$nulls":7},"一部"]
[null,"電気、ガス、給水、排水、換気、暖房、冷房、消火、排煙、汚物処理設備、煙突、避雷、昇降機（別途申請）"]

{"sheet":"申五面","index":6,"n_rows":54,"n_cols":48,"rows_kept":54,"merged":[[2,10,2,11],[2,12,2,27],[3,10,3,11],[4,9,4,11],[4,15,4,17],[5,9,5,11],[6,9,6,11],[8,9,8,11],[11,4,11,6],[11,9,11,20],[11,23,11,27],[12,4,12,6],[12,9,12,20],[12,23,12,26],[13,4,13,6],[13,9,13,20],[13,23,13,26],[14,4,14,6],[14,9,14,20],[14,23,14,26],[15,4,15,6],[15,9,15,20],[15,23,15,26],[16,4,16,6],[16,9,16,20],[16,23,16,26],[17,4,17,6],[17,9,17,20],[17,23,17,26],[18,7,18,28],[19,3,19,28],[24,10,24,11],[24,12,24,27],[25,10,25,11],[26,9,26,11],[26,15,26,17],[27,9,27,11],[28,9,28,11],[30,9,30,11],[33,4,33,6],[33,9,33,20],[33,23,33,27],[34,4,34,6],[34,9,34,20],[34,23,34,26],[35,4,35,6],[35,9,35,20],[35,23,35,26],[36,4,36,6],[36,9,36,20],[36,23,36,26],[37,4,37,6],[37,9,37,20],[37,23,37,26],[38,4,38,6],[38,9,38,20],[38,23,38,26],[39,4,39,6],[39,9,39,20],[39,23,39,26],[40,7,40,28],[41,3,41,28]]}
["（第五面）",{"$nulls":45},"シートの保護を解除すると編集が可能になります（パスワードなし）"]
["建築物の階別概要",{"$nulls":45},"（注意）第五面"]
["【1.番号】",{"$nulls":45},"①","この書類に記載すべき事項を別紙に明示して添付すれば、この書類を別途提出する必要は"]
["【2.階】",{"$nulls":11},"階",{"$nulls":34},"ありません。"]
["【3.柱の小径】",{"$nulls":11},"mm",{"$nulls":5},{"$f":"IF(O5=\"\",\"\",M5)","v":""},{"$nulls":27},"②","この書類は、各申請建築物の階ごとに作成してください。ただし、木造の場合は３欄から"]
["【4.横架材間の垂直距離】",{"$nulls":11},"ｍ",{"$nulls":34},"８欄まで、木造以外の場合は５欄から８欄までの記載内容が同じときは、２欄に同じ記載内"]
["【5.階の高さ】",{"$nulls":11},"ｍ",{"$nulls":34},"容となる階を列記し、併せて１枚とすることができます。"]
["【6.居室】",{"$nulls":45},"③","１欄は、第二号様式の第四面の１欄に記入した番号と同じ番号を記入してください。"]
[null,"【ｲ.居室の天井の高さ】",{"$nulls":10},"ｍ",{"$nulls":33},"④","３欄及び４欄は、木造の場合にのみ記入してください。"]
[null,"【ﾛ.建築基準法施行令第39条第3項に規定する特定天井】",{"$nulls":16},"□","有",null,"□","無",{"$nulls":23},"⑤","６欄の「ロ」は、該当するチェックボックスに「レ」マークを入れてください。"]
["【7.用途別床面積】",{"$nulls":45},"⑥","７欄は、別紙の表の用途の区分に従い対応する記号を記入した上で、用途をできるだけ具"]
[{"$nulls":3},"（","用途の区分",null,null,"）","（","具体的な用途の名称",{"$nulls":11},"）","（","床面積",{"$nulls":4},"）",{"$nulls":18},"体的に書き、それぞれの用途に供する部分の床面積を記入してください。"]
[null,"【イ.】",null,"（",{"$nulls":3},"）","（",{"$nulls":12},"）","（",{"$nulls":4},"㎡","）",{"$nulls":17},"⑦","ここに書き表せない事項で特に確認を受けようとする事項は、８欄又は別紙に記載して添"]
[null,"【ロ.】",null,"（",{"$nulls":3},"）","（",{"$nulls":12},"）","（",{"$nulls":4},{"$f":"IF(X14=\"\",\"\",\"㎡\")","v":""},"）",{"$nulls":18},"えてください。"]
[null,"【ハ.】",null,"（",{"$nulls":3},"）","（",{"$nulls":12},"）","（",{"$nulls":4},{"$f":"IF(X15=\"\",\"\",\"㎡\")","v":""},"）",{"$nulls":17},"⑧","計画の変更申請の際は、９欄に第五面に係る部分の変更の概要について記入してください。"]
[null,"【ニ.】",null,"（",{"$nulls":3},"）","（",{"$nulls":12},"）","（",{"$nulls":4},{"$f":"IF(X16=\"\",\"\",\"㎡\")","v":""},"）"]
[null,"【ホ.】",null,"（",{"$nulls":3},"）","（",{"$nulls":12},"）","（",{"$nulls":4},{"$f":"IF(X17=\"\",\"\",\"㎡\")","v":""},"）"]
[null,"【ヘ.】",null,"（",{"$nulls":3},"）","（",{"$nulls":12},"）","（",{"$nulls":4},{"$f":"IF(X18=\"\",\"\",\"㎡\")","v":""},"）"]
["【8.その他必要な事項】"]
["【9.備考】",{"$nulls":29},"←","計画変更の場合第五面に係る部分の"]
[{"$nulls":31},"【計画変更の概要】",{"$nulls":5},"記入"]
[]
["（第五面）"]
["建築物の階別概要"]
["【1.番号】"]
["【2.階】",{"$nulls":11},"階"]
["【3.柱の小径】",{"$nulls":11},"mm",{"$nulls":5},{"$f":"IF(O27=\"\",\"\",M27)","v":""}]
["【4.横架材間の垂直距離】",{"$nulls":11},"ｍ"]
["【5.階の高さ】",{"$nulls":11},"ｍ"]
["【6.居室】"]
[null,"【ｲ.居室の天井の高さ】",{"$nulls":10},"ｍ"]
[null,"【ﾛ.建築基準法施行令第39条第3項に規定する特定天井】",{"$nulls":16},"□","有",null,"□","無"]
["【7.用途別床面積】"]
[{"$nulls":3},"（","用途の区分",null,null,"）","（","具体的な用途の名称",{"$nulls":11},"）","（","床面積",{"$nulls":4},"）"]
[null,"【イ.】",null,"（",{"$nulls":3},"）","（",{"$nulls":12},"）","（",{"$nulls":4},"㎡","）"]
[null,"【ロ.】",null,"（",{"$nulls":3},"）","（",{"$nulls":12},"）","（",{"$nulls":4},{"$f":"IF(X36=\"\",\"\",\"㎡\")","v":""},"）"]
[null,"【ハ.】",null,"（",{"$nulls":3},"）","（",{"$nulls":12},"）","（",{"$nulls":4},{"$f":"IF(X37=\"\",\"\",\"㎡\")","v":""},"）"]
[null,"【ニ.】",null,"（",{"$nulls":3},"）","（",{"$nulls":12},"）","（",{"$nulls":4},{"$f":"IF(X38=\"\",\"\",\"㎡\")","v":""},"）"]
[null,"【ホ.】",null,"（",{"$nulls":3},"）","（",{"$nulls":12},"）","（",{"$nulls":4},{"$f":"IF(X39=\"\",\"\",\"㎡\")","v":""},"）"]
[null,"【ヘ.】",null,"（",{"$nulls":3},"）","（",{"$nulls":12},"）","（",{"$nulls":4},{"$f":"IF(X40=\"\",\"\",\"㎡\")","v":""},"）"]
["【8.その他必要な事項】"]
["【9.備考】",{"$nulls":29},"←","計画変更の場合第五面に係る部分の"]
[{"$nulls":31},"【計画変更の概要】",{"$nulls":5},"記入"]
[]
[]
[]
[]
[]
[]
[null,"×",{"$nulls":3},"08010"]
[]
[null,"ｍ",{"$nulls":3},"一戸建ての住宅"]
[null,"cm"]
[null,"mm"]

{"sheet":"申六面","index":7,"n_rows":44,"n_cols":53,"rows_kept":44,"merged":[[2,10,2,13],[2,14,2,27],[3,10,3,13],[5,10,5,13],[6,10,6,13],[7,10,7,11],[7,12,7,13],[7,17,7,18],[7,19,7,20],[8,6,8,14],[8,16,8,17],[8,18,8,26],[19,5,19,21],[22,9,22,21],[25,3,25,15],[26,4,26,28],[27,1,27,28],[28,1,28,28]]}
["（第六面）"]
["建築物独立部分別概要",{"$nulls":29},"シートの保護を解除すると編集が可能になります（パスワードなし）"]
["【1.番号】",{"$nulls":50},"（注意）第六面"]
["【2.延べ面積】",{"$nulls":13},"㎡",{"$nulls":36},"①","この書類は、申請に係る建築物（建築物の二以上の部分がエキスパンションジョイントそ"]
["【3.建築物の高さ等】",{"$nulls":51},"の他の相互に応力を伝えない構造方法のみで接している場合においては当該建築物の"]
[null,"【イ.最高の高さ】",{"$nulls":12},"ｍ",{"$nulls":37},"部分。以下同じ。）ごとに作成してください。"]
[null,"【ロ.最高の軒の高さ】",{"$nulls":12},"ｍ",{"$nulls":36},"②","１欄は、建築物の数が１のときは「１」と記入し、建築物の数が２以上のときは、申請建築物"]
[null,"【ハ.階数】",{"$nulls":7},"（","地上",{"$nulls":3},"階","）","（","地下",{"$nulls":3},{"$f":"IF(T8=\"\",\"\",\"階\")","v":""},"）",{"$nulls":29},"ごとに通し番号を付し、その番号を記入してください。"]
[null,"【ニ.構造】",{"$nulls":4},"造",{"$nulls":44},"③","２欄及び３欄の「イ」から「ハ」までは、申請に係る建築物について、それぞれ記入してくだ"]
["【4.特定構造計算基準又は特定増改築構造計算基準の別】",{"$nulls":51},"さい。ただし、建築物の数が１のときは記入する必要はありません。"]
[null,null,"□","特定構造計算基準",{"$nulls":47},"④","３欄の「ニ」は、申請に係る建築物の主たる構造について記入してください。ただし、建築"]
[null,null,"□","特定増改築構造計算基準",{"$nulls":48},"物の数が１のときは記入する必要はありません。"]
["【5.構造計算の区分】",{"$nulls":50},"⑤","４欄、５欄及び６欄は、該当するチェックボックスに「レ」マークを入れてください。"]
[null,null,"□","建築基準法施行令第81条第1項各号に掲げる基準に従つた構造計算",{"$nulls":26},"←","時刻歴応答解析",{"$nulls":19},"⑥","６欄の「イ」は、構造計算に用いたプログラムが特定できるよう記載してください。"]
[null,null,"□","建築基準法施行令第81条第2項第1号イに掲げる構造計算",{"$nulls":27},"保有水平耐力計算",{"$nulls":19},"⑦","７欄は、建築基準法施行令第１３７条の２各号に定める基準のうち、該当する基準の号の"]
[null,null,"□","建築基準法施行令第81条第2項第1号ロに掲げる構造計算",{"$nulls":27},"限界耐力計算",{"$nulls":20},"数字及び「イ」又は「ロ」の別を記入してください。"]
[null,null,"□","建築基準法施行令第81条第2項第2号イに掲げる構造計算",{"$nulls":27},"許容応力度等計算（ルート２）",{"$nulls":19},"⑧","計画の変更申請の際は、８欄に第六面に係る部分の変更の概要について記入してくだ"]
[null,null,"□","建築基準法施行令第81条第3項に掲げる構造計算",{"$nulls":27},"許容応力度計算",{"$nulls":20},"さい。"]
["【6.構造計算に用いたプログラム】"]
[null,"【イ.名称】"]
[null,"【ロ.区分】"]
[null,null,"□","建築基準法第20条第1項第2号イ又は第3号イの認定を受けたプログラム"]
[{"$nulls":3},"（","大臣認定番号",{"$nulls":17},"）"]
[null,null,"□","その他のプログラム"]
["【7.建築基準法施行令第137条の2各号に定める基準の区分】"]
[null,null,"（",{"$nulls":13},"）"]
["【8.備考】",{"$nulls":29},"←","計画変更の場合第四面に係る部分の"]
[{"$nulls":31},"【計画変更の概要】",{"$nulls":5},"記入"]
{"$rows_empty":8}
[null,"造"]
[null,"木造"]
[null,"木造（枠組壁工法）"]
[null,"鉄骨造"]
[null,"鉄筋コンクリート造"]
[null,"壁式鉄筋コンクリート造"]
[]
[null,"一部"]

{"sheet":"委任状","index":8,"n_rows":37,"n_cols":27,"rows_kept":37,"merged":[[2,16,2,17],[2,18,2,19],[4,0,4,5],[5,0,5,5],[8,11,8,12],[9,11,9,12],[9,13,9,24],[10,11,10,12],[10,13,10,21],[12,2,12,4],[12,6,12,10],[21,2,21,23],[22,2,22,23],[23,2,23,23],[24,2,24,23],[34,1,34,24],[37,1,37,24]]}
["委　任　状"]
[{"$nulls":26},"シートの保護を解除すると編集が可能になります（パスワードなし）"]
[{"$nulls":16},"令和",{"$nulls":3},"年",null,"月",null,"日"]
[]
["指定確認検査機関"]
["登録住宅性能評価機関"]
["株式会社確認検査機構アネックス　様"]
[]
[{"$nulls":11},"申請者"]
[{"$nulls":11},"住　所",null,{"$f":"IF(申二面!J9=\"\",\"\",申二面!J9)","v":""}]
[{"$nulls":11},"氏　名",null,{"$f":"IF(申一面!T20&申一面!T21=\"\",\"\",IF(申一面!T20=\"\",申一面!T21,申一面!T20&\"\n\"&申一面!T21))","v":""},{"$nulls":9},"印"]
[]
["　私は、",null,{"$f":"IF(申二面!K14=\"\",\"\",IF(申二面!K14=\"一級\",\"一級建築士\",IF(申二面!K14=\"二級\",\"二級建築士\",\"木造建築士\")))","v":""},{"$nulls":3},{"$f":"IF(申二面!J15=\"\",\"\",申二面!J15)","v":""},{"$nulls":4},"を代理人と定め、下記の建築物等に係る建築基準法等の"]
["規定に基づく手続き（引受承諾書の受領を含む。）等に関する一切の権限を委任します。"]
[]
["記"]
[]
["１．申請の区分"]
[null,null,"建築基準法第６条の２第１項の規定による確認"]
[null,null,"建築基準法第７条の４第１項の規定による中間検査"]
[null,null,"建築基準法第７条の２第１項の規定による完了検査"]
[{"$nulls":26},"建築確認検査業務に係る各種届出書類の訂正"]
[{"$nulls":26},"建築基準法第６条の２第１項の規定による計画の変更の確認"]
[{"$nulls":26},"住宅金融支援機構の証券化支援事業（フラット３５）に係る物件検査"]
[]
[]
["２．申請する建築物等"]
[null,null,"建築物"]
[null,null,"建築設備（昇降機）"]
[null,null,"建築設備（昇降機以外）"]
[null,null,"工作物（法第88条第１項）"]
[null,null,"工作物（法第88条第２項）"]
[]
["３．建築場所、設置場所又は築造場所"]
[null,{"$f":"IF(申三面!G3=\"\",\"\",申三面!G3)","v":""}]
[]
["４．建築物等の用途"]

{"sheet":"別紙追加様式","index":9,"n_rows":146,"n_cols":56,"rows_kept":146,"merged":[[4,9,4,31],[4,33,4,48],[5,9,5,31],[5,33,5,48],[6,10,6,15],[7,9,7,31],[8,9,8,15],[12,10,12,11],[12,19,12,22],[12,27,12,30],[13,9,13,31],[14,10,14,11],[14,19,14,21],[14,27,14,30],[15,9,15,31],[16,10,16,15],[17,9,17,31],[18,9,18,15],[23,10,23,11],[23,19,23,22],[23,27,23,30],[24,9,24,31],[25,10,25,11],[25,19,25,21],[25,27,25,30],[26,9,26,31],[27,10,27,15],[28,9,28,31],[29,9,29,15],[30,1,30,11],[30,12,30,31],[32,10,32,11],[32,19,32,22],[32,27,32,30],[33,9,33,31],[34,10,34,11],[34,19,34,21],[34,27,34,30],[35,9,35,31],[36,10,36,15],[37,9,37,31],[38,9,38,15],[39,1,39,11],[39,12,39,31],[44,10,44,11],[44,19,44,22],[44,27,44,30],[45,9,45,31],[46,10,46,11],[46,19,46,21],[46,27,46,30],[47,9,47,31],[48,10,48,15],[49,9,49,31],[50,9,50,15],[51,1,51,10],[51,11,51,31],[53,10,53,11],[53,19,53,22],[53,27,53,30],[54,9,54,31],[55,10,55,11],[55,19,55,21],[55,27,55,30],[56,9,56,31],[57,10,57,15],[58,9,58,31],[59,9,59,15],[60,1,60,10],[60,11,60,31],[65,9,65,31],[66,9,66,31],[67,10,67,15],[68,9,68,31],[72,10,72,11],[72,19,72,22],[72,27,72,30],[73,9,73,31],[74,10,74,11],[74,19,74,21],[74,27,74,30],[75,9,75,31],[76,10,76,15],[77,9,77,31],[78,9,78,15],[83,10,83,11],[83,19,83,22],[83,27,83,30],[84,9,84,31],[85,10,85,11],[85,19,85,21],[85,27,85,30],[86,9,86,31],[87,10,87,15],[88,9,88,31],[89,9,89,15],[90,1,90,11],[90,12,90,31],[92,10,92,11],[92,19,92,22],[92,27,92,30],[93,9,93,31],[94,10,94,11],[94,19,94,21],[94,27,94,30],[95,9,95,31],[96,10,96,15],[97,9,97,31],[98,9,98,15],[99,1,99,11],[99,12,99,31],[104,10,104,11],[104,19,104,22],[104,27,104,30],[105,9,105,31],[106,10,106,11],[106,19,106,21],[106,27,106,30],[107,9,107,31],[108,10,108,15],[109,9,109,31],[110,9,110,15],[111,1,111,10],[111,11,111,31],[113,10,113,11],[113,19,113,22],[113,27,113,30],[114,9,114,31],[115,10,115,11],[115,19,115,21],[115,27,115,30],[116,9,116,31],[117,10,117,15],[118,9,118,31],[119,9,119,15],[120,1,120,10],[120,11,120,31],[124,7,124,31],[125,13,125,16],[125,19,125,25],[126,7,126,31],[127,8,127,13],[128,7,128,31],[129,7,129,13]]}
["（第二面）別紙追加様式"]
[null,"建築主等の概要",{"$nulls":31},"シートの保護を解除すると編集が可能になります（パスワードなし）"]
[]
["【1.建築主】",{"$nulls":53},"（注意）第二面"]
[null,"【イ.氏名のフリガナ】",{"$nulls":31},"氏名のフリガナ",{"$nulls":20},"①　建築主が２以上のときは、１欄は代表となる建築主について記入し、"]
[null,"【ロ.氏名】",{"$nulls":31},{"$f":"IF(J6=\"\",\"\",ASC(PHONETIC(J6)))","v":""},{"$nulls":21},"別紙に他の建築主についてそれぞれ必要な事項を記入して添えてください。"]
[null,"【ハ.郵便番号】",{"$nulls":7},"〒"]
[null,"【ニ.住所】"]
[null,"【ホ.電話番号】"]
[]
[]
["【2.代理者】"]
[null,"【イ.資格】",{"$nulls":7},"（",null,null,"）","建築士",{"$nulls":4},"（",{"$nulls":4},"）","登録",null,"第",{"$nulls":4},"号",null,"追加される必要な欄以外は、抹消していただいて結構です。"]
[null,"【ロ.氏名】"]
[null,"【ハ.建築士事務所名】",{"$nulls":7},"（",null,null,"）","建築士事務所",{"$nulls":4},"（",{"$nulls":3},"）","知事登録第",{"$nulls":7},"号"]
[]
[null,"【ニ.郵便番号】",{"$nulls":7},"〒"]
[null,"【ホ.所在地】"]
[null,"【へ.電話番号】"]
[]
[]
["【3.設計者】"]
[null,"(その他の設計者)"]
[null,"【イ.資格】",{"$nulls":7},"（",null,null,"）","建築士",{"$nulls":4},"（",{"$nulls":4},"）","登録",null,"第",{"$nulls":4},"号"]
[null,"【ロ.氏名】"]
[null,"【ハ.建築士事務所名】",{"$nulls":7},"（",null,null,"）","建築士事務所",{"$nulls":4},"（",{"$nulls":3},"）","知事登録第",{"$nulls":7},"号"]
[]
[null,"【ニ.郵便番号】",{"$nulls":7},"〒"]
[null,"【ホ.所在地】"]
[null,"【へ.電話番号】"]
[null,"【ト.作成又は確認した設計図書】",{"$nulls":31},"確認申請時",{"$nulls":3},"【ト.作成又は確認した設計図書】"]
[{"$nulls":33},"検査申請時",{"$nulls":3},"【ト.作成した設計図書】"]
[null,"【イ.資格】",{"$nulls":7},"（",null,null,"）","建築士",{"$nulls":4},"（",{"$nulls":4},"）","登録",null,"第",{"$nulls":4},"号"]
[null,"【ロ.氏名】"]
[null,"【ハ.建築士事務所名】",{"$nulls":7},"（",null,null,"）","建築士事務所",{"$nulls":4},"（",{"$nulls":3},"）","知事登録第",{"$nulls":7},"号"]
[]
[null,"【ニ.郵便番号】",{"$nulls":7},{"$f":"IF(K37=\"\",\"\",\"〒\")","v":""}]
[null,"【ホ.所在地】"]
[null,"【へ.電話番号】"]
[null,"【ト.作成又は確認した設計図書】"]
[]
[]
["【5.工事監理者】"]
[null,"(その他の工事監理者)"]
[null,"【イ.資格】",{"$nulls":7},"（",null,null,"）","建築士",{"$nulls":4},"（",{"$nulls":4},"）","登録",null,"第",{"$nulls":4},"号"]
[null,"【ロ.氏名】"]
[null,"【ハ.建築士事務所名】",{"$nulls":7},"（",null,null,"）","建築士事務所",{"$nulls":4},"（",{"$nulls":3},"）","知事登録第",{"$nulls":7},"号"]
[]
[null,"【ニ.郵便番号】",{"$nulls":7},"〒"]
[null,"【ホ.所在地】"]
[null,"【へ.電話番号】"]
[null,"【ト.工事と照合する設計図書】",{"$nulls":31},"確認申請時",{"$nulls":3},"【ト.工事と照合する設計図書】"]
[{"$nulls":33},"検査申請時",{"$nulls":3},"【ト.工事と照合した設計図書】"]
[null,"【イ.資格】",{"$nulls":7},"（",null,null,"）","建築士",{"$nulls":4},"（",{"$nulls":4},"）","登録",null,"第",{"$nulls":4},"号"]
[null,"【ロ.氏名】"]
[null,"【ハ.建築士事務所名】",{"$nulls":7},"（",null,null,"）","建築士事務所",{"$nulls":4},"（",{"$nulls":3},"）","知事登録第",{"$nulls":7},"号"]
[]
[null,"【ニ.郵便番号】",{"$nulls":7},{"$f":"IF(K58=\"\",\"\",\"〒\")","v":""}]
[null,"【ホ.所在地】"]
[null,"【へ.電話番号】"]
[null,"【ト.工事と照合する設計図書】"]
["建築計画概要書（第一面）別紙追加様式"]
[null,"建築主等の概要"]
[]
["【1.建築主】"]
[null,"【イ.氏名のフリガナ】",{"$nulls":7},{"$f":"IF(J5=\"\",\"\",J5)","v":""}]
[null,"【ロ.氏名】",{"$nulls":7},{"$f":"IF(J6=\"\",\"\",J6)","v":""}]
[null,"【ハ.郵便番号】",{"$nulls":7},"〒",{"$f":"IF(K7=\"\",\"\",K7)","v":""}]
[null,"【ニ.住所】",{"$nulls":7},{"$f":"IF(J8=\"\",\"\",J8)","v":""}]
[]
[]
["【2.代理者】"]
[null,"【イ.資格】",{"$nulls":7},"（",{"$f":"IF(K13=\"\",\"\",K13)","v":""},null,"）","建築士",{"$nulls":4},"（",{"$f":"IF(T13=\"\",\"\",T13)","v":""},{"$nulls":3},"）","登録",null,"第",{"$f":"IF(AB13=\"\",\"\",AB13)","v":""},{"$nulls":3},"号"]
[null,"【ロ.氏名】",{"$nulls":7},{"$f":"IF(J14=\"\",\"\",J14)","v":""}]
[null,"【ハ.建築士事務所名】",{"$nulls":7},"（",{"$f":"IF(K15=\"\",\"\",K15)","v":""},null,"）","建築士事務所",{"$nulls":4},"（",{"$f":"IF(T15=\"\",\"\",T15)","v":""},null,null,"）","知事登録第",{"$nulls":3},{"$f":"IF(AB15=\"\",\"\",AB15)","v":""},{"$nulls":3},"号"]
[{"$nulls":9},{"$f":"IF(J16=\"\",\"\",J16)","v":""}]
[null,"【ニ.郵便番号】",{"$nulls":7},"〒",{"$f":"IF(K17=\"\",\"\",K17)","v":""}]
[null,"【ホ.所在地】",{"$nulls":7},{"$f":"IF(J18=\"\",\"\",J18)","v":""}]
[null,"【へ.電話番号】",{"$nulls":7},{"$f":"IF(J19=\"\",\"\",J19)","v":""}]
[]
[]
["【3.設計者】"]
[null,"(その他の設計者)"]
[null,"【イ.資格】",{"$nulls":7},"（",{"$f":"IF(K24=\"\",\"\",K24)","v":""},null,"）","建築士",{"$nulls":4},"（",{"$f":"IF(T24=\"\",\"\",T24)","v":""},{"$nulls":3},"）","登録",null,"第",{"$f":"IF(AB24=\"\",\"\",AB24)","v":""},{"$nulls":3},"号"]
[null,"【ロ.氏名】",{"$nulls":7},{"$f":"IF(J25=\"\",\"\",J25)","v":""}]
[null,"【ハ.建築士事務所名】",{"$nulls":7},"（",{"$f":"IF(K26=\"\",\"\",K26)","v":""},null,"）","建築士事務所",{"$nulls":4},"（",{"$f":"IF(T26=\"\",\"\",T26)","v":""},null,null,"）","知事登録第",{"$nulls":3},{"$f":"IF(AB26=\"\",\"\",AB26)","v":""},{"$nulls":3},"号"]
[{"$nulls":9},{"$f":"IF(J27=\"\",\"\",J27)","v":""}]
[null,"【ニ.郵便番号】",{"$nulls":7},"〒",{"$f":"IF(K28=\"\",\"\",K28)","v":""}]
[null,"【ホ.所在地】",{"$nulls":7},{"$f":"IF(J29=\"\",\"\",J29)","v":""}]
[null,"【へ.電話番号】",{"$nulls":7},{"$f":"IF(J30=\"\",\"\",J30)","v":""}]
[null,"【ト.作成又は確認した設計図書】",{"$nulls":10},{"$f":"IF(M31=\"\",\"\",M31)","v":""}]
[]
[null,"【イ.資格】",{"$nulls":7},"（",{"$f":"IF(K33=\"\",\"\",K33)","v":""},null,"）","建築士",{"$nulls":4},"（",{"$f":"IF(T33=\"\",\"\",T33)","v":""},{"$nulls":3},"）","登録",null,"第",{"$f":"IF(AB33=\"\",\"\",AB33)","v":""},{"$nulls":3},"号"]
[null,"【ロ.氏名】",{"$nulls":7},{"$f":"IF(J34=\"\",\"\",J34)","v":""}]
[null,"【ハ.建築士事務所名】",{"$nulls":7},"（",{"$f":"IF(K35=\"\",\"\",K35)","v":""},null,"）","建築士事務所",{"$nulls":4},"（",{"$f":"IF(T35=\"\",\"\",T35)","v":""},null,null,"）","知事登録第",{"$nulls":3},{"$f":"IF(AB35=\"\",\"\",AB35)","v":""},{"$nulls":3},"号"]
[{"$nulls":9},{"$f":"IF(J36=\"\",\"\",J36)","v":""}]
[null,"【ニ.郵便番号】",{"$nulls":7},{"$f":"IF(K97=\"\",\"\",\"〒\")","v":""},{"$f":"IF(K37=\"\",\"\",K37)","v":""}]
[null,"【ホ.所在地】",{"$nulls":7},{"$f":"IF(J38=\"\",\"\",J38)","v":""}]
[null,"【へ.電話番号】",{"$nulls":7},{"$f":"IF(J39=\"\",\"\",J39)","v":""}]
[null,"【ト.作成又は確認した設計図書】",{"$nulls":10},{"$f":"IF(M40=\"\",\"\",M40)","v":""}]
[]
[]
["【5.工事監理者】"]
[null,"(その他の工事監理者)"]
[null,"【イ.資格】",{"$nulls":7},"（",{"$f":"IF(K45=\"\",\"\",K45)","v":""},null,"）","建築士",{"$nulls":4},"（",{"$f":"IF(T45=\"\",\"\",T45)","v":""},{"$nulls":3},"）","登録",null,"第",{"$f":"IF(AB45=\"\",\"\",AB45)","v":""},{"$nulls":3},"号"]
[null,"【ロ.氏名】",{"$nulls":7},{"$f":"IF(J46=\"\",\"\",J46)","v":""}]
[null,"【ハ.建築士事務所名】",{"$nulls":7},"（",{"$f":"IF(K47=\"\",\"\",K47)","v":""},null,"）","建築士事務所",{"$nulls":4},"（",{"$f":"IF(T47=\"\",\"\",T47)","v":""},null,null,"）","知事登録第",{"$nulls":3},{"$f":"IF(AB47=\"\",\"\",AB47)","v":""},{"$nulls":3},"号"]
[{"$nulls":9},{"$f":"IF(J48=\"\",\"\",J48)","v":""}]
[null,"【ニ.郵便番号】",{"$nulls":7},"〒",{"$f":"IF(K49=\"\",\"\",K49)","v":""}]
[null,"【ホ.所在地】",{"$nulls":7},{"$f":"IF(J50=\"\",\"\",J50)","v":""}]
[null,"【へ.電話番号】",{"$nulls":7},{"$f":"IF(J51=\"\",\"\",J51)","v":""}]
[null,"【ト.工事と照合する設計図書】",{"$nulls":9},{"$f":"IF(L52=\"\",\"\",L52)","v":""}]
[]
[null,"【イ.資格】",{"$nulls":7},"（",{"$f":"IF(K54=\"\",\"\",K54)","v":""},null,"）","建築士",{"$nulls":4},"（",{"$f":"IF(T54=\"\",\"\",T54)","v":""},{"$nulls":3},"）","登録",null,"第",{"$f":"IF(AB54=\"\",\"\",AB54)","v":""},{"$nulls":3},"号"]
[null,"【ロ.氏名】",{"$nulls":7},{"$f":"IF(J55=\"\",\"\",J55)","v":""}]
[null,"【ハ.建築士事務所名】",{"$nulls":7},"（",{"$f":"IF(K56=\"\",\"\",K56)","v":""},null,"）","建築士事務所",{"$nulls":4},"（",{"$f":"IF(T56=\"\",\"\",T56)","v":""},null,null,"）","知事登録第",{"$nulls":3},{"$f":"IF(AB56=\"\",\"\",AB56)","v":""},{"$nulls":3},"号"]
[{"$nulls":9},{"$f":"IF(J57=\"\",\"\",J57)","v":""}]
[null,"【ニ.郵便番号】",{"$nulls":7},{"$f":"IF(K118=\"\",\"\",\"〒\")","v":""},{"$f":"IF(K58=\"\",\"\",K58)","v":""}]
[null,"【ホ.所在地】",{"$nulls":7},{"$f":"IF(J59=\"\",\"\",J59)","v":""}]
[null,"【へ.電話番号】",{"$nulls":7},{"$f":"IF(J60=\"\",\"\",J60)","v":""}]
[null,"【ト.工事と照合する設計図書】",{"$nulls":9},{"$f":"IF(L61=\"\",\"\",L61)","v":""}]
[]
[]
["【6.工事施工者】"]
[null,"【イ.氏名】"]
[null,"【ロ.営業所名】",{"$nulls":5},"建設業の許可",{"$nulls":4},"（",{"$nulls":4},"）","第",{"$nulls":7},"号"]
[]
[null,"【ハ.郵便番号】",{"$nulls":5},"〒"]
[null,"【ニ.所在地】"]
[null,"【ホ.電話番号】"]
{"$rows_empty":8}
[null,"（第二面）別紙追加様式"]
[null,"建築計画概要書（第一面）別紙追加様式"]
[]
[null,"滋賀県",null,null,"大臣",{"$nulls":4},"設計図書一式"]
[null,"京都府",null,null,"滋賀県知事",{"$nulls":4},"設計図書一式（構造図、構造計算書を除く）"]
[null,"大阪府",null,null,"京都府知事",{"$nulls":4},"構造図、構造計算書"]
[null,"奈良県",null,null,"大阪府知事"]
[{"$nulls":4},"奈良県知事"]

{"sheet":"概一面","index":10,"n_rows":175,"n_cols":35,"rows_kept":175,"merged":[[1,13,1,18],[1,27,1,30],[2,25,2,27],[3,13,3,18],[3,25,3,31],[7,9,7,31],[8,9,8,31],[9,10,9,15],[10,9,10,31],[14,10,14,11],[14,19,14,22],[14,27,14,30],[15,9,15,31],[16,10,16,11],[16,19,16,21],[16,27,16,30],[17,9,17,31],[18,10,18,15],[19,9,19,31],[20,9,20,15],[25,10,25,11],[25,19,25,22],[25,27,25,30],[26,9,26,31],[27,10,27,11],[27,19,27,21],[27,27,27,30],[28,9,28,31],[29,10,29,15],[30,9,30,31],[31,9,31,15],[32,12,32,31],[35,10,35,11],[35,19,35,22],[35,27,35,30],[36,9,36,31],[37,10,37,11],[37,19,37,21],[37,27,37,30],[38,9,38,31],[39,10,39,15],[40,9,40,31],[41,9,41,15],[42,12,42,31],[44,10,44,11],[44,19,44,22],[44,27,44,30],[45,9,45,31],[46,10,46,11],[46,19,46,21],[46,27,46,30],[47,9,47,31],[48,10,48,15],[49,9,49,31],[50,9,50,15],[51,12,51,31],[53,10,53,11],[53,19,53,22],[53,27,53,30],[54,9,54,31],[55,10,55,11],[55,19,55,21],[55,27,55,30],[56,9,56,31],[57,10,57,15],[58,9,58,31],[59,9,59,15],[60,12,60,31],[65,7,65,22],[66,17,66,21],[68,7,68,22],[69,17,69,21],[71,7,71,22],[72,17,72,21],[73,7,73,22],[74,17,74,21],[75,7,75,22],[76,17,76,21],[78,7,78,22],[79,17,79,21],[80,7,80,22],[81,17,81,21],[82,7,82,22],[83,17,83,21],[88,7,88,31],[89,7,89,31],[90,8,90,13],[91,7,91,31],[92,7,92,13],[93,7,93,13],[94,11,94,31],[97,7,97,31],[98,7,98,31],[99,8,99,13],[100,7,100,31],[101,7,101,13],[102,7,102,13],[103,11,103,31],[105,7,105,31],[106,7,106,31],[107,8,107,13],[108,7,108,31],[109,7,109,13],[110,7,110,13],[111,11,111,31],[113,7,113,31],[114,7,114,31],[115,8,115,13],[116,7,116,31],[117,7,117,13],[118,7,118,13],[119,11,119,31],[124,10,124,11],[124,19,124,22],[124,27,124,30],[125,9,125,31],[126,10,126,11],[126,19,126,21],[126,27,126,30],[127,9,127,31],[128,10,128,15],[129,9,129,31],[130,9,130,15],[131,11,131,31],[134,10,134,11],[134,19,134,22],[134,27,134,30],[135,9,135,31],[136,10,136,11],[136,19,136,21],[136,27,136,30],[137,9,137,31],[138,10,138,15],[139,9,139,31],[140,9,140,15],[141,11,141,31],[143,10,143,11],[143,19,143,22],[143,27,143,30],[144,9,144,31],[145,10,145,11],[145,19,145,21],[145,27,145,30],[146,9,146,31],[147,10,147,15],[148,9,148,31],[149,9,149,15],[150,11,150,31],[152,10,152,11],[152,19,152,22],[152,27,152,30],[153,9,153,31],[154,10,154,11],[154,19,154,21],[154,27,154,30],[155,9,155,31],[156,10,156,15],[157,9,157,31],[158,9,158,15],[159,11,159,31],[163,7,163,31],[164,13,164,16],[164,19,164,25],[165,7,165,31],[166,8,166,13],[167,7,167,31],[168,7,168,13],[171,4,171,31],[172,4,172,31],[173,4,173,31],[174,4,174,31],[183,54,183,58],[184,52,184,55],[185,52,185,59]]}
[{"$nulls":25},"R",null,".",null,"."]
[{"$nulls":13},"建築計画概要書",{"$nulls":11},"第",null,"確認建機構ア",{"$nulls":3},{"$f":"IF(受付用!B9=\"\",\"\",受付用!B9)","v":""}]
[{"$nulls":25},{"$f":"IF(受付用!C9=\"\",\"\",受付用!C9)","v":""},{"$nulls":5},"号",null,"シートの保護を解除すると編集が可能になります（パスワードなし）"]
[{"$nulls":13},"（第一面）",{"$nulls":11},"㈱確認検査機構ｱﾈｯｸｽ",{"$nulls":7},"確認申請書第二面を改行等修正された場合は反映されているか確認してください"]
[null,"建築主等の概要"]
[]
["【1.建築主】"]
[null,"【イ.氏名のフリガナ】",{"$nulls":7},{"$f":"IF(申二面!J6=\"\",\"\",申二面!J6)","v":""}]
[null,"【ロ.氏名】",{"$nulls":7},{"$f":"IF(申二面!J7=\"\",\"\",申二面!J7)","v":""}]
[null,"【ハ.郵便番号】",{"$nulls":7},"〒",{"$f":"IF(申二面!K8=\"\",\"\",申二面!K8)","v":""}]
[null,"【ニ.住所】",{"$nulls":7},{"$f":"IF(申二面!J9=\"\",\"\",申二面!J9)","v":""}]
[]
[]
["【2.代理者】",{"$nulls":33},"大阪府下は、"]
[null,"【イ.資格】",{"$nulls":7},"（",{"$f":"IF(申二面!K14=\"\",\"\",申二面!K14)","v":""},null,"）","建築士",{"$nulls":4},"（",{"$f":"IF(申二面!T14=\"\",\"\",申二面!T14)","v":""},{"$nulls":3},"）","登録",null,"第",{"$f":"IF(申二面!AB14=\"\",\"\",申二面!AB14)","v":""},{"$nulls":3},"号",null,null,"大阪府下行政庁指定様式"]
[null,"【ロ.氏名】",{"$nulls":7},{"$f":"IF(申二面!J15=\"\",\"\",申二面!J15)","v":""},{"$nulls":24},"（Ａ３判、厚紙仕様）のもので"]
[null,"【ハ.建築士事務所名】",{"$nulls":7},"（",{"$f":"IF(申二面!K16=\"\",\"\",申二面!K16)","v":""},null,"）","建築士事務所",{"$nulls":4},"（",{"$f":"IF(申二面!T16=\"\",\"\",申二面!T16)","v":""},null,null,"）","知事登録第",{"$nulls":3},{"$f":"IF(申二面!AB16=\"\",\"\",申二面!AB16)","v":""},{"$nulls":3},"号",null,null,"提出をお願いします。"]
[{"$nulls":9},{"$f":"IF(申二面!J17=\"\",\"\",申二面!J17)","v":""}]
[null,"【ニ.郵便番号】",{"$nulls":7},"〒",{"$f":"IF(申二面!K18=\"\",\"\",申二面!K18)","v":""},{"$nulls":23},"奈良県下は、"]
[null,"【ホ.所在地】",{"$nulls":7},{"$f":"IF(申二面!J19=\"\",\"\",申二面!J19)","v":""},{"$nulls":24},"厚紙仕様のもので"]
[null,"【へ.電話番号】",{"$nulls":7},{"$f":"IF(申二面!J20=\"\",\"\",申二面!J20)","v":""},{"$nulls":24},"提出をお願いします。"]
[]
[]
["【3.設計者】"]
[null,"(代表となる設計者)"]
[null,"【イ.資格】",{"$nulls":7},"（",{"$f":"IF(申二面!K25=\"\",\"\",申二面!K25)","v":""},null,"）","建築士",{"$nulls":4},"（",{"$f":"IF(申二面!T25=\"\",\"\",申二面!T25)","v":""},{"$nulls":3},"）","登録",null,"第",{"$f":"IF(申二面!AB25=\"\",\"\",申二面!AB25)","v":""},{"$nulls":3},"号"]
[null,"【ロ.氏名】",{"$nulls":7},{"$f":"IF(申二面!J26=\"\",\"\",申二面!J26)","v":""}]
[null,"【ハ.建築士事務所名】",{"$nulls":7},"（",{"$f":"IF(申二面!K27=\"\",\"\",申二面!K27)","v":""},null,"）","建築士事務所",{"$nulls":4},"（",{"$f":"IF(申二面!T27=\"\",\"\",申二面!T27)","v":""},null,null,"）","知事登録第",{"$nulls":3},{"$f":"IF(申二面!AB27=\"\",\"\",申二面!AB27)","v":""},{"$nulls":3},"号"]
[{"$nulls":9},{"$f":"IF(申二面!J28=\"\",\"\",申二面!J28)","v":""}]
[null,"【ニ.郵便番号】",{"$nulls":7},"〒",{"$f":"IF(申二面!K29=\"\",\"\",申二面!K29)","v":""}]
[null,"【ホ.所在地】",{"$nulls":7},{"$f":"IF(申二面!J30=\"\",\"\",申二面!J30)","v":""}]
[null,"【へ.電話番号】",{"$nulls":7},{"$f":"IF(申二面!J31=\"\",\"\",申二面!J31)","v":""}]
[null,"【ト.作成又は確認した設計図書】",{"$nulls":10},{"$f":"IF(申二面!M32=\"\",\"\",申二面!M32)","v":""}]
[]
[null,"(その他の設計者)"]
[null,"【イ.資格】",{"$nulls":7},"（",{"$f":"IF(申二面!K35=\"\",\"\",申二面!K35)","v":""},null,"）","建築士",{"$nulls":4},"（",{"$f":"IF(申二面!T35=\"\",\"\",申二面!T35)","v":""},{"$nulls":3},"）","登録",null,"第",{"$f":"IF(申二面!AB35=\"\",\"\",申二面!AB35)","v":""},{"$nulls":3},"号"]
[null,"【ロ.氏名】",{"$nulls":7},{"$f":"IF(申二面!J36=\"\",\"\",申二面!J36)","v":""}]
[null,"【ハ.建築士事務所名】",{"$nulls":7},"（",{"$f":"IF(申二面!K37=\"\",\"\",申二面!K37)","v":""},null,"）","建築士事務所",{"$nulls":4},"（",{"$f":"IF(申二面!T37=\"\",\"\",申二面!T37)","v":""},null,null,"）","知事登録第",{"$nulls":3},{"$f":"IF(申二面!AB37=\"\",\"\",申二面!AB37)","v":""},{"$nulls":3},"号"]
[{"$nulls":9},{"$f":"IF(申二面!J38=\"\",\"\",申二面!J38)","v":""}]
[null,"【ニ.郵便番号】",{"$nulls":7},{"$f":"IF(K40=\"\",\"\",\"〒\")","v":""},{"$f":"IF(申二面!K39=\"\",\"\",申二面!K39)","v":""}]
[null,"【ホ.所在地】",{"$nulls":7},{"$f":"IF(申二面!J40=\"\",\"\",申二面!J40)","v":""}]
[null,"【へ.電話番号】",{"$nulls":7},{"$f":"IF(申二面!J41=\"\",\"\",申二面!J41)","v":""}]
[null,"【ト.作成又は確認した設計図書】",{"$nulls":10},{"$f":"IF(申二面!M42=\"\",\"\",申二面!M42)","v":""}]
[]
[null,"【イ.資格】",{"$nulls":7},"（",{"$f":"IF(申二面!K44=\"\",\"\",申二面!K44)","v":""},null,"）","建築士",{"$nulls":4},"（",{"$f":"IF(申二面!T44=\"\",\"\",申二面!T44)","v":""},{"$nulls":3},"）","登録",null,"第",{"$f":"IF(申二面!AB44=\"\",\"\",申二面!AB44)","v":""},{"$nulls":3},"号"]
[null,"【ロ.氏名】",{"$nulls":7},{"$f":"IF(申二面!J45=\"\",\"\",申二面!J45)","v":""}]
[null,"【ハ.建築士事務所名】",{"$nulls":7},"（",{"$f":"IF(申二面!K46=\"\",\"\",申二面!K46)","v":""},null,"）","建築士事務所",{"$nulls":4},"（",{"$f":"IF(申二面!T46=\"\",\"\",申二面!T46)","v":""},null,null,"）","知事登録第",{"$nulls":3},{"$f":"IF(申二面!AB46=\"\",\"\",申二面!AB46)","v":""},{"$nulls":3},"号"]
[{"$nulls":9},{"$f":"IF(申二面!J47=\"\",\"\",申二面!J47)","v":""}]
[null,"【ニ.郵便番号】",{"$nulls":7},{"$f":"IF(K49=\"\",\"\",\"〒\")","v":""},{"$f":"IF(申二面!K48=\"\",\"\",申二面!K48)","v":""}]
[null,"【ホ.所在地】",{"$nulls":7},{"$f":"IF(申二面!J49=\"\",\"\",申二面!J49)","v":""}]
[null,"【へ.電話番号】",{"$nulls":7},{"$f":"IF(申二面!J50=\"\",\"\",申二面!J50)","v":""}]
[null,"【ト.作成又は確認した設計図書】",{"$nulls":10},{"$f":"IF(申二面!M51=\"\",\"\",申二面!M51)","v":""}]
[]
[null,"【イ.資格】",{"$nulls":7},"（",{"$f":"IF(申二面!K53=\"\",\"\",申二面!K53)","v":""},null,"）","建築士",{"$nulls":4},"（",{"$f":"IF(申二面!T53=\"\",\"\",申二面!T53)","v":""},{"$nulls":3},"）","登録",null,"第",{"$f":"IF(申二面!AB53=\"\",\"\",申二面!AB53)","v":""},{"$nulls":3},"号"]
[null,"【ロ.氏名】",{"$nulls":7},{"$f":"IF(申二面!J54=\"\",\"\",申二面!J54)","v":""}]
[null,"【ハ.建築士事務所名】",{"$nulls":7},"（",{"$f":"IF(申二面!K55=\"\",\"\",申二面!K55)","v":""},null,"）","建築士事務所",{"$nulls":4},"（",{"$f":"IF(申二面!T55=\"\",\"\",申二面!T55)","v":""},null,null,"）","知事登録第",{"$nulls":3},{"$f":"IF(申二面!AB55=\"\",\"\",申二面!AB55)","v":""},{"$nulls":3},"号"]
[{"$nulls":9},{"$f":"IF(申二面!J56=\"\",\"\",申二面!J56)","v":""}]
[null,"【ニ.郵便番号】",{"$nulls":7},{"$f":"IF(K58=\"\",\"\",\"〒\")","v":""},{"$f":"IF(申二面!K57=\"\",\"\",申二面!K57)","v":""}]
[null,"【ホ.所在地】",{"$nulls":7},{"$f":"IF(申二面!J58=\"\",\"\",申二面!J58)","v":""}]
[null,"【へ.電話番号】",{"$nulls":7},{"$f":"IF(申二面!J59=\"\",\"\",申二面!J59)","v":""}]
[null,"【ト.作成又は確認した設計図書】",{"$nulls":10},{"$f":"IF(申二面!M60=\"\",\"\",申二面!M60)","v":""}]
[]
[null,"（構造設計一級建築士又は設備設計一級建築士である旨の表示をした者）"]
[null,null,"上記の設計者のうち、"]
[null,null,{"$f":"IF(申二面!C65=\"\",\"\",申二面!C65)","v":"□"},"建築士法第20条の２第１項の表示をした者"]
[null,null,"【イ.氏名】",{"$nulls":4},{"$f":"IF(申二面!H66=\"\",\"\",申二面!H66)","v":""}]
[null,null,"【ロ.資格】構造設計一級建築士交付",{"$nulls":13},"第",{"$f":"IF(申二面!R67=\"\",\"\",申二面!R67)","v":""},{"$nulls":4},"号"]
[null,null,{"$f":"IF(申二面!C68=\"\",\"\",申二面!C68)","v":"□"},"建築士法第20条の２第３項の表示をした者"]
[null,null,"【イ.氏名】",{"$nulls":4},{"$f":"IF(申二面!H69=\"\",\"\",申二面!H69)","v":""}]
[null,null,"【ロ.資格】構造設計一級建築士交付",{"$nulls":13},"第",{"$f":"IF(申二面!R70=\"\",\"\",申二面!R70)","v":""},{"$nulls":4},"号"]
[null,null,{"$f":"IF(申二面!C71=\"\",\"\",申二面!C71)","v":"□"},"建築士法第20条の３第１項の表示をした者"]
[null,null,"【イ.氏名】",{"$nulls":4},{"$f":"IF(申二面!H72=\"\",\"\",申二面!H72)","v":""}]
[null,null,"【ロ.資格】設備設計一級建築士交付",{"$nulls":13},"第",{"$f":"IF(申二面!R73=\"\",\"\",申二面!R73)","v":""},{"$nulls":4},"号"]
[null,null,"【イ.氏名】",{"$nulls":4},{"$f":"IF(申二面!H74=\"\",\"\",申二面!H74)","v":""}]
[null,null,"【ロ.資格】設備設計一級建築士交付",{"$nulls":13},"第",{"$f":"IF(申二面!R75=\"\",\"\",申二面!R75)","v":""},{"$nulls":4},"号"]
[null,null,"【イ.氏名】",{"$nulls":4},{"$f":"IF(申二面!H76=\"\",\"\",申二面!H76)","v":""}]
[null,null,"【ロ.資格】設備設計一級建築士交付",{"$nulls":13},"第",{"$f":"IF(申二面!R77=\"\",\"\",申二面!R77)","v":""},{"$nulls":4},"号"]
[null,null,{"$f":"IF(申二面!C78=\"\",\"\",申二面!C78)","v":"□"},"建築士法第20条の３第３項の表示をした者"]
[null,null,"【イ.氏名】",{"$nulls":4},{"$f":"IF(申二面!H79=\"\",\"\",申二面!H79)","v":""}]
[null,null,"【ロ.資格】設備設計一級建築士交付",{"$nulls":13},"第",{"$f":"IF(申二面!R80=\"\",\"\",申二面!R80)","v":""},{"$nulls":4},"号"]
[null,null,"【イ.氏名】",{"$nulls":4},{"$f":"IF(申二面!H81=\"\",\"\",申二面!H81)","v":""}]
[null,null,"【ロ.資格】設備設計一級建築士交付",{"$nulls":13},"第",{"$f":"IF(申二面!R82=\"\",\"\",申二面!R82)","v":""},{"$nulls":4},"号"]
[null,null,"【イ.氏名】",{"$nulls":4},{"$f":"IF(申二面!H83=\"\",\"\",申二面!H83)","v":""}]
[null,null,"【ロ.資格】設備設計一級建築士交付",{"$nulls":13},"第",{"$f":"IF(申二面!R84=\"\",\"\",申二面!R84)","v":""},{"$nulls":4},"号"]
[]
[]
["【4.建築設備の設計に関し意見を聴いた者】"]
[null,"(代表となる建築設備の設計に関し意見を聴いた者)"]
[null,"【イ.氏名】",{"$nulls":5},{"$f":"IF(申二面!H89=\"\",\"\",申二面!H89)","v":""}]
[null,"【ロ.勤務先】",{"$nulls":5},{"$f":"IF(申二面!H90=\"\",\"\",申二面!H90)","v":""}]
[null,"【ハ.郵便番号】",{"$nulls":5},{"$f":"IF(I91=\"\",\"\",\"〒\")","v":""},{"$f":"IF(申二面!I91=\"\",\"\",申二面!I91)","v":""}]
[null,"【ニ.所在地】",{"$nulls":5},{"$f":"IF(申二面!H92=\"\",\"\",申二面!H92)","v":""}]
[null,"【ホ.電話番号】",{"$nulls":5},{"$f":"IF(申二面!H93=\"\",\"\",申二面!H93)","v":""}]
[null,"【ヘ.登録番号】",{"$nulls":5},{"$f":"IF(申二面!H94=\"\",\"\",申二面!H94)","v":""}]
[null,"【ト.意見を聴いた設計図書】",{"$nulls":9},{"$f":"IF(申二面!L95=\"\",\"\",申二面!L95)","v":""}]
[]
[null,"(その他の建築設備の設計に関し意見を聴いた者)"]
[null,"【イ.氏名】",{"$nulls":5},{"$f":"IF(申二面!H98=\"\",\"\",申二面!H98)","v":""}]
[null,"【ロ.勤務先】",{"$nulls":5},{"$f":"IF(申二面!H99=\"\",\"\",申二面!H99)","v":""}]
[null,"【ハ.郵便番号】",{"$nulls":5},{"$f":"IF(I100=\"\",\"\",\"〒\")","v":""},{"$f":"IF(申二面!I100=\"\",\"\",申二面!I100)","v":""}]
[null,"【ニ.所在地】",{"$nulls":5},{"$f":"IF(申二面!H101=\"\",\"\",申二面!H101)","v":""}]
[null,"【ホ.電話番号】",{"$nulls":5},{"$f":"IF(申二面!H102=\"\",\"\",申二面!H102)","v":""}]
[null,"【ヘ.登録番号】",{"$nulls":5},{"$f":"IF(申二面!H103=\"\",\"\",申二面!H103)","v":""}]
[null,"【ト.意見を聴いた設計図書】",{"$nulls":9},{"$f":"IF(申二面!L104=\"\",\"\",申二面!L104)","v":""}]
[]
[null,"【イ.氏名】",{"$nulls":5},{"$f":"IF(申二面!H106=\"\",\"\",申二面!H106)","v":""}]
[null,"【ロ.勤務先】",{"$nulls":5},{"$f":"IF(申二面!H107=\"\",\"\",申二面!H107)","v":""}]
[null,"【ハ.郵便番号】",{"$nulls":5},{"$f":"IF(I108=\"\",\"\",\"〒\")","v":""},{"$f":"IF(申二面!I108=\"\",\"\",申二面!I108)","v":""}]
[null,"【ニ.所在地】",{"$nulls":5},{"$f":"IF(申二面!H109=\"\",\"\",申二面!H109)","v":""}]
[null,"【ホ.電話番号】",{"$nulls":5},{"$f":"IF(申二面!H110=\"\",\"\",申二面!H110)","v":""}]
[null,"【ヘ.登録番号】",{"$nulls":5},{"$f":"IF(申二面!H111=\"\",\"\",申二面!H111)","v":""}]
[null,"【ト.意見を聴いた設計図書】",{"$nulls":9},{"$f":"IF(申二面!L112=\"\",\"\",申二面!L112)","v":""}]
[]
[null,"【イ.氏名】",{"$nulls":5},{"$f":"IF(申二面!H114=\"\",\"\",申二面!H114)","v":""}]
[null,"【ロ.勤務先】",{"$nulls":5},{"$f":"IF(申二面!H115=\"\",\"\",申二面!H115)","v":""}]
[null,"【ハ.郵便番号】",{"$nulls":5},{"$f":"IF(I116=\"\",\"\",\"〒\")","v":""},{"$f":"IF(申二面!I116=\"\",\"\",申二面!I116)","v":""}]
[null,"【ニ.所在地】",{"$nulls":5},{"$f":"IF(申二面!H117=\"\",\"\",申二面!H117)","v":""}]
[null,"【ホ.電話番号】",{"$nulls":5},{"$f":"IF(申二面!H118=\"\",\"\",申二面!H118)","v":""}]
[null,"【ヘ.登録番号】",{"$nulls":5},{"$f":"IF(申二面!H119=\"\",\"\",申二面!H119)","v":""}]
[null,"【ト.意見を聴いた設計図書】",{"$nulls":9},{"$f":"IF(申二面!L120=\"\",\"\",申二面!L120)","v":""}]
[]
[]
["【5.工事監理者】"]
[null,"(代表となる工事監理者)"]
[null,"【イ.資格】",{"$nulls":7},"（",{"$f":"IF(申二面!K125=\"\",\"\",申二面!K125)","v":""},null,"）","建築士",{"$nulls":4},"（",{"$f":"IF(申二面!T125=\"\",\"\",申二面!T125)","v":""},{"$nulls":3},"）","登録",null,"第",{"$f":"IF(申二面!AB125=\"\",\"\",申二面!AB125)","v":""},{"$nulls":3},"号"]
[null,"【ロ.氏名】",{"$nulls":7},{"$f":"IF(申二面!J126=\"\",\"\",申二面!J126)","v":""}]
[null,"【ハ.建築士事務所名】",{"$nulls":7},"（",{"$f":"IF(申二面!K127=\"\",\"\",申二面!K127)","v":""},null,"）","建築士事務所",{"$nulls":4},"（",{"$f":"IF(申二面!T127=\"\",\"\",申二面!T127)","v":""},null,null,"）","知事登録第",{"$nulls":3},{"$f":"IF(申二面!AB127=\"\",\"\",申二面!AB127)","v":""},{"$nulls":3},"号"]
[{"$nulls":9},{"$f":"IF(申二面!J128=\"\",\"\",申二面!J128)","v":""}]
[null,"【ニ.郵便番号】",{"$nulls":7},"〒",{"$f":"IF(申二面!K129=\"\",\"\",申二面!K129)","v":""}]
[null,"【ホ.所在地】",{"$nulls":7},{"$f":"IF(申二面!J130=\"\",\"\",申二面!J130)","v":""}]
[null,"【へ.電話番号】",{"$nulls":7},{"$f":"IF(申二面!J131=\"\",\"\",申二面!J131)","v":""}]
[null,"【ト.工事と照合する設計図書】",{"$nulls":9},{"$f":"IF(申二面!L132=\"\",\"\",申二面!L132)","v":""}]
[]
[null,"(その他の工事監理者)"]
[null,"【イ.資格】",{"$nulls":7},"（",{"$f":"IF(申二面!K135=\"\",\"\",申二面!K135)","v":""},null,"）","建築士",{"$nulls":4},"（",{"$f":"IF(申二面!T135=\"\",\"\",申二面!T135)","v":""},{"$nulls":3},"）","登録",null,"第",{"$f":"IF(申二面!AB135=\"\",\"\",申二面!AB135)","v":""},{"$nulls":3},"号"]
[null,"【ロ.氏名】",{"$nulls":7},{"$f":"IF(申二面!J136=\"\",\"\",申二面!J136)","v":""}]
[null,"【ハ.建築士事務所名】",{"$nulls":7},"（",{"$f":"IF(申二面!K137=\"\",\"\",申二面!K137)","v":""},null,"）","建築士事務所",{"$nulls":4},"（",{"$f":"IF(申二面!T137=\"\",\"\",申二面!T137)","v":""},null,null,"）","知事登録第",{"$nulls":3},{"$f":"IF(申二面!AB137=\"\",\"\",申二面!AB137)","v":""},{"$nulls":3},"号"]
[{"$nulls":9},{"$f":"IF(申二面!J138=\"\",\"\",申二面!J138)","v":""}]
[null,"【ニ.郵便番号】",{"$nulls":7},{"$f":"IF(K139=\"\",\"\",\"〒\")","v":""},{"$f":"IF(申二面!K139=\"\",\"\",申二面!K139)","v":""}]
[null,"【ホ.所在地】",{"$nulls":7},{"$f":"IF(申二面!J140=\"\",\"\",申二面!J140)","v":""}]
[null,"【へ.電話番号】",{"$nulls":7},{"$f":"IF(申二面!J141=\"\",\"\",申二面!J141)","v":""}]
[null,"【ト.工事と照合する設計図書】",{"$nulls":9},{"$f":"IF(申二面!L142=\"\",\"\",申二面!L142)","v":""}]
[]
[null,"【イ.資格】",{"$nulls":7},"（",{"$f":"IF(申二面!K144=\"\",\"\",申二面!K144)","v":""},null,"）","建築士",{"$nulls":4},"（",{"$f":"IF(申二面!T144=\"\",\"\",申二面!T144)","v":""},{"$nulls":3},"）","登録",null,"第",{"$f":"IF(申二面!AB144=\"\",\"\",申二面!AB144)","v":""},{"$nulls":3},"号"]
[null,"【ロ.氏名】",{"$nulls":7},{"$f":"IF(申二面!J145=\"\",\"\",申二面!J145)","v":""}]
[null,"【ハ.建築士事務所名】",{"$nulls":7},"（",{"$f":"IF(申二面!K146=\"\",\"\",申二面!K146)","v":""},null,"）","建築士事務所",{"$nulls":4},"（",{"$f":"IF(申二面!T146=\"\",\"\",申二面!T146)","v":""},null,null,"）","知事登録第",{"$nulls":3},{"$f":"IF(申二面!AB146=\"\",\"\",申二面!AB146)","v":""},{"$nulls":3},"号"]
[{"$nulls":9},{"$f":"IF(申二面!J147=\"\",\"\",申二面!J147)","v":""}]
[null,"【ニ.郵便番号】",{"$nulls":7},{"$f":"IF(K148=\"\",\"\",\"〒\")","v":""},{"$f":"IF(申二面!K148=\"\",\"\",申二面!K148)","v":""}]
[null,"【ホ.所在地】",{"$nulls":7},{"$f":"IF(申二面!J149=\"\",\"\",申二面!J149)","v":""}]
[null,"【へ.電話番号】",{"$nulls":7},{"$f":"IF(申二面!J150=\"\",\"\",申二面!J150)","v":""}]
[null,"【ト.工事と照合する設計図書】",{"$nulls":9},{"$f":"IF(申二面!L151=\"\",\"\",申二面!L151)","v":""}]
[]
[null,"【イ.資格】",{"$nulls":7},"（",{"$f":"IF(申二面!K153=\"\",\"\",申二面!K153)","v":""},null,"）","建築士",{"$nulls":4},"（",{"$f":"IF(申二面!T153=\"\",\"\",申二面!T153)","v":""},{"$nulls":3},"）","登録",null,"第",{"$f":"IF(申二面!AB153=\"\",\"\",申二面!AB153)","v":""},{"$nulls":3},"号"]
[null,"【ロ.氏名】",{"$nulls":7},{"$f":"IF(申二面!J154=\"\",\"\",申二面!J154)","v":""}]
[null,"【ハ.建築士事務所名】",{"$nulls":7},"（",{"$f":"IF(申二面!K155=\"\",\"\",申二面!K155)","v":""},null,"）","建築士事務所",{"$nulls":4},"（",{"$f":"IF(申二面!T155=\"\",\"\",申二面!T155)","v":""},null,null,"）","知事登録第",{"$nulls":3},{"$f":"IF(申二面!AB155=\"\",\"\",申二面!AB155)","v":""},{"$nulls":3},"号"]
[{"$nulls":9},{"$f":"IF(申二面!J156=\"\",\"\",申二面!J156)","v":""}]
[null,"【ニ.郵便番号】",{"$nulls":7},{"$f":"IF(K157=\"\",\"\",\"〒\")","v":""},{"$f":"IF(申二面!K157=\"\",\"\",申二面!K157)","v":""}]
[null,"【ホ.所在地】",{"$nulls":7},{"$f":"IF(申二面!J158=\"\",\"\",申二面!J158)","v":""}]
[null,"【へ.電話番号】",{"$nulls":7},{"$f":"IF(申二面!J159=\"\",\"\",申二面!J159)","v":""}]
[null,"【ト.工事と照合する設計図書】",{"$nulls":9},{"$f":"IF(申二面!L160=\"\",\"\",申二面!L160)","v":""}]
[]
[]
["【6.工事施工者】"]
[null,"【イ.氏名】",{"$nulls":5},{"$f":"IF(申二面!H164=\"\",\"\",申二面!H164)","v":""}]
[null,"【ロ.営業所名】",{"$nulls":5},"建設業の許可",{"$nulls":4},"（",{"$f":"IF(申二面!N165=\"\",\"\",申二面!N165)","v":""},{"$nulls":3},"）","第",{"$f":"IF(申二面!T165=\"\",\"\",申二面!T165)","v":""},{"$nulls":6},"号"]
[{"$nulls":7},{"$f":"IF(申二面!H166=\"\",\"\",申二面!H166)","v":""}]
[null,"【ハ.郵便番号】",{"$nulls":5},"〒",{"$f":"IF(申二面!I167=\"\",\"\",申二面!I167)","v":""}]
[null,"【ニ.所在地】",{"$nulls":5},{"$f":"IF(申二面!H168=\"\",\"\",申二面!H168)","v":""}]
[null,"【ホ.電話番号】",{"$nulls":5},{"$f":"IF(申二面!H169=\"\",\"\",申二面!H169)","v":""}]
[]
[]
["【7.備考】",{"$nulls":3},{"$f":"IF(申二面!E184=\"\",\"\",申二面!E184)","v":""}]
[{"$nulls":4},{"$f":"IF(申二面!E185=\"\",\"\",申二面!E185)","v":""}]
[{"$nulls":4},{"$f":"IF(申二面!E186=\"\",\"\",申二面!E186)","v":""}]
[{"$nulls":33},"←","書き込み可能"]

{"sheet":"概二面","index":11,"n_rows":84,"n_cols":35,"rows_kept":84,"merged":[[2,6,2,31],[3,6,3,31],[8,14,8,31],[9,1,9,31],[11,8,11,14],[11,15,11,19],[12,15,12,19],[14,9,14,11],[14,15,14,17],[14,21,14,23],[14,27,14,29],[15,9,15,11],[15,15,15,17],[15,21,15,23],[15,27,15,29],[16,9,16,12],[16,15,16,18],[16,21,16,24],[16,27,16,30],[18,9,18,11],[18,15,18,17],[18,21,18,23],[18,27,18,29],[20,9,20,11],[20,15,20,17],[20,21,20,23],[20,27,20,29],[21,12,21,16],[22,12,22,16],[23,23,23,27],[23,34,23,36],[23,37,23,41],[23,42,23,43],[24,23,24,27],[24,34,24,36],[24,37,24,41],[24,42,24,43],[25,5,25,31],[26,9,26,11],[26,13,26,31],[29,12,29,16],[29,19,29,23],[29,26,29,30],[30,12,30,15],[30,19,30,22],[30,26,30,29],[31,16,31,22],[32,12,32,16],[32,19,32,23],[32,26,32,30],[33,12,33,15],[33,19,33,22],[33,26,33,29],[35,12,35,15],[35,19,35,22],[35,26,35,29],[37,12,37,15],[37,19,37,22],[37,26,37,29],[39,12,39,15],[39,19,39,22],[39,26,39,29],[40,12,40,15],[40,19,40,22],[40,26,40,29],[41,12,41,15],[41,19,41,22],[41,26,41,29],[42,12,42,15],[42,19,42,22],[42,26,42,29],[44,12,44,15],[44,19,44,22],[44,26,44,29],[45,12,45,15],[45,19,45,22],[45,26,45,29],[46,12,46,15],[46,19,46,22],[46,26,46,29],[47,12,47,15],[47,19,47,22],[47,26,47,29],[49,12,49,15],[49,19,49,22],[49,26,49,29],[50,17,50,22],[51,17,51,22],[53,15,53,19],[54,15,54,19],[55,11,55,15],[55,18,55,22],[56,11,56,14],[56,18,56,21],[57,11,57,15],[57,18,57,22],[58,11,58,15],[58,18,58,22],[59,8,59,16],[59,18,59,19],[59,20,59,28],[64,2,64,31],[65,2,65,31],[66,2,66,31],[67,2,67,31],[68,2,68,31],[69,13,69,14],[69,16,69,17],[69,19,69,20],[70,13,70,14],[70,16,70,17],[70,19,70,20],[72,16,72,30],[73,16,73,30],[74,16,74,30],[76,2,76,31],[77,2,77,31],[78,2,78,31],[79,2,79,31],[80,2,80,31],[81,2,81,31],[82,2,82,31],[83,2,83,31],[84,2,84,31]]}
["建築計画概要書（第二面）"]
["建築物及びその敷地に関する事項",{"$nulls":32},"シートの保護を解除すると編集が可能になります（パスワードなし）"]
["【1.地名地番】",{"$nulls":5},{"$f":"IF(申三面!G3=\"\",\"\",申三面!G3)","v":""},{"$nulls":26},"確認申請書第三面を改行等修正された場合は反映されているか確認してください"]
["【2.住居表示】",{"$nulls":5},{"$f":"IF(申三面!G4=\"\",\"\",申三面!G4)","v":""}]
["【3.都市計画区域及び準都市計画区域の内外の別等】"]
[null,{"$f":"IF(申三面!B6=\"\",\"\",申三面!B6)","v":"□"},"都市計画区域内",{"$nulls":5},"（ ",{"$f":"IF(申三面!J6=\"\",\"\",申三面!J6)","v":"□"},"市街化区域",{"$nulls":4},{"$f":"IF(申三面!P6=\"\",\"\",申三面!P6)","v":"□"},"市街化調整区域",{"$nulls":6},{"$f":"IF(申三面!X6=\"\",\"\",申三面!X6)","v":"□"},"区域区分非設定",{"$nulls":5},"）"]
[null,{"$f":"IF(申三面!B7=\"\",\"\",申三面!B7)","v":"□"},"準都市計画区域内",{"$nulls":6},{"$f":"IF(申三面!J7=\"\",\"\",申三面!J7)","v":"□"},"都市計画区域及び準都市計画区域外"]
["【4.防火地域】",{"$nulls":6},{"$f":"IF(申三面!H8=\"\",\"\",申三面!H8)","v":"□"},"防火地域",{"$nulls":3},{"$f":"IF(申三面!M8=\"\",\"\",申三面!M8)","v":"□"},"準防火地域",{"$nulls":4},{"$f":"IF(申三面!S8=\"\",\"\",申三面!S8)","v":"□"},"指定なし",null,null,"（",{"$f":"IF(申三面!X8=\"\",\"\",申三面!X8)","v":"□"},"法第22条区域 ）"]
["【5.その他の区域、地域、地区又は街区】",{"$nulls":13},{"$f":"IF(申三面!O9=\"\",\"\",申三面!O9)","v":""}]
[null,{"$f":"IF(申三面!B10=\"\",\"\",申三面!B10)","v":""}]
["【6.道路】"]
[null,"【イ.幅員】",{"$nulls":6},{"$f":"IF(申三面!I12=\"\",\"\",申三面!I12)","v":""},{"$nulls":6},{"$f":"IF(申三面!P12=\"\",\"\",申三面!P12)","v":""},{"$nulls":4},"ｍ"]
[null,"【ロ.敷地と接している部分の長さ】",{"$nulls":13},{"$f":"IF(申三面!P13=\"\",\"\",申三面!P13)","v":""},{"$nulls":4},"ｍ"]
["【7.敷地面積】"]
[null,"【イ.敷地面積】",{"$nulls":5},"（1）","（",{"$f":"IF(申三面!J15=\"\",\"\",申三面!J15)","v":""},null,null,"㎡","）","（",{"$f":"IF(申三面!P15=\"\",\"\",申三面!P15)","v":""},null,null,{"$f":"IF(P15=\"\",\"\",\"㎡\")","v":""},"）","（",{"$f":"IF(申三面!V15=\"\",\"\",申三面!V15)","v":""},null,null,{"$f":"IF(V15=\"\",\"\",\"㎡\")","v":""},"）","（",{"$f":"IF(申三面!AB15=\"\",\"\",申三面!AB15)","v":""},null,null,{"$f":"IF(AB15=\"\",\"\",\"㎡\")","v":""},"）"]
[{"$nulls":7},"（2）","（",{"$f":"IF(申三面!J16=\"\",\"\",申三面!J16)","v":""},null,null,{"$f":"IF(J16=\"\",\"\",\"㎡\")","v":""},"）","（",{"$f":"IF(申三面!P16=\"\",\"\",申三面!P16)","v":""},null,null,{"$f":"IF(P16=\"\",\"\",\"㎡\")","v":""},"）","（",{"$f":"IF(申三面!V16=\"\",\"\",申三面!V16)","v":""},null,null,{"$f":"IF(V16=\"\",\"\",\"㎡\")","v":""},"）","（",{"$f":"IF(申三面!AB16=\"\",\"\",申三面!AB16)","v":""},null,null,{"$f":"IF(AB16=\"\",\"\",\"㎡\")","v":""},"）"]
[null,"【ロ.用途地域等】",{"$nulls":6},"（",{"$f":"IF(申三面!J17=\"\",\"\",申三面!J17)","v":""},{"$nulls":3},"）","（",{"$f":"IF(申三面!P17=\"\",\"\",申三面!P17)","v":""},{"$nulls":3},"）","（",{"$f":"IF(申三面!V17=\"\",\"\",申三面!V17)","v":""},{"$nulls":3},"）","（",{"$f":"IF(申三面!AB17=\"\",\"\",申三面!AB17)","v":""},{"$nulls":3},"）"]
[null,"【ハ.建築基準法第52条第１項及び第２項の規定による建築物の容積率】"]
[{"$nulls":8},"（",{"$f":"IF(申三面!J19=\"\",\"\",申三面!J19)","v":""},null,null,"％","）","（",{"$f":"IF(申三面!P19=\"\",\"\",申三面!P19)","v":""},null,null,{"$f":"IF(P19=\"\",\"\",\"％\")","v":""},"）","（",{"$f":"IF(申三面!V19=\"\",\"\",申三面!V19)","v":""},null,null,{"$f":"IF(V19=\"\",\"\",\"％\")","v":""},"）","（",{"$f":"IF(申三面!AB19=\"\",\"\",申三面!AB19)","v":""},null,null,{"$f":"IF(AB19=\"\",\"\",\"％\")","v":""},"）"]
[null,"【ニ.建築基準法第53条第１項の規定による建築物の建蔽率】"]
[{"$nulls":8},"（",{"$f":"IF(申三面!J21=\"\",\"\",申三面!J21)","v":""},null,null,"％","）","（",{"$f":"IF(申三面!P21=\"\",\"\",申三面!P21)","v":""},null,null,{"$f":"IF(P21=\"\",\"\",\"％\")","v":""},"）","（",{"$f":"IF(申三面!V21=\"\",\"\",申三面!V21)","v":""},null,null,{"$f":"IF(V21=\"\",\"\",\"％\")","v":""},"）","（",{"$f":"IF(申三面!AB21=\"\",\"\",申三面!AB21)","v":""},null,null,{"$f":"IF(AB21=\"\",\"\",\"％\")","v":""},"）"]
[null,"【ホ.敷地面積の合計】",{"$nulls":9},"（1）",{"$f":"IF(申三面!M22=\"\",\"\",申三面!M22)","v":""},{"$nulls":4},"㎡"]
[{"$nulls":11},"（2）",{"$f":"IF(申三面!M23=\"\",\"\",申三面!M23)","v":""},{"$nulls":4},"㎡"]
[null,"【ヘ.敷地に建築可能な延べ面積を敷地面積で除した数値】",{"$nulls":21},{"$f":"IF(申三面!X24=\"\",\"\",申三面!X24)","v":""},{"$nulls":4},{"$f":"IF(X24=\"\",\"\",\"％\")","v":""}]
[null,"【ト.敷地に建築可能な建築面積を敷地面積で除した数値】",{"$nulls":21},{"$f":"IF(申三面!X25=\"\",\"\",申三面!X25)","v":""},{"$nulls":4},{"$f":"IF(X25=\"\",\"\",\"％\")","v":""}]
[null,"【チ.備考】",{"$nulls":3},{"$f":"IF(申三面!F26=\"\",\"\",申三面!F26)","v":""}]
["【8.主要用途】",{"$nulls":5},"( 区分",null,null,{"$f":"IF(申三面!J27=\"\",\"\",申三面!J27)","v":""},null,null,")",{"$f":"IF(申三面!N27=\"\",\"\",申三面!N27)","v":""}]
["【9.工事種別】"]
[null,{"$f":"IF(申三面!B29=\"\",\"\",申三面!B29)","v":"□"},"新築",null,{"$f":"IF(申三面!E29=\"\",\"\",申三面!E29)","v":"□"},"増築",null,{"$f":"IF(申三面!H29=\"\",\"\",申三面!H29)","v":"□"},"改築",null,{"$f":"IF(申三面!K29=\"\",\"\",申三面!K29)","v":"□"},"移転",null,{"$f":"IF(申三面!N29=\"\",\"\",申三面!N29)","v":"□"},"用途変更",{"$nulls":3},{"$f":"IF(申三面!S29=\"\",\"\",申三面!S29)","v":"□"},"大規模の修繕",{"$nulls":4},{"$f":"IF(申三面!Y29=\"\",\"\",申三面!Y29)","v":"□"},"大規模の模様替"]
["【10.建築面積】",{"$nulls":10},"（","申請部分",{"$nulls":4},"）","（","申請以外の部分",{"$nulls":4},"）","（","合計",{"$nulls":4},"）"]
[null,"【イ.建築面積】",{"$nulls":9},"（",{"$f":"IF(申三面!M31=\"\",\"\",申三面!M31)","v":""},{"$nulls":3},"㎡","）","（",{"$f":"IF(申三面!T31=\"\",\"\",申三面!T31)","v":""},{"$nulls":3},{"$f":"IF(T31=\"\",\"\",\"㎡\")","v":""},"）","（",{"$f":"IF(申三面!AA31=\"\",\"\",申三面!AA31)","v":""},{"$nulls":3},"㎡","）"]
[null,"【ロ.建蔽率】",{"$nulls":14},{"$f":"IF(申三面!Q32=\"\",\"\",申三面!Q32)","v":""},{"$nulls":6},"％"]
["【11.延べ面積】",{"$nulls":10},"（","申請部分",{"$nulls":4},"）","（","申請以外の部分",{"$nulls":4},"）","（","合計",{"$nulls":4},"）"]
[null,"【イ.建築物全体】",{"$nulls":9},"（",{"$f":"IF(申三面!M34=\"\",\"\",申三面!M34)","v":""},{"$nulls":3},"㎡","）","（",{"$f":"IF(申三面!T34=\"\",\"\",申三面!T34)","v":""},{"$nulls":3},{"$f":"IF(T34=\"\",\"\",\"㎡\")","v":""},"）","（",{"$f":"IF(申三面!AA34=\"\",\"\",申三面!AA34)","v":""},{"$nulls":3},"㎡","）"]
[null,"【ロ.地階の住宅又は老人ホーム、福祉ホームその他これらに類するものの部分】"]
[{"$nulls":11},"（",{"$f":"IF(申三面!M36=\"\",\"\",申三面!M36)","v":""},{"$nulls":3},{"$f":"IF(M36=\"\",\"\",\"㎡\")","v":""},"）","（",{"$f":"IF(申三面!T36=\"\",\"\",申三面!T36)","v":""},{"$nulls":3},{"$f":"IF(T36=\"\",\"\",\"㎡\")","v":""},"）","（",{"$f":"IF(申三面!AA36=\"\",\"\",申三面!AA36)","v":""},{"$nulls":3},{"$f":"IF(AA36=\"\",\"\",\"㎡\")","v":""},"）"]
[null,"【ハ.エレベーターの昇降路の部分】"]
[{"$nulls":11},"（",{"$f":"IF(申三面!M38=\"\",\"\",申三面!M38)","v":""},{"$nulls":3},{"$f":"IF(M38=\"\",\"\",\"㎡\")","v":""},"）","（",{"$f":"IF(申三面!T38=\"\",\"\",申三面!T38)","v":""},{"$nulls":3},{"$f":"IF(T38=\"\",\"\",\"㎡\")","v":""},"）","（",{"$f":"IF(申三面!AA38=\"\",\"\",申三面!AA38)","v":""},{"$nulls":3},{"$f":"IF(AA38=\"\",\"\",\"㎡\")","v":""},"）"]
[null,"【ニ.共同住宅の共用の廊下等の部分】"]
[{"$nulls":11},"（",{"$f":"IF(申三面!M40=\"\",\"\",申三面!M40)","v":""},{"$nulls":3},{"$f":"IF(M40=\"\",\"\",\"㎡\")","v":""},"）","（",{"$f":"IF(申三面!T40=\"\",\"\",申三面!T40)","v":""},{"$nulls":3},{"$f":"IF(T40=\"\",\"\",\"㎡\")","v":""},"）","（",{"$f":"IF(申三面!AA40=\"\",\"\",申三面!AA40)","v":""},{"$nulls":3},{"$f":"IF(AA40=\"\",\"\",\"㎡\")","v":""},"）"]
[null,"【ホ.自動車車庫等の部分】",{"$nulls":9},"（",{"$f":"IF(申三面!M41=\"\",\"\",申三面!M41)","v":""},{"$nulls":3},{"$f":"IF(M41=\"\",\"\",\"㎡\")","v":""},"）","（",{"$f":"IF(申三面!T41=\"\",\"\",申三面!T41)","v":""},{"$nulls":3},{"$f":"IF(T41=\"\",\"\",\"㎡\")","v":""},"）","（",{"$f":"IF(申三面!AA41=\"\",\"\",申三面!AA41)","v":""},{"$nulls":3},{"$f":"IF(AA41=\"\",\"\",\"㎡\")","v":""},"）"]
[null,"【ヘ.備蓄倉庫の部分】",{"$nulls":9},"（",{"$f":"IF(申三面!M42=\"\",\"\",申三面!M42)","v":""},{"$nulls":3},{"$f":"IF(M42=\"\",\"\",\"㎡\")","v":""},"）","（",{"$f":"IF(申三面!T42=\"\",\"\",申三面!T42)","v":""},{"$nulls":3},{"$f":"IF(T42=\"\",\"\",\"㎡\")","v":""},"）","（",{"$f":"IF(申三面!AA42=\"\",\"\",申三面!AA42)","v":""},{"$nulls":3},{"$f":"IF(AA42=\"\",\"\",\"㎡\")","v":""},"）"]
[null,"【ト.蓄電池の設置部分】",{"$nulls":9},"（",{"$f":"IF(申三面!M43=\"\",\"\",申三面!M43)","v":""},{"$nulls":3},{"$f":"IF(M43=\"\",\"\",\"㎡\")","v":""},"）","（",{"$f":"IF(申三面!T43=\"\",\"\",申三面!T43)","v":""},{"$nulls":3},{"$f":"IF(T43=\"\",\"\",\"㎡\")","v":""},"）","（",{"$f":"IF(申三面!AA43=\"\",\"\",申三面!AA43)","v":""},{"$nulls":3},{"$f":"IF(AA43=\"\",\"\",\"㎡\")","v":""},"）"]
[null,"【チ.自家発電設備の設置部分】"]
[{"$nulls":11},"（",{"$f":"IF(申三面!M45=\"\",\"\",申三面!M45)","v":""},{"$nulls":3},{"$f":"IF(M45=\"\",\"\",\"㎡\")","v":""},"）","（",{"$f":"IF(申三面!T45=\"\",\"\",申三面!T45)","v":""},{"$nulls":3},{"$f":"IF(T45=\"\",\"\",\"㎡\")","v":""},"）","（",{"$f":"IF(申三面!AA45=\"\",\"\",申三面!AA45)","v":""},{"$nulls":3},{"$f":"IF(AA45=\"\",\"\",\"㎡\")","v":""},"）"]
[null,"【リ.貯水槽の設置部分】",{"$nulls":9},"（",{"$f":"IF(申三面!M46=\"\",\"\",申三面!M46)","v":""},{"$nulls":3},{"$f":"IF(M46=\"\",\"\",\"㎡\")","v":""},"）","（",{"$f":"IF(申三面!T46=\"\",\"\",申三面!T46)","v":""},{"$nulls":3},{"$f":"IF(T46=\"\",\"\",\"㎡\")","v":""},"）","（",{"$f":"IF(申三面!AA46=\"\",\"\",申三面!AA46)","v":""},{"$nulls":3},{"$f":"IF(AA46=\"\",\"\",\"㎡\")","v":""},"）"]
[null,"【ヌ.宅配ボックスの設置部分】",{"$nulls":9},"（",{"$f":"IF(申三面!M47=\"\",\"\",申三面!M47)","v":""},{"$nulls":3},{"$f":"IF(M47=\"\",\"\",\"㎡\")","v":""},"）","（",{"$f":"IF(申三面!T47=\"\",\"\",申三面!T47)","v":""},{"$nulls":3},{"$f":"IF(T47=\"\",\"\",\"㎡\")","v":""},"）","（",{"$f":"IF(申三面!AA47=\"\",\"\",申三面!AA47)","v":""},{"$nulls":3},{"$f":"IF(AA47=\"\",\"\",\"㎡\")","v":""},"）"]
[null,"【ル.住宅の部分】",{"$nulls":9},"（",{"$f":"IF(申三面!M48=\"\",\"\",申三面!M48)","v":""},{"$nulls":3},{"$f":"IF(M48=\"\",\"\",\"㎡\")","v":""},"）","（",{"$f":"IF(申三面!T48=\"\",\"\",申三面!T48)","v":""},{"$nulls":3},{"$f":"IF(T48=\"\",\"\",\"㎡\")","v":""},"）","（",{"$f":"IF(申三面!AA48=\"\",\"\",申三面!AA48)","v":""},{"$nulls":3},{"$f":"IF(AA48=\"\",\"\",\"㎡\")","v":""},"）"]
[null,"【ヲ.老人ホーム、福祉ホームその他これらに類するものの部分】"]
[{"$nulls":11},"（",{"$f":"IF(申三面!M50=\"\",\"\",申三面!M50)","v":""},{"$nulls":3},{"$f":"IF(M50=\"\",\"\",\"㎡\")","v":""},"）","（",{"$f":"IF(申三面!T50=\"\",\"\",申三面!T50)","v":""},{"$nulls":3},{"$f":"IF(T50=\"\",\"\",\"㎡\")","v":""},"）","（",{"$f":"IF(申三面!AA50=\"\",\"\",申三面!AA50)","v":""},{"$nulls":3},{"$f":"IF(AA50=\"\",\"\",\"㎡\")","v":""},"）"]
[null,"【ワ.延べ面積】",{"$nulls":15},{"$f":"IF(申三面!R51=\"\",\"\",申三面!R51)","v":""},{"$nulls":5},"㎡"]
[null,"【カ.容積率】",{"$nulls":14},{"$f":"IF(M51=\"\",\"\",ROUNDUP(AA51/M39*100,2))","v":""},{"$f":"IF(申三面!R52=\"\",\"\",申三面!R52)","v":""},{"$nulls":5},"％"]
["【12.建築物の数】"]
[null,"【イ.申請に係る建築物の数】",{"$nulls":13},{"$f":"IF(申三面!P54=\"\",\"\",申三面!P54)","v":""}]
[null,"【ロ.同一敷地内の他の建築物の数】",{"$nulls":13},{"$f":"IF(申三面!P55=\"\",\"\",申三面!P55)","v":""}]
["【13.建築物の高さ等】",{"$nulls":9},"（","申請に係る建築物",{"$nulls":4},"）","（","他の建築物",{"$nulls":4},"）"]
[null,"【イ.最高の高さ】",{"$nulls":8},"（",{"$f":"IF(申三面!L57=\"\",\"\",申三面!L57)","v":""},{"$nulls":3},"ｍ","）","（",{"$f":"IF(申三面!S57=\"\",\"\",申三面!S57)","v":""},{"$nulls":3},{"$f":"IF(S57=\"\",\"\",\"ｍ\")","v":""},"）"]
[null,"【ロ.階数】",{"$nulls":6},"地上",null,"（",{"$f":"IF(申三面!L58=\"\",\"\",申三面!L58)","v":""},{"$nulls":4},"）","（",{"$f":"IF(申三面!S58=\"\",\"\",申三面!S58)","v":""},{"$nulls":4},"）"]
[{"$nulls":8},"地下",null,"（",{"$f":"IF(申三面!L59=\"\",\"\",申三面!L59)","v":""},{"$nulls":4},"）","（",{"$f":"IF(申三面!S59=\"\",\"\",申三面!S59)","v":""},{"$nulls":4},"）"]
[null,"【ハ.構造】",{"$nulls":6},{"$f":"IF(申三面!I60=\"\",\"\",申三面!I60)","v":""},{"$nulls":9},{"$f":"IF(申三面!S60=\"\",\"\",申三面!S60)","v":"一部"},null,{"$f":"IF(申三面!U60=\"\",\"\",申三面!U60)","v":""}]
[null,"【ニ.建築基準法第56条第7項の規定による特例の適用の有無】",{"$nulls":20},{"$f":"IF(申三面!W61=\"\",\"\",申三面!W61)","v":"□"},"有",null,{"$f":"IF(申三面!Z61=\"\",\"\",申三面!Z61)","v":"□"},"無"]
[null,"【ホ.適用があるときは、特例の区分】"]
[{"$nulls":3},{"$f":"IF(申三面!D63=\"\",\"\",申三面!D63)","v":"□"},"道路高さ制限不適用",{"$nulls":7},{"$f":"IF(申三面!M63=\"\",\"\",申三面!M63)","v":"□"},"隣地高さ制限不適用",{"$nulls":7},{"$f":"IF(申三面!V63=\"\",\"\",申三面!V63)","v":"□"},"北側高さ制限不適用"]
["【14.許可・認定等】"]
[null,null,{"$f":"IF(申三面!C65=\"\",\"\",申三面!C65)","v":""}]
[null,null,{"$f":"IF(申三面!C66=\"\",\"\",申三面!C66)","v":""}]
[null,null,{"$f":"IF(申三面!C67=\"\",\"\",申三面!C67)","v":""}]
[null,null,{"$f":"IF(申三面!C68=\"\",\"\",申三面!C68)","v":""}]
[{"$nulls":33},"←","書き込み可能"]
["【15.工事着手予定年月日】",{"$nulls":10},{"$f":"IF(申三面!L69=\"\",\"\",申三面!L69)","v":"令和"},null,{"$f":"IF(申三面!N69=\"\",\"\",申三面!N69)","v":""},null,"年",{"$f":"IF(申三面!Q69=\"\",\"\",申三面!Q69)","v":""},null,"月",{"$f":"IF(申三面!T69=\"\",\"\",申三面!T69)","v":""},null,"日",{"$nulls":12},"建築物エネルギー消費性能確保計画の判定番号・日付　等記入"]
["【16.工事完了予定年月日】",{"$nulls":10},{"$f":"IF(申三面!L70=\"\",\"\",申三面!L70)","v":"令和"},null,{"$f":"IF(申三面!N70=\"\",\"\",申三面!N70)","v":""},null,"年",{"$f":"IF(申三面!Q70=\"\",\"\",申三面!Q70)","v":""},null,"月",{"$f":"IF(申三面!T70=\"\",\"\",申三面!T70)","v":""},null,"日"]
["【17.特定工程工事終了予定年月日】",{"$nulls":15},"（特定工程）"]
[null,null,"（ 第",null,{"$f":"IF(申三面!E72=\"\",\"\",申三面!E72)","v":""},"回 ）",null,null,{"$f":"IF(申三面!H72=\"\",\"\",申三面!H72)","v":"令和"},{"$f":"IF(申三面!J72=\"\",\"\",申三面!J72)","v":""},"年",{"$f":"IF(申三面!L72=\"\",\"\",申三面!L72)","v":""},"月",{"$f":"IF(申三面!N72=\"\",\"\",申三面!N72)","v":""},"日","（",{"$f":"IF(申三面!Q72=\"\",\"\",申三面!Q72)","v":""},{"$nulls":14},"）"]
[null,null,"（ 第",null,{"$f":"IF(申三面!E73=\"\",\"\",申三面!E73)","v":""},"回 ）",null,null,{"$f":"IF(申三面!H73=\"\",\"\",申三面!H73)","v":"令和"},{"$f":"IF(申三面!J73=\"\",\"\",申三面!J73)","v":""},"年",{"$f":"IF(申三面!L73=\"\",\"\",申三面!L73)","v":""},"月",{"$f":"IF(申三面!N73=\"\",\"\",申三面!N73)","v":""},"日","（",{"$f":"IF(申三面!Q73=\"\",\"\",申三面!Q73)","v":""},{"$nulls":14},"）"]
[null,null,"（ 第",null,{"$f":"IF(申三面!E74=\"\",\"\",申三面!E74)","v":""},"回 ）",null,null,{"$f":"IF(申三面!H74=\"\",\"\",申三面!H74)","v":"令和"},{"$f":"IF(申三面!J74=\"\",\"\",申三面!J74)","v":""},"年",{"$f":"IF(申三面!L74=\"\",\"\",申三面!L74)","v":""},"月",{"$f":"IF(申三面!N74=\"\",\"\",申三面!N74)","v":""},"日","（",{"$f":"IF(申三面!Q74=\"\",\"\",申三面!Q74)","v":""},{"$nulls":14},"）"]
["【18.その他必要な事項】"]
[null,null,{"$f":"IF(申三面!C76=\"\",\"\",申三面!C76)","v":""}]
[null,null,{"$f":"IF(申三面!C77=\"\",\"\",申三面!C77)","v":""}]
[null,null,{"$f":"IF(申三面!C78=\"\",\"\",申三面!C78)","v":""}]
[null,null,{"$f":"IF(申三面!C80=\"\",\"\",申三面!C80)","v":""}]
[null,null,{"$f":"IF(申三面!C81=\"\",\"\",申三面!C81)","v":""}]
[null,null,{"$f":"IF(申三面!C82=\"\",\"\",申三面!C82)","v":""}]
[null,null,{"$f":"IF(申三面!C83=\"\",\"\",申三面!C83)","v":""}]
[{"$nulls":33},"←","書き込み可能"]

{"sheet":"概三面","index":12,"n_rows":21,"n_cols":40,"rows_kept":21,"merged":[[0,0,0,28],[2,4,2,28],[3,0,17,28],[18,3,18,28],[19,0,37,28],[44,0,44,28]]}
["建築計画概要書（第三面）"]
[]
["　付近見取図",{"$nulls":37},"（注意）第三面"]
[{"$nulls":38},"A4サイズ1枚での提出をお願いします。A4サイズ1枚では小さすぎる場合に限り2枚に分けて"]
[{"$nulls":38},"ください。A3サイズは提出不可の行政があります。"]
[{"$nulls":38},"①","付近見取図には、方位、道路及び目標となる地物を明示してください。"]
{"$rows_empty":12}
["　配置図",{"$nulls":37},"②","配置図には、縮尺、方位、敷地境界線、敷地内における建築物の位置、申請に係る建"]
[{"$nulls":39},"築物と他の建築物との別並びに敷地の接する道路の位置及び幅員を明示してください。"]
[{"$nulls":39},"建築物の高さも明示"]

{"sheet":"工一面","index":13,"n_rows":63,"n_cols":50,"rows_kept":63,"merged":[[7,23,7,24],[7,25,7,26],[9,1,9,7],[13,6,13,28],[14,7,14,12],[15,6,15,30],[16,6,16,12],[20,6,20,30],[20,33,21,35],[20,36,21,40],[21,11,21,30],[22,7,22,12],[23,6,23,30],[24,6,24,12],[28,6,28,30],[29,11,29,30],[30,7,30,12],[31,6,31,30],[32,6,32,12],[36,13,36,17],[36,19,36,20],[42,6,42,28],[43,6,43,30],[44,7,44,12],[45,6,45,30],[46,6,46,12]]}
["第四十号様式（第八条関係）",{"$nulls":9},"（Ａ４）"]
[{"$nulls":33},"シートの保護を解除すると編集が可能になります（パスワードなし）"]
["建築基準法第１５条第１項の規定による"]
["建築工事届"]
["（第一面）",{"$nulls":47},"（注意）"]
[{"$nulls":48},"共通：　数字は算用数字を、単位はメートル法を用いてください。"]
["　　　　　　　　　　　",{"$nulls":47},"①　申請者又は設計者の氏名の記載を自署で行う場合においては、押印を省略することができます。"]
[{"$nulls":23},{"$f":"IF(申一面!X17=\"\",\"\",申一面!X17)","v":"令和"},{"$nulls":3},"年",null,"月",null,"日",{"$nulls":16},"②　※印のある欄は記入しないでください。"]
[{"$nulls":48},"③","除却工事施工者欄は、既存の建築物を除却し、引き続き、当該敷地内において建築物を建築"]
[{"$nulls":9},"様",{"$nulls":39},"しようとする場合に記入してください。"]
[]
[]
[null,"建築主"]
[null,null,"氏名",{"$nulls":3},{"$f":"IF(申二面!J7=\"\",\"\",IF(別紙追加様式!J6=\"\",申二面!J7,申二面!J7&\"　　　\"&別紙追加様式!J6))","v":""},{"$nulls":22},"印"]
[null,null,"郵便番号",{"$nulls":3},"〒",{"$f":"IF(申二面!K8=\"\",\"\",申二面!K8)","v":""}]
[null,null,"住所",{"$nulls":3},{"$f":"IF(申二面!J9=\"\",\"\",申二面!J9)","v":""}]
[null,null,"電話番号",{"$nulls":3},{"$f":"IF(申二面!J10=\"\",\"\",申二面!J10)","v":""}]
[]
[]
[null,"工事施工者（設計者又は代理者）"]
[null,null,"氏名",{"$nulls":3},{"$f":"IF(申二面!J26=\"\",\"\",IF(工一面!AK21=工一面!B63,申二面!J15,IF(工一面!AK21=工一面!B62,申二面!J26,IF(申二面!H164=\"\",\"\",申二面!H164))))","v":""},{"$nulls":26},"←左欄の記載",null,null,"工事施工者"]
[null,null,"営業所名（建築士事務所名）",{"$nulls":8},{"$f":"IF(申二面!J26=\"\",\"\",IF(工一面!AK21=工一面!B63,申二面!J17,IF(工一面!AK21=工一面!B62,申二面!J28,IF(申二面!H166=\"\",\"\",申二面!H166))))","v":""}]
[null,null,"郵便番号",{"$nulls":3},"〒",{"$f":"IF(申二面!J26=\"\",\"\",IF(工一面!AK21=工一面!B63,申二面!K18,IF(工一面!AK21=工一面!B62,申二面!K29,IF(申二面!I167=\"\",\"\",申二面!I167))))","v":""}]
[null,null,"所在地",{"$nulls":3},{"$f":"IF(申二面!J26=\"\",\"\",IF(工一面!AK21=工一面!B63,申二面!J19,IF(工一面!AK21=工一面!B62,申二面!J30,IF(申二面!H168=\"\",\"\",申二面!H168))))","v":""}]
[null,null,"電話番号",{"$nulls":3},{"$f":"IF(申二面!J26=\"\",\"\",IF(工一面!AK21=工一面!B63,申二面!J20,IF(工一面!AK21=工一面!B62,申二面!J31,IF(申二面!H169=\"\",\"\",申二面!H169))))","v":""}]
[]
[]
[null,"工事監理者"]
[null,null,"氏名",{"$nulls":3},{"$f":"IF(申二面!J126=\"\",\"\",申二面!J126)","v":""}]
[null,null,"営業所名（建築士事務所名）",{"$nulls":8},{"$f":"IF(申二面!J128=\"\",\"\",申二面!J128)","v":""}]
[null,null,"郵便番号",{"$nulls":3},"〒",{"$f":"IF(申二面!K129=\"\",\"\",申二面!K129)","v":""}]
[null,null,"所在地",{"$nulls":3},{"$f":"IF(申二面!J130=\"\",\"\",申二面!J130)","v":""}]
[null,null,"電話番号",{"$nulls":3},{"$f":"IF(申二面!J131=\"\",\"\",申二面!J131)","v":""}]
[]
[]
[null,"建築確認"]
[null,null,"確認済証番号",{"$nulls":7},"第",null,null,"確認建機構ア",{"$nulls":4},{"$f":"IF(受付用!B9=\"\",\"\",受付用!B9)","v":""},{"$f":"IF(受付用!C9=\"\",\"\",受付用!C9)","v":""},{"$nulls":5},"号"]
[null,null,"確認済証交付年月日",{"$nulls":7},{"$f":"IF(申一面!Y17=\"\",\"\",申一面!Y17)","v":""},null,null,"年",null,"月",null,"日"]
[null,null,"確認済証交付者",{"$nulls":7},"株式会社確認検査機構アネックス"]
[]
[]
[null,"除却工事施工者"]
[null,null,"氏名",{"$nulls":26},"印"]
[null,null,"営業所名"]
[null,null,"郵便番号",{"$nulls":3},{"$f":"IF(H45=\"\",\"\",\"〒\")","v":""}]
[null,null,"所在地"]
[null,null,"電話番号"]
[]
[]
["※受付経由機関記載欄"]
[]
[]
[]
[]
[]
[null,"滋賀県知事"]
[null,"京都府知事"]
[null,"大阪府知事"]
[null,"奈良県知事"]
[]
[null,"工事施工者"]
[null,"設計者"]
[null,"代理者"]

{"sheet":"工二面","index":14,"n_rows":91,"n_cols":75,"rows_kept":91,"merged":[[0,1,0,33],[4,6,4,7],[4,10,4,11],[4,16,4,17],[5,6,5,7],[5,11,5,12],[5,20,5,21],[6,6,6,7],[6,13,6,14],[6,28,6,29],[7,6,7,7],[7,18,7,19],[7,25,7,26],[8,6,8,7],[8,14,8,15],[8,22,8,23],[8,28,8,29],[9,11,9,12],[9,18,9,19],[9,28,9,29],[10,9,10,10],[10,19,10,20],[11,15,11,20],[15,8,15,34],[15,67,15,75],[16,8,16,9],[16,15,16,16],[16,67,16,75],[17,8,17,9],[17,21,17,22],[17,67,17,75],[18,8,18,9],[18,67,18,75],[19,67,19,75],[20,67,20,75],[21,11,21,12],[21,14,21,15],[21,17,21,18],[21,24,21,25],[21,27,21,28],[21,30,21,31],[22,11,22,12],[22,14,22,15],[22,17,22,18],[23,11,23,12],[23,14,23,15],[25,46,25,73],[26,8,26,9],[26,13,26,14],[26,18,26,19],[26,23,26,24],[26,74,26,75],[27,74,27,75],[28,74,28,75],[29,8,29,9],[29,17,29,20],[29,74,29,75],[30,8,30,9],[30,17,30,20],[31,8,31,9],[31,17,31,20],[34,74,34,75],[35,12,35,17],[35,20,35,25],[35,28,35,33],[35,74,35,75],[36,13,36,16],[36,21,36,24],[36,29,36,32],[36,74,36,75],[37,11,37,12],[37,19,37,20],[37,27,37,28],[38,11,38,12],[38,19,38,20],[38,27,38,28],[40,11,40,12],[40,19,40,20],[40,27,40,28],[40,74,40,75],[41,11,41,12],[41,19,41,20],[41,27,41,28],[42,11,42,12],[42,19,42,20],[42,27,42,28],[42,74,42,75],[43,11,43,12],[43,19,43,20],[43,27,43,28],[43,74,43,75],[44,11,44,12],[44,19,44,20],[44,27,44,28],[44,74,44,75],[45,11,45,12],[45,19,45,20],[45,27,45,28],[45,74,45,75],[46,11,46,12],[46,19,46,20],[46,27,46,28],[46,74,46,75],[47,74,47,75],[48,11,48,12],[48,19,48,20],[48,27,48,28],[48,74,48,75],[49,11,49,12],[49,19,49,20],[49,27,49,28],[49,74,49,75],[50,11,50,12],[50,19,50,20],[50,27,50,28],[50,74,50,75],[51,11,51,12],[51,19,51,20],[51,27,51,28],[52,74,52,75],[53,12,53,15],[53,20,53,23],[53,28,53,31],[53,74,53,75],[54,12,54,15],[54,20,54,23],[54,28,54,31],[54,74,54,75],[55,12,55,17],[55,20,55,25],[55,28,55,33],[55,74,55,75],[56,12,56,17],[56,20,56,25],[56,28,56,33],[56,74,56,75],[57,74,57,75],[58,74,58,75],[59,16,59,20],[59,74,59,75],[60,74,60,75],[62,74,62,75],[64,74,64,75],[65,74,65,75],[66,74,66,75],[67,74,67,75],[68,74,68,75],[69,74,69,75],[70,74,70,75],[71,74,71,75],[73,6,73,7],[76,74,76,75],[77,74,77,75]]}
[null,"（第二面）"]
[{"$nulls":37},"シートの保護を解除すると編集が可能になります（パスワードなし）"]
[]
[null,"【1.建築主】",{"$nulls":43},"（注意）第三面"]
[null,null,"【イ.種別】",{"$nulls":3},"（1）",null,"国",null,"（2）",null,"都道府県",{"$nulls":3},"（3）",null,"市町村",{"$nulls":26},"①","１欄の「イ」、２欄の「ロ」、４欄及び６欄の「ハ」は、該当する番号を○印で囲んでください。"]
[{"$nulls":6},"（4）",null,"会社",null,null,"（5）",null,"会社でない団体",{"$nulls":6},"（6）",null,"個人",{"$nulls":22},"②","１欄の「イ」において、「会社」とは、株式会社、合名会社、合資会社及び合同会社をいい、特別の法"]
[null,null,"【ロ.業種】",{"$nulls":3},"（1）",null,"農林水産業",{"$nulls":4},"（2）",null,"鉱業，採石業，砂利採取業，建設業",{"$nulls":12},"（3）",null,"製造業",{"$nulls":15},"律により設立された法人で会社であるものを含みます。"]
[{"$nulls":6},"（4）",null,"電気・ガス・熱供給・水道業",{"$nulls":9},"（5）",null,"情報通信業",{"$nulls":4},"（6）",null,"運輸業",{"$nulls":17},"③","１欄の「ロ」及び「ハ」は、建築主が会社であるときのみ記入してください。"]
[{"$nulls":6},"（7）",null,"卸売業，小売業",{"$nulls":5},"（8）",null,"金融業，保険業",{"$nulls":5},"（9）",null,"不動産業",{"$nulls":3},"（10）",null,"宿泊業，飲食",{"$nulls":14},"④","１欄の「ロ」は、該当する番号（兼業の場合は、売上高の最も大きいもの）を〇印で囲んでください。"]
[{"$nulls":6},"サービス業",{"$nulls":4},"（11）",null,"医療，福祉",{"$nulls":4},"（12）",null,"教育，学習支援業",{"$nulls":7},"（13）",null,"その他のサー",{"$nulls":14},"⑤","２欄の「ロ」において、「区域区分非設定都市計画区域」とは、区域区分が定められていない都市計"]
[{"$nulls":6},"ビス業",null,null,"（14）",null,"国家公務，地方公務",{"$nulls":7},"（15）",null,"他に分類されないもの",{"$nulls":24},"画区域をいいます。"]
[null,null,"【ハ.資本の額又は出資の総額】",{"$nulls":18},"百万円",{"$nulls":23},"⑥","増築と改築とを同時に行うときは、４欄は床面積の大きい方の工事によつて区分してください。"]
[{"$nulls":45},"⑦","５欄は、(1)から(3)までのうち該当する番号を〇印で囲んでください。"]
[{"$nulls":45},"⑧","５欄において「(1)居住専用建築物」に該当する場合は、次の表の記号の中から該当するものを選ん"]
[null,"【2.敷地の位置】",{"$nulls":44},"で括弧内に記入してください。"]
[null,null,"【イ.地名地番】",{"$nulls":5},{"$f":"IF(申三面!G3=\"\",\"\",申三面!G3)","v":""},{"$nulls":37},"主要用途の区分",{"$nulls":20},"記号"]
[null,null,"【ロ.都市計画】",{"$nulls":5},"（1）",null,"市街化区域",{"$nulls":4},"（2）",null,"市街化調整区域",{"$nulls":28},"居住専用住宅（附属建築物を除く。）",{"$nulls":20},"01"]
[{"$nulls":8},"（3）",null,"区域区分非設定都市計画区域",{"$nulls":10},"（4）",null,"準都市計画区域",{"$nulls":22},"居住専用住宅附属建築物（物置，車庫等）",{"$nulls":20},"02"]
[{"$nulls":8},"（5）",null,"都市計画区域及び準都市計画区域外",{"$nulls":35},"寮，寄宿舎，合宿所（附属建築物を除く。）",{"$nulls":20},"03"]
[{"$nulls":46},"寮，寄宿舎，合宿所附属建築物（物置，車庫等）",{"$nulls":20},"04"]
[{"$nulls":46},"他に分類されない居住専用建築物",{"$nulls":20},"05"]
[null,"【3.工事予定期間】",{"$nulls":7},{"$f":"申三面!L69","v":"令和"},null,{"$f":"IF(申三面!N69=\"\",\"\",申三面!N69)","v":""},null,"年",{"$f":"IF(申三面!Q69=\"\",\"\",申三面!Q69)","v":""},null,"月",{"$f":"IF(申三面!T69=\"\",\"\",申三面!T69)","v":""},null,"日","から",{"$nulls":24},"⑨","５欄において「(2)居住産業併用建築物」及び「(3)産業専用建築物」に該当する場合は、産業の用に"]
[{"$nulls":9},{"$f":"申三面!L70","v":"令和"},null,{"$f":"IF(申三面!N70=\"\",\"\",申三面!N70)","v":""},null,"年",{"$f":"IF(申三面!Q70=\"\",\"\",申三面!Q70)","v":""},null,"月",{"$f":"IF(申三面!T70=\"\",\"\",申三面!T70)","v":""},null,"日","まで",{"$nulls":25},"供する部分について、次の表の記号の中から該当するものを選んで括弧内に記入してください。また、"]
[{"$nulls":13},"年",null,null,"月間",{"$nulls":29},"一敷地内に既存の建築物があるときは、記入に際しては、その部分と新たに建築する部分とを総合し"]
[{"$nulls":46},"て判断してください。"]
[{"$nulls":46},"主要用途の区分",{"$nulls":27},"記号"]
[null,"【4.工事種別】",{"$nulls":6},"（1）",null,"新築",null,null,"（2）",null,"増築",null,null,"（3）",null,"改築",null,null,"（4）",null,"移転",{"$nulls":20},"農林水産業",{"$nulls":8},"農業，林業，漁業，水産養殖業",{"$nulls":18},11]
[{"$nulls":46},"鉱業，採石業，砂利採取",{"$nulls":8},"鉱業，採石業，砂利採取業",{"$nulls":18},12]
[{"$nulls":46},"業，建設業",{"$nulls":8},"建設業",{"$nulls":18},13]
[null,"【5.主要用途】",{"$nulls":6},"（1）",null,"居住専用",{"$nulls":5},"（",{"$nulls":4},"）",{"$nulls":24},"製造業",{"$nulls":8},"食料品製造業，飲料・たばこ・飼料製造業，繊維工業，木",{"$nulls":18},14]
[{"$nulls":8},"（2）",null,"居住産業併用",{"$nulls":5},"（",{"$nulls":4},"）",{"$nulls":33},"材・木製品製造業，家具・装備品製造業，パルプ・紙・紙"]
[{"$nulls":8},"（3）",null,"産業専用",{"$nulls":5},"（",{"$nulls":4},"）",{"$nulls":33},"加工品製造業，印刷・同関連業，プラスチック製品製造業"]
[{"$nulls":55},"（記号15から記号18までに該当するものを除く。），窯業・"]
[{"$nulls":55},"土石製品製造業"]
[null,"【6.一の建築物ごとの内容】",{"$nulls":53},"化学工業，石油製品・石炭製品製造業",{"$nulls":18},15]
[null,null,"【イ.番号】",{"$nulls":8},"（",{"$nulls":6},"）","（",{"$nulls":6},"）","（",{"$nulls":6},"）",{"$nulls":20},"鉄鋼業，非鉄金属製造業，金属製品製造業",{"$nulls":18},16]
[null,null,"【ロ.用途】",{"$nulls":9},"（","多用途",{"$nulls":3},"）",null,null,"（","多用途",{"$nulls":3},"）",null,null,"（","多用途",{"$nulls":3},"）",{"$nulls":21},"はん用機械器具製造業，生産用機械器具製造業，業務",{"$nulls":18},17]
[{"$nulls":11},"（1）",null,"事務所等",{"$nulls":5},"（1）",null,"事務所等",{"$nulls":5},"（1）",null,"事務所等",{"$nulls":25},"用機械器具製造業，電子部品・デバイス・電子回路製造"]
[{"$nulls":11},"（2）",null,"物品販売業を",{"$nulls":5},"（2）",null,"物品販売業を",{"$nulls":5},"（2）",null,"物品販売業を",{"$nulls":25},"業，電気機械器具製造業，情報通信機械器具製造業，"]
[{"$nulls":13},"営む店舗等",{"$nulls":7},"営む店舗等",{"$nulls":7},"営む店舗等",{"$nulls":25},"輸送用機械器具製造業"]
[{"$nulls":11},"（3）",null,"工場，作業場",{"$nulls":5},"（3）",null,"工場，作業場",{"$nulls":5},"（3）",null,"工場，作業場",{"$nulls":25},"ゴム製品製造業，なめし革・同製品・毛皮製造業，その",{"$nulls":18},18]
[{"$nulls":11},"（4）",null,"倉庫",{"$nulls":5},"（4）",null,"倉庫",{"$nulls":5},"（4）",null,"倉庫",{"$nulls":25},"他の製造業"]
[{"$nulls":11},"（5）",null,"学校",{"$nulls":5},"（5）",null,"学校",{"$nulls":5},"（5）",null,"学校",{"$nulls":16},"電気・ガス・熱供給・",{"$nulls":8},"電気業",{"$nulls":18},19]
[{"$nulls":11},"（6）",null,"病院，診療所",{"$nulls":5},"（6）",null,"病院，診療所",{"$nulls":5},"（6）",null,"病院，診療所",{"$nulls":16},"水道業",{"$nulls":8},"ガス業",{"$nulls":18},20]
[{"$nulls":11},"（9）",null,"その他",{"$nulls":5},"（9）",null,"その他",{"$nulls":5},"（9）",null,"その他",{"$nulls":25},"熱供給業",{"$nulls":18},21]
[null,null,"【ハ.工事部分の構造】",{"$nulls":8},"（1）",null,"木造",{"$nulls":5},"（1）",null,"木造",{"$nulls":5},"（1）",null,"木造",{"$nulls":25},"水道業",{"$nulls":18},22]
[{"$nulls":11},"（2）",null,"鉄骨鉄筋ｺﾝｸﾘ",{"$nulls":5},"（2）",null,"鉄骨鉄筋ｺﾝｸﾘ",{"$nulls":5},"（2）",null,"鉄骨鉄筋ｺﾝｸﾘ",{"$nulls":16},"情報通信業",{"$nulls":8},"通信業",{"$nulls":18},23]
[{"$nulls":13},"ｰﾄ造",{"$nulls":7},"ｰﾄ造",{"$nulls":7},"ｰﾄ造",{"$nulls":25},"放送業，情報サービス業，インターネット附随サービス業",{"$nulls":18},24]
[{"$nulls":11},"（3）",null,"鉄筋ｺﾝｸﾘｰﾄ造",{"$nulls":5},"（3）",null,"鉄筋ｺﾝｸﾘｰﾄ造",{"$nulls":5},"（3）",null,"鉄筋ｺﾝｸﾘｰﾄ造",{"$nulls":25},"映像・音声・文字情報製作業（新聞業及び出版業を除く）",{"$nulls":18},25]
[{"$nulls":11},"（4）",null,"鉄骨造",{"$nulls":5},"（4）",null,"鉄骨造",{"$nulls":5},"（4）",null,"鉄骨造",{"$nulls":25},"映像・音声・文字情報制作業（新聞業及び出版業に限る）",{"$nulls":18},26]
[{"$nulls":11},"（5）",null,"ｺﾝｸﾘｰﾄﾌﾞﾛｯｸ造",{"$nulls":5},"（5）",null,"ｺﾝｸﾘｰﾄﾌﾞﾛｯｸ造",{"$nulls":5},"（5）",null,"ｺﾝｸﾘｰﾄﾌﾞﾛｯｸ造",{"$nulls":16},"運輸業",{"$nulls":8},"鉄道業，道路旅客運送業，道路貨物運送業，水運業，",{"$nulls":18},27]
[{"$nulls":11},"（6）",null,"その他 ",{"$nulls":5},"（6）",null,"その他 ",{"$nulls":5},"（6）",null,"その他 ",{"$nulls":25},"航空運輸業，倉庫業，運輸に附帯するサービス業"]
[null,null,"【ニ.工事部分の床面積の合計】",{"$nulls":43},"卸売業，小売業",{"$nulls":8},"卸売業，小売業",{"$nulls":18},28]
[{"$nulls":11},"（",{"$nulls":4},"㎡",null,"）","（",{"$nulls":4},"㎡",null,"）","（",{"$nulls":4},"㎡",null,"）",{"$nulls":11},"金融業，保険業",{"$nulls":8},"金融業，保険業",{"$nulls":18},29]
[null,null,"【ホ.建築工事費予定額】",{"$nulls":8},"（",{"$nulls":4},"万円",null,"）","（",{"$nulls":4},"万円",null,"）","（",{"$nulls":4},"万円",null,"）",{"$nulls":11},"不動産業",{"$nulls":8},"不動産取引業,不動産賃貸業・管理業（駐車場業を除く）",{"$nulls":18},30]
[null,null,"【へ.地上の階数】",{"$nulls":8},"（",{"$nulls":6},"）","（",{"$nulls":6},"）","（",{"$nulls":6},"）",{"$nulls":20},"不動産賃貸業・管理業（駐車場業に限る。）",{"$nulls":18},31]
[null,null,"【ト.地下の階数】",{"$nulls":8},"（",{"$nulls":6},"）","（",{"$nulls":6},"）","（",{"$nulls":6},"）",{"$nulls":11},"宿泊業，飲食サービス業",{"$nulls":8},"宿泊業",{"$nulls":18},32]
[{"$nulls":55},"飲食店，持ち帰り・配達飲食サービス業",{"$nulls":18},33]
[{"$nulls":46},"教育，学習支援業",{"$nulls":8},"学校教育",{"$nulls":18},34]
[null,"【7.新築工事の場合における敷地面積】",{"$nulls":19},"㎡",{"$nulls":33},"その他の教育及び学習支援業（社会教育に限る。）",{"$nulls":18},35]
[{"$nulls":55},"その他の教育及び学習支援業（学習塾及び教養・技能",{"$nulls":18},36]
[{"$nulls":55},"教授業に限る。）"]
[{"$nulls":55},"その他の教育及び学習支援業（記号35及び記号36に",{"$nulls":18},37]
[{"$nulls":55},"該当するものを除く。）"]
[{"$nulls":46},"医療，福祉",{"$nulls":8},"医療業，保健衛生",{"$nulls":18},38]
[{"$nulls":55},"社会保険・社会福祉・介護事業",{"$nulls":18},39]
[{"$nulls":46},"その他のサービス業",{"$nulls":8},"郵便業（信書便事業を含む。），郵便局",{"$nulls":18},40]
[null,"（1）","（①）",null,null,"多用途",{"$nulls":49},"学術・開発研究機関，政治・経済・文化団体",{"$nulls":18},41]
[null,"（2）","（②）",null,null,"○多用途",{"$nulls":49},"その他の生活関連サービス業（旅行業に限る。）",{"$nulls":18},42]
[null,"（3）","（③）",null,null,"単用途",{"$nulls":49},"娯楽業",{"$nulls":18},43]
[null,"（4）","（④）",{"$nulls":52},"宗教",{"$nulls":18},44]
[null,"（5）","（⑤）",{"$nulls":52},"物品賃貸業，専門サービス業，広告業，技術サービス",{"$nulls":18},45]
[null,"（6）","（⑥）",{"$nulls":52},"業，洗濯・理容・美容・浴場業，その他の生活関連サー"]
[null,"（7）","（⑦）",{"$nulls":52},"ビス業（旅行業を除く。），協同組合，サービス業（他に"]
[null,"（8）","（⑧）",{"$nulls":52},"分類されないもの）（記号41及び記号44に該当するも"]
[null,"（9）","（⑨）",{"$nulls":52},"のを除く。）"]
[null,"（10）","（⑩）",{"$nulls":43},"国家公務，地方公務",{"$nulls":8},"国家公務，地方公務",{"$nulls":18},46]
[null,"（11）","（⑪）",{"$nulls":43},"他に分類されないもの",{"$nulls":8},"他に分類されないもの",{"$nulls":18},99]
[null,"（12）","（⑫）",{"$nulls":42},"⑩","６欄は、一の建築物（１棟）ごとに記入してください。"]
[null,"（13）","（⑬）",{"$nulls":42},"⑪","６欄の「イ」は、建築物の数が１のときは「１」と記入し、建築物の数が２以上のときは、一の建築物（１"]
[null,"（14）","（⑭）",{"$nulls":43},"棟）ごとに通し番号を付し、その番号を記入し、「ロ」は、該当する番号を〇印で囲んでください。なお、"]
[null,"（15）","（⑮）",{"$nulls":43},"一の建築物中に、２種類以上の用途（既存部分があるときは、その用途を含む。）があるときは、「多"]
[{"$nulls":46},"用途」を〇印で囲み、一番大きい床面積の用途について記入してください。居住産業併用建築物に"]
[{"$nulls":46},"ついては、産業の用に供する部分について該当する番号を〇印で囲んでください。"]
[{"$nulls":45},"⑫","６欄の「ロ」において、「事務所等」とは、事務所、地方公共団体の支庁若しくは支所、税務署、警察"]
[{"$nulls":46},"署、保健所、消防署その他これらに類するもの又は銀行の支店、損害保険代理店、宅地建物取引"]
[{"$nulls":46},"業を営む店舗その他これらに類するサービス業を営む店舗をいいます。「物品販売業を営む店舗等」"]
[{"$nulls":46},"とは、物品販売業を営む店舗、飲食店、料理店又はキャバレー、カフェー、ナイトクラブ若しくはバー"]
[{"$nulls":46},"をいいます。「学校」とは、学校の校舎、体育館その他これらに類するものをいいます。「その他」は、"]
[{"$nulls":46},"居住専用建築物又は(1)から(6)までに該当しない建築物をいいます。"]
[{"$nulls":45},"⑬","６欄の「ホ」は、建築設備費を含んだ額を記入してください。"]

{"sheet":"工三面","index":15,"n_rows":52,"n_cols":55,"rows_kept":52,"merged":[[4,9,4,12],[5,15,5,16],[5,20,5,21],[5,25,5,26],[6,20,6,21],[6,25,6,26],[7,8,7,9],[7,14,7,15],[7,19,7,20],[8,8,8,9],[8,20,8,21],[9,8,9,9],[9,14,9,15],[9,21,9,22],[10,8,10,9],[10,16,10,17],[10,23,10,24],[10,30,10,31],[11,8,11,9],[11,16,11,17],[11,23,11,24],[11,30,11,31],[12,8,12,9],[12,16,12,17],[12,23,12,24],[12,30,12,31],[13,9,13,10],[13,16,13,17],[13,23,13,24],[13,25,13,27],[13,30,13,31],[13,32,13,34],[14,9,14,12],[14,16,14,19],[14,23,14,26],[14,30,14,33],[15,9,15,12],[15,16,15,19],[15,23,15,26],[15,30,15,33]]}
[null,"（第三面）"]
[{"$nulls":38},"シートの保護を解除すると編集が可能になります（パスワードなし）"]
[]
[null,"【1.住宅部分の概要】",{"$nulls":51},"（注意）第三面"]
[null,null,"【イ.番号】",{"$nulls":50},"①","第三面は、建築物が住宅か又は住宅を含むときは、当該建築物ごとに作成してください。"]
[null,null,"【ロ.新設とその他の別】",{"$nulls":8},"新設",null,null,"（","（1）",null,"新築",null,null,"（2）",null,"増築",null,null,"（3）",null,"改築",null,"）",{"$nulls":23},"②","１欄の「イ」は、第二面の６欄の「イ」に記入した番号と同じ番号を記入してください。"]
[{"$nulls":11},"その他",null,null,"（",{"$nulls":5},"（2）",null,"増築",null,null,"（3）",null,"改築",null,"）",{"$nulls":23},"③","１欄の「ロ」から「ヘ」までは、該当する番号を○印で囲んでください。"]
[null,null,"【ハ.資金】",{"$nulls":5},"（1）",null,"民間資金",{"$nulls":3},"（2）",null,"公営",null,null,"（3）",null,"独立行政法人住宅金融支援機構",{"$nulls":31},"④","１欄の「ロ」において、「新設」とは、新築、増築又は改築によつて居室、台所及び便所のある独立"]
[{"$nulls":8},"（4）",null,"独立行政法人都市再生機構",{"$nulls":9},"（5）",null,"その他",{"$nulls":31},"して居住し得る住宅が新たに造られるものをいいます。例えば、既存住宅の棟続きであつても、居室、"]
[null,null,"【ニ.建築工法】",{"$nulls":5},"（1）",null,"在来工法",{"$nulls":3},"（2）",null,"プレハブ工法",{"$nulls":4},"（3）",null,"枠組壁工法",{"$nulls":30},"台所又は便所を整えて独立して居住し得るものは「新設」に含まれます。「その他」とは、増築又は"]
[null,null,"【ホ.種類】",{"$nulls":5},"（1）",null,"専用住宅",{"$nulls":4},"（","（1）",null,"一戸建住宅",{"$nulls":4},"（2）",null,"長屋建住宅",{"$nulls":4},"（3）",null,"共同住宅",{"$nulls":3},"）",{"$nulls":17},"改築によつて造られる住宅で新設に該当しないものをいいます。例えば、一敷地内に既存住宅が"]
[{"$nulls":8},"（2）",null,"併用住宅",{"$nulls":4},"（","（1）",null,"一戸建住宅",{"$nulls":4},"（2）",null,"長屋建住宅",{"$nulls":4},"（3）",null,"共同住宅",{"$nulls":3},"）",{"$nulls":17},"あつて、別棟に50平方メートルの居室だけを建築しても、新たに造られた部分だけでは独立して居"]
[{"$nulls":8},"（3）",null,"その他の住宅",{"$nulls":4},"（","（1）",null,"一戸建住宅",{"$nulls":4},"（2）",null,"長屋建住宅",{"$nulls":4},"（3）",null,"共同住宅",{"$nulls":3},"）",{"$nulls":17},"住し得ないから「その他」に含まれます。"]
[null,null,"【ヘ.利用関係】",{"$nulls":5},"（","（1）",null,"持家",null,null,"）","（","（2）",null,"貸家",null,null,"）","（","（3）",null,"給与住宅",null,null,"）","（","（4）",null,"分譲住宅",null,null,"）",{"$nulls":17},"⑤","１欄の「ハ」は、当該住宅が新設のときのみ記入してください。「民間資金」住宅とは、国、地方公共"]
[null,null,"【ト.戸数】",{"$nulls":5},"（",{"$nulls":4},"戸","）","（",{"$nulls":4},"戸","）","（",{"$nulls":4},"戸","）","（",{"$nulls":4},"戸","）",{"$nulls":18},"団体、独立行政法人住宅金融支援機構等の公的な機関の資金に全くよらず、民間資金のみで建"]
[null,null,"【チ.工事部分の\n  ",{"$nulls":5},"（",{"$nulls":4},"㎡","）","（",{"$nulls":4},"㎡","）","（",{"$nulls":4},"㎡","）","（",{"$nulls":4},"㎡","）",{"$nulls":18},"てる住宅をいいます。「独立行政法人住宅金融支援機構」住宅とは、独立行政法人住宅金融支援"]
[{"$nulls":3},"床面積の合計】",{"$nulls":50},"機構から建設資金の融資を受けた住宅をいい、融資額の大小は問いません。"]
[{"$nulls":53},"⑥","１欄の「ニ」において、「在来工法」とは、プレハブ工法及び枠組壁工法以外の工法をいいます。「プ"]
[{"$nulls":54},"レハブ工法」とは、住宅の壁、柱、床、はり、屋根又は階段等の主要構造部材を工場で生産し、現"]
[{"$nulls":54},"場で組立建築する工法をいいます。「枠組壁工法」とは、木材で組まれた枠組に構造用合板その"]
[{"$nulls":54},"他これに類するものを打ち付けた床及び壁により建築物を建築する工法で、一般には、ツーバイ"]
[{"$nulls":54},"フォー工法といわれるものです。"]
[]
[{"$nulls":53},"⑦","１欄の「ホ」において、「その他の住宅」とは、主に工場、学校、官公署、旅館、下宿屋、浴場、社寺"]
[{"$nulls":54},"等の建築物に付属して、これと結合している住宅をいいます。「長屋建住宅」とは、廊下、階段等"]
[{"$nulls":54},"を共用しない２戸以上の住宅を連続する建て方の住宅（連続建）をいい、廊下、階段等を共用しな"]
[{"$nulls":54},"いで２戸以上の住宅を重ねたもの（重ね建）を含みます。「共同住宅」とは、長屋建住宅以外の住"]
[{"$nulls":54},"宅で、一の建築物内に２戸以上の住宅があるものをいい、一般的には、アパート又はマンションと"]
[{"$nulls":54},"いわれるものです。"]
[{"$nulls":53},"⑧","一件の建築工事で１欄の「ヘ」の(1)から(4)までに掲げる住宅の利用関係が２種類以上となる場合"]
[{"$nulls":54},"は、１欄の「ト」及び「チ」は当該住宅の利用関係の種類ごとに記入してください。"]
{"$rows_empty":16}
[null,"（1）","（①）"]
[null,"（2）","（②）"]
[null,"（3）","（③）"]
[null,"（4）","（④）"]
[null,"（5）","（⑤）"]

{"sheet":"工四面","index":16,"n_rows":58,"n_cols":54,"rows_kept":58,"merged":[[0,1,0,33],[3,10,3,11],[3,22,3,25],[4,10,4,11],[4,22,4,25],[5,10,5,11],[5,22,5,25],[6,10,6,11],[6,22,6,23],[7,10,7,11],[7,22,7,23],[8,12,8,16],[9,12,9,16],[10,10,10,11],[10,15,10,16],[10,20,10,21],[11,12,11,16],[12,12,12,16]]}
[null,"（第四面）"]
[{"$nulls":37},"シートの保護を解除すると編集が可能になります（パスワードなし）"]
[{"$nulls":37},"第四面に記載する事項が無い場合においても添付してください。"]
[null,"【1.主要用途】",{"$nulls":8},"（1）",null,"居住専用建築物",{"$nulls":8},"（",{"$nulls":4},"）"]
[{"$nulls":10},"（2）",null,"居住産業併用建築物",{"$nulls":8},"（",{"$nulls":4},"）",{"$nulls":25},"（注意）第四面"]
[{"$nulls":10},"（3）",null,"産業専用建築物",{"$nulls":8},"（",{"$nulls":4},"）",{"$nulls":25},"①","第四面は、既存の建築物を除却し、引き続き、当該敷地内において建築物を建築しようとする場合に"]
[null,"【2.除却要因】",{"$nulls":8},"（1）",null,"老朽して危険があるため",{"$nulls":9},"（2）",null,"その他",{"$nulls":28},"おいて、当該除却しようとする建築物について記入してください。"]
[null,"【3.構造種別】",{"$nulls":8},"（1）",null,"木造",{"$nulls":9},"（2）",null,"その他",{"$nulls":27},"②","１欄は、(1)から(3)までのうち該当する番号を〇印で囲んでください。"]
[null,"【4.建築物の数】",{"$nulls":50},"③","１欄において「(1)居住専用建築物」に該当する場合は、（注意）３．⑧に準じて括弧内に該当する記"]
[null,"【5.住宅の戸数】",{"$nulls":15},"戸",{"$nulls":35},"号を記入してください。"]
[null,"【6.住宅の利用関係】",{"$nulls":8},"（1）",null,"持家",null,null,"（2）",null,"貸家",null,null,"（3）",null,"給与住宅",{"$nulls":29},"④","１欄において「(2)居住産業併用建築物」及び「(3)産業専用建築物」に該当する場合は、（注意）３．"]
[null,"【7.建築物の床面積の合計】",{"$nulls":15},"㎡",{"$nulls":35},"⑨に準じて括弧内に該当する記号を記入してください。また、一敷地内に除却しようとする建築物以"]
[null,"【8.建築物の評価額】",{"$nulls":15},"千円",{"$nulls":35},"外に既存の建築物があるときは、記入に際しては、その部分と除却しようとする部分とを総合して判"]
[{"$nulls":53},"断してください。"]
[{"$nulls":52},"⑤","２欄、３欄及び６欄は、該当する番号を○印で囲んでください。"]
{"$rows_empty":40}
[null,null,"（1）","（①）"]
[null,null,"（2）","（②）"]
[null,null,"（3）","（③）"]

{"sheet":"滋賀敷調表1・2","index":17,"n_rows":79,"n_cols":37,"rows_kept":79,"merged":[[2,26,2,27],[2,28,2,29],[3,0,3,5],[3,6,3,34],[4,0,4,5],[4,6,4,34],[5,0,5,5],[5,6,5,34],[10,9,10,28],[11,10,11,11],[11,16,11,19],[11,24,11,27],[12,9,12,26],[14,0,44,0],[15,32,15,33],[16,1,23,14],[16,31,16,33],[31,1,32,14],[31,15,32,17],[31,18,32,18],[31,19,32,19],[31,20,32,20],[31,21,32,22],[31,26,32,26],[31,27,32,27],[34,15,35,17],[34,18,35,18],[34,19,35,19],[34,20,35,20],[34,21,35,22],[34,26,35,26],[34,27,35,27],[36,1,37,14],[37,20,37,22],[42,24,42,25],[43,1,44,14],[46,0,67,0],[54,1,55,14],[54,15,55,17],[54,18,55,18],[54,19,55,19],[54,20,55,20],[54,21,55,22],[54,27,55,27],[54,28,55,28],[54,29,55,29],[54,30,55,30],[56,1,57,14],[56,15,57,17],[56,18,57,18],[56,19,57,19],[56,20,57,20],[56,21,57,22],[56,27,57,27],[56,28,57,28],[56,29,57,29],[56,30,57,30],[58,1,59,14],[63,1,64,14],[66,1,66,14],[66,15,66,34],[67,1,67,14],[67,15,67,34],[68,0,68,13]]}
["滋-第4号様式",{"$nulls":33},"（株）確認検査機構アネックス"]
["建築物の敷地及び周辺の状況に関する調査報告書",{"$nulls":35},"シートの保護を解除すると編集が可能になります（パスワードなし）"]
[{"$nulls":26},{"$f":"IF(申一面!X17=\"\",\"\",申一面!X17)","v":"令和"},{"$nulls":3},"年",null,"月",null,"日"]
["建築主住所・氏名",{"$nulls":5},{"$f":"IF(申二面!J7=\"\",\"\",申二面!J9&\"　　\"&申二面!J7)","v":""},{"$nulls":29},"滋賀県内用"]
["敷地の地名地番",{"$nulls":5},{"$f":"IF(申三面!G3=\"\",\"\",申三面!G3)","v":""}]
["主要用途・構造・階数",{"$nulls":5},{"$f":"IF(申三面!G3=\"\",\"\",申三面!N27&\"　・　\"&申三面!I60&\"　一部　\"&申三面!U60&\"　・　\"&\"地上　\"&申三面!L58&\"階　　\"&\"地下　\"&申三面!L59&\"階\")","v":""}]
[]
["上記の建築（築造）計画について、表１から表３のとおり調査しましたので報告します。"]
["この報告書に記載の事項は事実に相違ありません。"]
[]
[{"$nulls":4},"■","報告者の住所"]
[{"$nulls":4},"■","資　　　　格",{"$nulls":3},"（",null,null,"）","建築士　　",null,"（",{"$nulls":4},"）","登録",null,"第",{"$nulls":4},"号"]
[{"$nulls":4},"■","氏　　　　名",{"$nulls":22},"印"]
["表１"]
["建築基準関係規定等","事前調査を要する法令等",{"$nulls":13},"許可等の要・不要及び添付の有無"]
[null,"道路の種別",{"$nulls":13},"□","国道",null,"□","県道",null,"□","市町村道",null,null,"□","私道",null,"□","その他",null,"（",null,null,"）"]
[null,"建築基準法第４２条及び第４３条",{"$nulls":13},"□","法42条1項",null,null,"□","一号該当",null,null,"（道路法）",{"$nulls":4},"道路幅員",{"$nulls":5},"ｍ"]
[{"$nulls":19},"□","二号該当",null,null,"（都計法）"]
[{"$nulls":19},"□","三号該当",null,null,"（既存道路）"]
[{"$nulls":19},"□","四号該当",null,null,"（事業予定）"]
[{"$nulls":19},"□","五号該当",null,null,"（位置指定）"]
[{"$nulls":15},"□","法42条2項"]
[{"$nulls":15},"□","法第43条2項一号"]
[{"$nulls":15},"□","法第43条2項二号",{"$nulls":7},"添付の",null,"□","有"]
[null,"都市計画法第５３条による許可",{"$nulls":13},"許可の",null,null,"□","要","□","不要",null,null,"添付の",null,"□","有"]
[null,"都市計画法第２９条、第４２条及び第４３条による許可",{"$nulls":13},"許可の",null,null,"□","要","□","不要",{"$nulls":4},"□","有"]
[null,"都市計画法第４１条制限",{"$nulls":13},"制限の",null,null,"□","要","□","無",{"$nulls":4},"□","有"]
[null,"宅地造成等規制法による許可",{"$nulls":13},"許可の",null,null,"□","要","□","不要",{"$nulls":4},"□","有"]
[null,"河川(水路)占用の許可（法定外公共物占用許可）",{"$nulls":13},"許可の",null,null,"□","要","□","不要",{"$nulls":4},"□","有"]
[null,"屋外広告物法及び同条例による許可",{"$nulls":13},"許可の",null,null,"□","要","□","不要",{"$nulls":4},"□","有"]
[null,"駐車場法に係る届出",{"$nulls":13},"届出の",null,null,"□","要","□","不要",{"$nulls":4},"□","有"]
[null,"建築基準法に基づく例外的な許可及び認定\n（仮設許可・連担建築物等）",{"$nulls":13},"許可の",null,null,"□","要","□","不要",{"$nulls":4},"□","有"]
[]
[null,"土砂災害防止法特別警戒区域",{"$nulls":13},"□","区域内",{"$nulls":3},"□","区域外"]
[null,"滋賀県流域治水の推進に関する条例　浸水警戒区域",{"$nulls":13},"条例14条の\n許可の",null,null,"□","要","□","不要",{"$nulls":4},"□","有"]
[{"$nulls":4},"□","区域内",null,"□","区域外"]
[null,"下水関係",{"$nulls":13},"□","公共下水道",{"$nulls":3},"□","農村下水道",{"$nulls":3},"□","団地内浄化槽"]
[{"$nulls":15},"供用開始年月日",{"$nulls":7},"年",null,"月",null,"日"]
[null,"浄化槽",{"$nulls":13},"□","設置",null,"□","既設置",null,"（","合併","・","単独",null," )","□","非設置"]
[null,"浄化槽設置による排水先等の協議",{"$nulls":13},"市町村との",null,null,"□","協議済",null,"□","協議中",null,null,"□","未","□","不要　"]
[null,"みずすまし条例　義務化区域",{"$nulls":13},"□","区域内",null,"□","区域外"]
[null,"地区計画",{"$nulls":13},"□","区域内",null,"□","区域外",{"$nulls":3},"届出",null,"□","有","□","無"]
[null,"高度地区",{"$nulls":13},"□","地区内",null,"□","地区外",{"$nulls":3},"（",null,null,"）","種高度"]
[null,"高齢者、障害者等の移動等の円滑化の促進に関する法律\n（バリアフリー法）",{"$nulls":13},"特別特定建築物（基準適合義務）",{"$nulls":8},"□","該当",null,"□","非該当"]
[{"$nulls":15},"特定建築物の計画の認定　",{"$nulls":8},"□","有",null,"□","無"]
["表２"]
["他法令及び要綱基準等","事前調査を要する法令等",{"$nulls":13},"許可等の要・不要及び添付の有無"]
[null,"各市町の小規模開発等の指導要綱等",{"$nulls":13},"適用の",null,null,"□","有","□","無",{"$nulls":3},"協議",null,"□","済","□","中","□","未"]
[null,"風致地区条例による許可",{"$nulls":13},"許可の",null,null,"□","要","□","不要",{"$nulls":5},"□","有","□","無"]
[null,"伝統的建造物群保存地区条例の許可",{"$nulls":13},"許可の",null,null,"□","要","□","不要",{"$nulls":5},"□","有","□","無"]
[null,"建築協定区域内の建築物に関する協議",{"$nulls":13},"地域の",null,null,"□","内","□","外",{"$nulls":3},"協議",null,"□","要","□","不要"]
[null,"自然公園法による許可",{"$nulls":13},"許可の",null,null,"□","要","□","不要",{"$nulls":5},"□","有","□","無"]
[null,"文化財保護法による許可・届出",{"$nulls":13},"許可等の",null,null,"□","要","□","不要",{"$nulls":5},"□","有","□","無"]
[null,"農地法による許可・届出",{"$nulls":13},"許可等の",null,null,"□","要","□","不要",{"$nulls":5},"□","有","□","無"]
[null,"だれもが住みたくなる福祉滋賀のまちづくり条例による\n届出",{"$nulls":13},"届出の",null,null,"□","要","□","不要",{"$nulls":5},"□","有","□","無"]
[]
[null,"景観計画の届出\n（滋賀県ふるさと滋賀の風景を守り育てる条例・各市景観計画条例）",{"$nulls":13},"届出の",null,null,"□","要","□","不要",{"$nulls":5},"□","有","□","無"]
[]
[null,"建設リサイクル法",{"$nulls":13},"□","対象",null,"（","□","解体",null,"□","新築",null,"□","土木",null,"□","その他",null,"）"]
[{"$nulls":15},"□","対象外"]
[null,"土地区画整理法第７６条による許可",{"$nulls":13},"許可の",null,null,"□","要","□","不要",{"$nulls":5},"□","有"]
[null,"工場立地法",{"$nulls":13},"届出の",null,null,"□","要","□","不要",{"$nulls":5},"□","有","□","無"]
[null,"建築物のエネルギー消費性能の向上に関する法律",{"$nulls":13},"届出の",null,null,"□","要","□","不要",{"$nulls":5},"□","有","□","無"]
[null,"特殊建築物定期調査報告",{"$nulls":13},"対象の",null,null,"□","有","□","無"]
[{"$nulls":15},"※有の場合、特定行政庁に付近見取図、配置図、各階平面図を提出してください。"]
[null,"大津市生活道路拡幅整備推進条例による拡幅協議",{"$nulls":13},"協議の",null,null,"□","要","□","不要",{"$nulls":5},"□","有"]
[]
[]
["上記以外に協議した場合、空欄に記入して下さい。",{"$nulls":33},"2019.05.01"]
{"$rows_empty":8}
[null,"□"]
[null,"■"]

{"sheet":"滋賀敷調表3","index":18,"n_rows":43,"n_cols":29,"rows_kept":43,"merged":[[7,0,11,2],[7,3,8,10],[7,18,7,25],[8,18,8,25],[9,3,10,10],[9,18,9,25],[10,18,10,25],[11,3,11,10],[11,18,11,25],[12,0,16,2],[12,3,12,10],[12,11,12,14],[12,15,12,17],[12,18,12,25],[13,11,13,13],[13,21,13,22],[14,11,14,13],[14,21,14,22],[15,11,15,13],[15,21,15,22],[16,3,16,10],[16,11,16,13],[17,0,24,2],[17,3,17,10],[17,11,17,14],[17,15,17,17],[17,18,17,25],[18,11,18,13],[18,15,18,17],[18,18,18,21],[18,22,18,25],[19,11,19,13],[19,15,19,17],[19,18,19,21],[19,22,19,25],[20,11,20,13],[20,15,20,17],[20,18,20,21],[20,22,20,25],[21,11,21,13],[21,15,21,17],[21,18,21,21],[21,22,21,25],[22,11,22,13],[22,15,22,17],[22,18,22,21],[22,22,22,25],[23,11,23,13],[23,15,23,17],[23,18,23,21],[23,22,23,25],[24,3,24,10],[24,11,24,13],[24,15,24,17],[24,18,24,21],[24,22,24,25],[25,0,25,2],[25,3,25,25],[26,3,26,25],[27,3,27,25]]}
[]
[{"$nulls":25},"株式会社確認検査機構アネックス"]
["表３ (敷地が以下のいずれかに該当する場合、記入願います）",{"$nulls":27},"シートの保護を解除すると編集が可能になります（パスワードなし）"]
["・市街化調整区域"]
["・市街化区域　1,000㎡以上"]
["・非線引き都市計画区域 3,000㎡以上（但し、甲賀市・東近江市・長浜市は1,000㎡以上、高島市は2,000㎡以上）"]
[]
["都市計画区域及び区域決定年月日",null,null,"・市街化区域",{"$nulls":9},"年",null,"月",null,"日","（都市計画区域）"]
[{"$nulls":13},"年",null,"月",null,"日","（市街化区域）"]
[{"$nulls":3},"・市街化調整区域",{"$nulls":9},"年",null,"月",null,"日","（都市計画区域）"]
[{"$nulls":13},"年",null,"月",null,"日","（市街化調整区域）"]
[{"$nulls":3},"・非線引き都市計画区域",{"$nulls":9},"年",null,"月",null,"日","（都市計画区域）"]
["敷地の変遷",null,null,"造成　年月日",{"$nulls":7},"規模",{"$nulls":3},"造成の有無",null,null,"都市計画法の許可等"]
[{"$nulls":3},"新設",null,null,"年",null,"月",null,"日",{"$nulls":3},"㎡","有","・","無",null,"線引前","・","許可等",null,"・","適用除外"]
[{"$nulls":3},"増設",null,null,"年",null,"月",null,"日",{"$nulls":3},"㎡","有","・","無",null,"線引前","・","許可等",null,"・","適用除外"]
[{"$nulls":3},"増設",null,null,"年",null,"月",null,"日",{"$nulls":3},"㎡","有","・","無",null,"線引前","・","許可等",null,"・","適用除外"]
[{"$nulls":3},"計",{"$nulls":10},"㎡"]
["建築物の変遷",null,null,"建築　年月日",{"$nulls":7},"規模",{"$nulls":3},"棟別用途",null,null,"建築確認検査済証　年月日・番号"]
[{"$nulls":3},"新設",null,null,"年",null,"月",null,"日",{"$nulls":3},"㎡"]
[{"$nulls":3},"増設",null,null,"年",null,"月",null,"日",{"$nulls":3},"㎡"]
[{"$nulls":3},"増設",null,null,"年",null,"月",null,"日",{"$nulls":3},"㎡"]
[{"$nulls":3},"増設",null,null,"年",null,"月",null,"日",{"$nulls":3},"㎡"]
[{"$nulls":3},"増設",null,null,"年",null,"月",null,"日",{"$nulls":3},"㎡"]
[{"$nulls":3},"増設",null,null,"年",null,"月",null,"日",{"$nulls":3},"㎡"]
[{"$nulls":3},"計",{"$nulls":10},"㎡"]
["備考"]
[]
[]
[]
["【注意事項】"]
["１.","確認申請を行う前に設計者が上記の関連法令及び指導要綱等について所管する行政庁において調査確認し、該当する□には"]
[null,"レ印を、その他については数値等を記載し報告してください。それらが　記載されていない場合は、確認申請を受け付けな"]
[null,"いことがあります。"]
["２.","調査の結果、許可等が必要であることが明らかになったものの内、建築基準関係規定に係るものについては、当該許可証等"]
[null,"を確認申請書に添付してください。"]
["３.","表１に掲げるものは、建築基準関係規定の一部であり、表２に掲げるものは建築物を建築するに当たって許可等が必要なも"]
["　　","のの主なものです。この他にも建築物等を建築する場合に当たって許可等の手続きが必要なものがありますので、十分注意"]
["　　","してください。"]
["４.","表３については、都市計画法第29条、第43条等の規定についての適否を判断するのに必要となりますので、十分調査の上記"]
[null,"載してください。"]
["５.","この報告書の記載内容が、事実と異なることが判明し、建築基準関係規定に抵触することとなった場合は、申請の取り下げ"]
["　　","又は工事取り止め届けを提出し、建築計画を中止してください。"]
["６.","報告者の氏名の記載を自署で行う場合に於いては押印を省略することができます。"]

{"sheet":"京市敷調1・2","index":19,"n_rows":155,"n_cols":105,"rows_kept":155,"merged":[[4,47,4,49],[4,52,4,53],[4,56,4,57],[6,2,6,8],[6,10,6,59],[7,2,7,8],[7,10,7,26],[7,27,7,60],[9,1,10,38],[12,14,12,21],[12,23,12,58],[13,15,13,20],[13,24,13,27],[13,34,13,39],[13,45,13,50],[14,15,14,20],[14,23,14,56],[17,1,17,12],[17,13,17,44],[17,45,17,60],[18,1,29,6],[18,7,18,12],[18,13,19,44],[18,45,18,47],[18,58,18,59],[19,7,19,12],[19,45,19,47],[19,58,19,59],[20,7,20,12],[20,13,20,44],[20,45,20,47],[20,58,20,59],[21,7,22,12],[21,13,22,44],[21,45,22,47],[21,48,22,48],[21,49,22,49],[21,50,22,50],[21,51,22,51],[21,52,22,52],[21,53,22,53],[21,57,22,57],[21,58,22,59],[23,7,24,12],[23,13,23,44],[23,45,23,47],[23,58,23,59],[24,13,24,44],[24,45,24,47],[24,58,24,59],[25,7,26,12],[25,13,26,44],[25,45,26,47],[25,48,26,48],[25,49,26,49],[25,50,26,50],[25,51,26,51],[25,52,26,52],[25,53,26,53],[25,57,26,57],[25,58,26,59],[27,7,29,12],[27,13,28,44],[27,45,28,47],[27,48,28,48],[27,49,28,49],[27,50,28,50],[27,51,28,51],[27,52,28,52],[27,53,28,53],[27,57,28,57],[27,58,28,59],[29,13,29,44],[29,45,29,47],[29,58,29,59],[30,1,31,6],[30,7,31,12],[30,13,31,44],[30,45,31,47],[30,48,31,48],[30,49,31,49],[30,50,31,50],[30,51,31,51],[30,52,31,52],[30,53,31,53],[30,57,31,57],[30,58,31,59],[32,1,34,6],[32,7,34,12],[32,13,34,44],[32,45,34,47],[32,48,34,48],[32,49,34,49],[32,50,34,50],[32,51,34,51],[32,52,34,52],[32,53,34,53],[32,57,34,57],[32,58,34,59],[35,1,36,6],[35,7,36,12],[35,13,36,44],[35,45,36,47],[35,48,36,48],[35,49,36,49],[35,50,36,50],[35,51,36,51],[35,52,36,52],[35,53,36,53],[35,57,36,57],[35,58,36,59],[37,1,40,6],[37,7,38,12],[37,13,38,44],[37,45,38,47],[37,48,38,48],[37,49,38,49],[37,50,38,50],[37,51,38,51],[37,52,38,52],[37,53,38,53],[37,57,38,57],[37,58,38,59],[37,60,38,60],[39,7,40,12],[39,13,40,44],[39,45,40,47],[39,48,40,48],[39,49,40,49],[39,50,40,50],[39,51,40,51],[39,52,40,52],[39,53,40,53],[39,57,40,57],[39,58,40,59],[41,1,41,6],[41,7,41,12],[41,13,41,44],[41,45,41,47],[41,58,41,59],[44,1,44,12],[44,13,44,44],[44,45,44,60],[45,1,74,6],[45,7,47,12],[45,13,45,44],[45,45,45,47],[45,58,45,59],[46,13,46,44],[46,45,46,47],[46,58,46,59],[47,13,47,44],[47,45,47,47],[47,58,47,59],[48,7,54,12],[48,13,48,44],[48,45,48,47],[48,58,48,59],[49,13,49,44],[49,45,49,47],[49,58,49,59],[50,13,52,44],[50,45,52,47],[50,48,52,48],[50,49,52,49],[50,50,52,50],[50,51,52,51],[50,52,52,52],[50,53,52,53],[50,54,52,54],[50,55,52,55],[50,56,52,56],[50,57,52,57],[50,58,52,59],[53,13,53,44],[53,45,53,47],[53,58,53,59],[54,13,54,44],[54,45,54,47],[54,58,54,59],[55,7,57,12],[55,45,55,47],[56,13,57,44],[56,45,57,47],[56,48,57,48],[56,49,57,49],[56,50,57,50],[56,51,57,51],[56,52,57,52],[56,53,57,53],[56,54,57,54],[56,55,57,55],[56,56,57,56],[56,57,57,57],[56,58,57,59],[58,7,60,12],[58,13,58,44],[58,45,58,47],[58,58,58,59],[59,13,59,44],[59,45,59,47],[59,58,59,59],[60,13,60,44],[60,45,60,47],[60,58,60,59],[61,7,66,12],[61,13,61,44],[61,45,61,47],[61,58,61,59],[62,13,62,44],[62,45,62,47],[62,58,62,59],[63,13,63,44],[63,45,63,47],[63,58,63,59],[64,13,64,44],[64,45,64,47],[64,58,64,59],[65,13,66,44],[65,45,65,47],[65,58,65,59],[66,45,66,47],[66,58,66,59],[67,7,74,12],[67,13,67,44],[67,45,67,47],[67,58,67,59],[68,13,69,44],[68,45,68,47],[68,58,68,59],[69,45,69,47],[69,58,69,59],[70,13,70,44],[70,45,70,47],[70,58,70,59],[71,13,71,44],[71,45,71,47],[71,58,71,59],[72,13,73,44],[72,45,72,47],[72,58,72,59],[73,45,73,47],[73,58,73,59],[74,13,74,44],[74,45,74,47],[74,58,74,59],[75,54,75,59],[77,1,77,12],[77,13,77,44],[77,45,77,60],[78,1,81,6],[78,7,78,12],[78,13,81,44],[78,45,81,47],[78,48,81,48],[78,49,81,49],[78,50,81,50],[78,51,81,51],[78,52,81,52],[78,53,81,53],[78,54,81,54],[78,55,81,55],[78,56,81,56],[78,57,81,57],[78,58,81,59],[79,7,80,12],[81,7,81,12],[82,1,84,6],[82,7,83,12],[82,13,83,44],[82,45,82,47],[82,58,82,59],[83,45,83,47],[83,58,83,59],[84,7,84,12],[84,13,84,44],[84,45,84,47],[84,58,84,59],[85,1,88,6],[85,7,86,12],[85,13,85,44],[85,45,85,47],[85,58,85,59],[86,13,86,44],[86,45,86,47],[86,58,86,59],[87,7,88,12],[87,13,88,44],[87,45,88,47],[87,48,88,48],[87,49,88,49],[87,50,88,50],[87,51,88,51],[87,52,88,52],[87,53,88,53],[87,54,88,54],[87,55,88,55],[87,56,88,56],[87,57,88,57],[87,58,88,59],[89,1,94,6],[89,7,91,12],[89,13,91,44],[89,45,91,47],[89,48,91,48],[89,49,91,49],[89,50,91,50],[89,51,91,51],[89,52,91,52],[89,53,91,53],[89,54,91,54],[89,55,91,55],[89,56,91,56],[89,57,91,57],[89,58,91,59],[89,60,91,60],[92,7,94,12],[92,13,94,44],[92,45,94,47],[92,48,94,48],[92,49,94,49],[92,50,94,50],[92,51,94,51],[92,52,94,52],[92,53,94,53],[92,54,94,54],[92,55,94,55],[92,56,94,56],[92,57,94,57],[92,58,94,59],[92,60,94,60],[95,1,100,6],[95,7,95,12],[95,13,95,44],[95,45,95,47],[95,58,95,59],[96,7,98,12],[96,13,96,44],[96,45,96,47],[96,58,96,59],[97,13,98,44],[97,45,98,47],[97,48,98,48],[97,49,98,49],[97,50,98,50],[97,51,98,51],[97,52,98,52],[97,53,98,53],[97,54,98,54],[97,55,98,55],[97,56,98,56],[97,57,98,57],[97,58,98,59],[99,7,100,12],[99,13,100,44],[99,45,100,47],[99,48,100,48],[99,49,100,49],[99,50,100,50],[99,51,100,51],[99,52,100,52],[99,53,100,53],[99,54,100,54],[99,55,100,55],[99,56,100,56],[99,57,100,57],[99,58,100,59],[101,1,106,6],[101,7,102,12],[101,13,102,44],[101,45,102,47],[101,48,102,48],[101,49,102,49],[101,50,102,50],[101,51,102,51],[101,52,102,52],[101,53,102,53],[101,54,102,54],[101,55,102,55],[101,56,102,56],[101,57,102,57],[101,58,102,59],[103,7,104,12],[103,13,104,44],[103,45,104,47],[103,48,104,48],[103,49,104,49],[103,50,104,50],[103,51,104,51],[103,52,104,52],[103,53,104,53],[103,54,104,54],[103,55,104,55],[103,56,104,56],[103,57,104,57],[103,58,104,59],[105,7,106,12],[105,13,106,44],[105,45,106,47],[105,48,106,48],[105,49,106,49],[105,50,106,50],[105,51,106,51],[105,52,106,52],[105,53,106,53],[105,54,106,54],[105,55,106,55],[105,56,106,56],[105,57,106,57],[105,58,106,59],[107,1,112,6],[107,7,108,12],[107,13,109,44],[107,45,109,47],[107,48,109,48],[107,49,109,49],[107,50,109,50],[107,51,109,51],[107,52,109,52],[107,53,109,53],[107,54,109,54],[107,55,109,55],[107,56,109,56],[107,57,109,57],[107,58,109,59],[109,7,110,12],[110,13,112,44],[110,45,112,47],[110,48,112,48],[110,49,112,49],[110,50,112,50],[110,51,112,51],[110,52,112,52],[110,53,112,53],[110,54,112,54],[110,55,112,55],[110,56,112,56],[110,57,112,57],[110,58,112,59],[111,7,112,12],[113,1,116,6],[113,7,114,12],[113,13,114,44],[113,45,114,47],[113,48,114,48],[113,49,114,49],[113,50,114,50],[113,51,114,51],[113,52,114,52],[113,53,114,53],[113,54,114,54],[113,55,114,55],[113,56,114,56],[113,57,114,57],[113,58,114,59],[115,7,116,12],[115,13,116,44],[115,45,116,47],[115,48,116,48],[115,49,116,49],[115,50,116,50],[115,51,116,51],[115,52,116,52],[115,53,116,53],[115,54,116,54],[115,55,116,55],[115,56,116,56],[115,57,116,57],[115,58,116,59],[120,1,120,6],[122,1,122,6],[124,1,124,6],[126,1,126,6],[128,1,128,6],[130,1,130,6],[132,1,132,6],[134,1,134,6],[136,1,136,6],[138,1,138,6]]}
[]
[null,"京－４様式",{"$nulls":55},"その１",{"$nulls":6},"シートの保護を解除すると編集が可能になります（パスワードなし）"]
[null,"確認申請事前調査報告書"]
[]
[{"$nulls":46},{"$f":"IF(申一面!X17=\"\",\"\",申一面!X17)","v":"令和"},{"$nulls":3},"年",{"$nulls":3},"月",{"$nulls":3},"日",{"$nulls":5},"京都市用"]
[]
[null,null,"建築場所",{"$nulls":7},{"$f":"IF(申三面!G3=\"\",\"\",申三面!G3)","v":""}]
[null,null,"建築主",{"$nulls":7},"氏名（法人にあっては、名称及び代表者名）",{"$nulls":16},{"$f":"IF(申二面!J7=\"\",\"\",申二面!J7)","v":""}]
[]
[null,"上記の建築（築造）計画について，表１及び表２のとおり調査しましたので，報告します。\nこの報告書に記載の事項は，事実に相違ありません。"]
[]
[]
[{"$nulls":14},"報告者の住所"]
[{"$nulls":15},"資格",{"$nulls":7},"（",{"$nulls":4},"）","建築士",{"$nulls":3},"（",{"$nulls":6},"）","登録　第",{"$nulls":9},"号"]
[{"$nulls":15},"氏名",{"$nulls":42},"㊞"]
[]
[null,"表１ 建築基準関係規定（建築確認対象法令）"]
[null,"関　係　部　署　名",{"$nulls":11},"事　前　調　査　を　要　す　る　法　令　等",{"$nulls":31},"許 可 等 の 要 ， 不 要 等",{"$nulls":58},"□"]
[null,"都市計画局",{"$nulls":5},"建築指導課",{"$nulls":5},"建築基準法及びそれに基づく条例による例外的な許可\n（建築基準法第43条ただし書きの許可含む）又は認定",{"$nulls":31},"許可の",null,null,"□","要","（","□","有","），",{"$nulls":3},"□","不要",{"$nulls":45},"■"]
[{"$nulls":7},"建築審査課",{"$nulls":37},"認定の",null,null,"□","要","（","□","有","），",{"$nulls":3},"□","不要"]
[{"$nulls":7},"建築指導課",{"$nulls":5},"京都市斜面地等における建築物等の制限に関する条例",{"$nulls":31},"許可の",{"$nulls":5},"□","有","，",{"$nulls":3},"□","無"]
[{"$nulls":7},"建築審査課",{"$nulls":5},"高齢者、障害者等の移動等円滑化の促進に関する法律（バリアフリー法）\n第14条第1項から第3項までによる適合（協議）",{"$nulls":31},"協議の",null,null,"□","要","（","□","有","），",{"$nulls":3},"□","不要"]
[]
[{"$nulls":7},"都市計画課",{"$nulls":5},"都市計画法第53条による許可",{"$nulls":31},"許可の",null,null,"□","要","（","□","有","），",{"$nulls":3},"□","不要"]
[{"$nulls":13},"駐車場法第20条及び駐車場条例による届出",{"$nulls":31},"届出の",null,null,"□","要","（","□","有","），",{"$nulls":3},"□","不要"]
[{"$nulls":7},"広告景観づくり推進室",{"$nulls":5},"屋外広告物法第3条から第5条まで及び京都市屋外広告物等に関する条例による\n許可",{"$nulls":31},"許可の",null,null,"□","要","（","□","有","），",{"$nulls":3},"□","不要"]
[]
[{"$nulls":7},"開発指導課",{"$nulls":5},"都市計画法第29条第1項及び第2項、第35条の2第1項、第41条第2項（同法第35条の2第4項において準用する場合を含む）、第42条及び第43条第1項による許可",{"$nulls":31},"許可の",null,null,"□","要","（","□","有","），",{"$nulls":3},"□","不要"]
[]
[{"$nulls":13},"宅地造成等規制法第8条第1項及び第12条第1項による許可",{"$nulls":31},"許可の",null,null,"□","要","（","□","有","），",{"$nulls":3},"□","不要"]
[null,"建設局",{"$nulls":5},"自転車政策\n推進室",{"$nulls":5},"自転車の安全利用の促進及び自転車等の駐車対策の総合的推進に関する法律\n第5条第4項及び京都市自転車等放置防止条例による届出",{"$nulls":31},"届出の",null,null,"□","要","（","□","有","），",{"$nulls":3},"□","不要"]
[]
[null,"環境政策局",{"$nulls":5},"北部・南部\n各環境共生\nセンター",{"$nulls":5},"浄化槽法第3条の2第1項及び京都市浄化槽指導要綱による協議",{"$nulls":31},"協議の",null,null,"□","要","（","□","有","），",{"$nulls":3},"□","不要"]
[]
[]
[null,"各消防署",{"$nulls":5},"消防課\n（予防担当）",{"$nulls":5},"消防法第9条、第9条の2、第15条及び第17条による協議",{"$nulls":31},"協議の",null,null,"□","要","（","□","有","），",{"$nulls":3},"□","不要"]
[]
[null,"上下水道局",{"$nulls":5},"水道部\n給水工事課",{"$nulls":5},"水道法第16条による協議",{"$nulls":31},"協議の",null,null,"□","要","（","□","有","），",{"$nulls":3},"□","不要"]
[]
[{"$nulls":7},"下水道部\n管理課",{"$nulls":5},"下水道法第10条第1項及び第3項による協議",{"$nulls":31},"協議の",null,null,"□","要","（","□","有","），",{"$nulls":3},"□","不要"]
[]
[null,"京都府",{"$nulls":5},"災害対策課",{"$nulls":5},"液化石油ガスの保安確保及び取引適正化に関する法律第38条の3による届出",{"$nulls":31},"届出の",null,null,"□","要","（","□","有","），",{"$nulls":3},"□","不要"]
[]
[null,"表２　建築基準関係規定（建築確認対象法令）以外であるが必要な手続"]
[null,"関　係　部　署　名",{"$nulls":11},"事　前　調　査　を　要　す　る　法　令　等",{"$nulls":31},"許 可 等 の 要 ， 不 要 等"]
[null,"都市計画局",{"$nulls":5},"建築指導課",{"$nulls":5},"京都市狭あい道路等整備事業実施要綱による狭あい道路整備の申出又は協議",{"$nulls":31},"届出の",null,null,"□","要","（","□","有","，","□","無","），","□","不要"]
[{"$nulls":13},"京都市狭あい道路等整備事業実施要綱による位置指定道路（拡幅予定型）整備の申出又は協議",{"$nulls":31},"届出の",null,null,"□","要","（","□","有","，","□","無","），","□","不要"]
[{"$nulls":13},"京都市中高層建築物等の建築等に係る住環境の保全及び形成に関する条例による届出",{"$nulls":31},"届出の",null,null,"□","要","（","□","有","，","□","無","），","□","不要"]
[{"$nulls":7},"建築審査課",{"$nulls":5},"京都市建築物等のバリアフリーの促進に関する条例による協議",{"$nulls":31},"協議の",null,null,"□","要","（","□","有","，","□","無","），","□","不要"]
[{"$nulls":13},"建築物のエネルギー消費性能の向上に関する法律による建築物の建築に関する届出",{"$nulls":31},"届出の",null,null,"□","要","（","□","有","，","□","無","），","□","不要"]
[{"$nulls":13},"京都市地球温暖化対策条例による特定建築物に係る届出\n(建築物排出量削減計画書、地域産木材利用及び再生可能エネルギー利用設備設置届出書、建築物環境配慮性能の表示届）",{"$nulls":31},"届出の",null,null,"□","要","（","□","有","，","□","無","），","□","不要"]
[]
[]
[{"$nulls":13},"京都市地球温暖化対策条例による緑化計画書の提出",{"$nulls":31},"提出の",null,null,"□","要","（","□","有","，","□","無","），","□","不要"]
[{"$nulls":13},"都市の低炭素化の促進に関する法律第54条による認定",{"$nulls":31},"認定の",{"$nulls":5},"□","有","，",{"$nulls":3},"□","無"]
[{"$nulls":7},"建築安全\n推進課",{"$nulls":5},"建設工事に係る資材の再資源化等に関する法律（建設ﾘｻｲｸﾙ法）による届出",{"$nulls":31},"届出の",null,null,"□","要","（","□","有","，","□","無","），","□","不要"]
[{"$nulls":13},"京都市建築基準法施行細則第30条第1項による通知\n（定期報告対象建築物等の通知）",{"$nulls":31},"通知の",null,null,"□","要","（","□","有","，","□","無","），","□","不要"]
[]
[{"$nulls":7},"都市計画課",{"$nulls":5},"都市計画法第58条の2（地区計画）による届出",{"$nulls":31},"届出の",null,null,"□","要","（","□","有","，","□","無","），","□","不要"]
[{"$nulls":13},"都市計画法第65条による許可",{"$nulls":31},"許可の",null,null,"□","要","（","□","有","，","□","無","），","□","不要"]
[{"$nulls":13},"京都市土地利用の調整に係るまちづくりに関する条例による協議",{"$nulls":31},"協議の",null,null,"□","要","（","□","有","，","□","無","），","□","不要"]
[{"$nulls":7},"景観政策課",{"$nulls":5},"京都市伝統的建造物群保存地区条例による許可",{"$nulls":31},"許可の",null,null,"□","要","（","□","有","，","□","無","），","□","不要"]
[{"$nulls":13},"景観地区（美観地区・美観形成地区）内における認定",{"$nulls":31},"認定の",null,null,"□","要","（","□","有","，","□","無","），","□","不要"]
[{"$nulls":13},"景観計画区域（建造物修景地区）内における届出",{"$nulls":31},"届出の",null,null,"□","要","（","□","有","，","□","無","），","□","不要"]
[{"$nulls":13},"京都市眺望景観創生条例による事前協議（景観デザインレビュー）",{"$nulls":31},"協議の",null,null,"□","要","（","□","有","，","□","無","），","□","不要"]
[{"$nulls":13},"京都市眺望景観創生条例による認定又は届出",{"$nulls":31},"認定の",null,null,"□","要","（","□","有","，","□","無","），","□","不要"]
[{"$nulls":45},"届出の",null,null,"□","要","（","□","有","，","□","無","），","□","不要"]
[{"$nulls":7},"風致保全課",{"$nulls":5},"京都市風致地区条例による許可",{"$nulls":31},"許可の",null,null,"□","要","（","□","有","，","□","無","），","□","不要"]
[{"$nulls":13},"古都における歴史的風土の保存に関する特別措置法による許可又は届出",{"$nulls":31},"許可の",null,null,"□","要","（","□","有","，","□","無","），","□","不要"]
[{"$nulls":45},"届出の",null,null,"□","要","（","□","有","，","□","無","），","□","不要"]
[{"$nulls":13},"都市緑地法による許可",{"$nulls":31},"許可の",null,null,"□","要","（","□","有","，","□","無","），","□","不要"]
[{"$nulls":13},"京都市自然風景保全条例による許可",{"$nulls":31},"許可の",null,null,"□","要","（","□","有","，","□","無","），","□","不要"]
[{"$nulls":13},"京都市眺望景観創生条例による認定又は届出",{"$nulls":31},"認定の",null,null,"□","要","（","□","有","，","□","無","），","□","不要"]
[{"$nulls":45},"届出の",null,null,"□","要","（","□","有","，","□","無","），","□","不要"]
[{"$nulls":13},"近畿圏の保全区域の整備に関する法律による届出",{"$nulls":31},"届出の",null,null,"□","要","（","□","有","，","□","無","），","□","不要"]
[{"$nulls":54},"H31.04.01 作成"]
[{"$nulls":57},"その２"]
[null,"関　係　部　署　名",{"$nulls":11},"事　前　調　査　を　要　す　る　法　令　等",{"$nulls":31},"許 可 等 の 要 ， 不 要 等"]
[null,"建設局",{"$nulls":5},"市街地整備課",{"$nulls":5},"土地区画整理法第76条による許可",{"$nulls":31},"許可の",null,null,"□","要","（","□","有","，","□","無","），","□","不要"]
[{"$nulls":7},"南部区画整理事務所"]
[]
[{"$nulls":7},"整備推進課"]
[null,"産業観光局",{"$nulls":5},"商業振興課",{"$nulls":5},"商業施設設置に関する届出又は協議",{"$nulls":31},"届出の",null,null,"□","要","（","□","有","，","□","無","），","□","不要"]
[{"$nulls":45},"協議の",null,null,"□","要","（","□","有","，","□","無","），","□","不要"]
[{"$nulls":7},"新産業振興室",{"$nulls":5},"工場立地法に関する届出",{"$nulls":31},"届出の",null,null,"□","要","（","□","有","，","□","無","），","□","不要"]
[null,"文化市民局",{"$nulls":5},"文化財保護課",{"$nulls":5},"文化財保護法第93条による届出（埋蔵文化財包蔵地）",{"$nulls":31},"届出の",null,null,"□","要","（","□","有","，","□","無","），","□","不要"]
[{"$nulls":13},"文化財保護法第125条による許可（史跡名勝指定範囲）",{"$nulls":31},"許可の",null,null,"□","要","（","□","有","，","□","無","），","□","不要"]
[{"$nulls":7},"地域自治\n推進室",{"$nulls":5},"京都市地域コミュニティ活性化推進条例第15条による届出（居住の用に供するものが対象）",{"$nulls":31},"届出の",null,null,"□","要","（","□","有","，","□","無","），","□","不要"]
[]
[null,"保健福祉局",{"$nulls":5},"医療衛生センター（宿泊施設審査指導担当）",{"$nulls":5},"旅館の建築に関する協議",{"$nulls":31},"協議の",null,null,"□","要","（","□","有","，","□","無","），","□","不要"]
[]
[]
[{"$nulls":7},"医療衛生センター（各方面担当）",{"$nulls":5},"食品衛生法、興行場法、公衆浴場法及びクリーニング業法による届出",{"$nulls":31},"届出の",null,null,"□","要","（","□","有","，","□","無","），","□","不要"]
[]
[]
[null,"環境政策局",{"$nulls":5},"環境指導課",{"$nulls":5},"土壌汚染対策法第3条第7項又は第4条第1項による届出",{"$nulls":31},"届出の",null,null,"□","要","（","□","有","，","□","無","），","□","不要"]
[{"$nulls":7},"北部・南部\n各環境共生\nセンター",{"$nulls":5},"大気、騒音、振動及び水質に係る公害関係法令等に関する協議",{"$nulls":31},"協議の",null,null,"□","要","（","□","有","，","□","無","），","□","不要"]
[{"$nulls":13},"京都市廃棄物の減量及び適正処理等に関する条例第24条及び25条による届出\n（事業用途の床面積が1,000㎡以上対象）",{"$nulls":31},"協議の",null,null,"□","要","（","□","有","，","□","無","），","□","不要"]
[]
[{"$nulls":7},"まち美化\n推進課",{"$nulls":5},"中高層住宅におけるごみ保管施設設置基準による協議\n（共同住宅など家庭系対象）",{"$nulls":31},"協議の",null,null,"□","要","（","□","有","，","□","無","），","□","不要"]
[]
[null,"上下水道局",{"$nulls":5},"下水道部\n管理課",{"$nulls":5},"排水槽,ディスポーザー排水処理システムを設置する建築物の協議（詳細については上下水道局ホームページ参照）",{"$nulls":31},"協議の",null,null,"□","要","（","□","有","，","□","無","），","□","不要"]
[]
[{"$nulls":7},"下水道部　　　　　　施設課",{"$nulls":5},"公共下水道使用開始、特定施設設置又は除害施設設置に関する届出",{"$nulls":31},"届出の",null,null,"□","要","（","□","有","，","□","無","），","□","不要"]
[]
[{"$nulls":7},"水道部　　　　　　給水工事課",{"$nulls":5},"3階建て以上の建物（個人住宅を除く）の直結式給水施行要領に基づく協議",{"$nulls":31},"協議の",null,null,"□","要","（","□","有","，","□","無","），","□","不要"]
[]
[null,"京都府",{"$nulls":5},"京都土木事務所",{"$nulls":5},"急傾斜地の崩壊による災害の防止に関する法律第7条による許可\n（急傾斜地崩壊危険区域）",{"$nulls":31},"許可の",null,null,"□","要","（","□","有","，","□","無","），","□","不要"]
[]
[{"$nulls":7},"乙訓土木事務所（西京区の一部）"]
[{"$nulls":13},"土砂災害警戒区域等における土砂災害防止対策の推進に関する法律第10条による許可（土砂災害特別警戒区域）",{"$nulls":31},"許可の",null,null,"□","要","（","□","有","，","□","無","），","□","不要"]
[{"$nulls":7},"南丹土木事務所（右京区の一部）"]
[]
[null,"その他",{"$nulls":5},"地元建築\n協定委員",{"$nulls":5},"建築協定区域内の建築物に関する協議",{"$nulls":31},"協議の",null,null,"□","要","（","□","有","，","□","無","），","□","不要"]
[]
[{"$nulls":7},"地域景観\nづくり協議会",{"$nulls":5},"地域景観づくり協議地区内における意見の聴取　（問合せ：景観政策課）",{"$nulls":31},"意見\n聴取の",null,null,"□","要","（","□","有","，","□","無","），","□","不要"]
[]
[]
[null,"関　　係　　部　　署　　押　　印　　欄"]
[]
[null,"都市計画局"]
[]
[null,"環境政策局"]
[]
[null,"産業観光局"]
[]
[null,"文化市民局"]
[]
[null,"保健福祉局"]
[]
[null,"建設局"]
[]
[null,"各区役所"]
[]
[null,"上下水道局"]
[]
[null,"各消防署"]
[]
[null,"その他"]
[]
[]
[{"$nulls":59},{"$f":"BC76","v":"H31.04.01 作成"}]
[]
[null,"注１",null,"表１に掲げるものは，建築基準関係規定（建築確認対象法令）の一部であり，表２に掲げるものは建築物等を建築するに当たって許可等が必要なもの"]
[{"$nulls":3},"のうち主なものです。このほかにも，建築物等を建築するに当たって許可等の手続きが必要なものがありますので，十分注意してください。"]
[null,"注２",null,"調査の結果、許可・認定等が必要であることが明らかになったものについては，当該許可証等を添付してください。"]
[]
[]
[]
[]
[]
[]
[{"$nulls":4},"□",null,"一級"]
[{"$nulls":4},"■",null,"二級"]
[{"$nulls":6},"木造"]

{"sheet":"京都基礎","index":20,"n_rows":43,"n_cols":36,"rows_kept":43,"merged":[[2,0,2,32],[4,21,4,22],[4,23,4,25],[4,27,4,28],[4,30,4,31],[8,17,9,18],[8,19,9,32],[10,17,10,18],[10,19,10,31],[15,0,15,32],[21,10,21,27],[28,17,28,27]]}
[]
[{"$nulls":35},"シートの保護を解除すると編集が可能になります（パスワードなし）"]
["基礎の構造関係チェックシート"]
[]
[{"$nulls":21},{"$f":"IF(申一面!X17=\"\",\"\",申一面!X17)","v":"令和"},{"$nulls":4},"年",null,null,"月",null,null,"日"]
[]
["株式会社確認検査機構アネックス　　様"]
[]
[{"$nulls":14},"設計者",null,null,"住所",null,{"$f":"IF(申二面!J30=\"\",\"\",申二面!J30)","v":""}]
[]
[{"$nulls":17},"氏名",null,{"$f":"IF(申二面!J26=\"\",\"\",申二面!J26)","v":""},{"$nulls":12},"印"]
[]
["　下記の各項目については，建築基準法施行令第３８条及び建設省告示第１３４７号に基づき，"]
["適法であることを確認しましたので報告します。"]
[]
["記"]
[]
[null,null,"◎　地耐力の確認"]
[]
[{"$nulls":3},"□","標準貫入試験"]
[{"$nulls":3},"□","スウェーデン式サウンディング法"]
[{"$nulls":3},"□","その他の方法（",{"$nulls":23},"）"]
[]
[null,null,"◎　基礎の構造"]
[]
[{"$nulls":3},"□","２０ｋＮ／㎡未満",{"$nulls":10},"⇒",null,"基礎ぐい"]
[{"$nulls":3},"□","２０以上３０ｋＮ／㎡未満",{"$nulls":10},"⇒",null,"基礎ぐい・べた基礎"]
[{"$nulls":3},"□","３０ｋＮ／㎡以上",{"$nulls":10},"⇒",null,"基礎ぐい・べた基礎・布基礎"]
[{"$nulls":3},"□","その他構造計算等で確認",{"$nulls":10},"⇒"]
[]
[]
[]
[]
[null,"注意 ： □欄の該当する箇所にチェックしてください。"]
{"$rows_empty":7}
[null,null,"□"]
[null,null,"■"]

{"sheet":"軽微変更","index":21,"n_rows":70,"n_cols":23,"rows_kept":70,"merged":[[1,0,1,20],[3,0,3,6],[3,11,3,12],[3,15,3,16],[5,0,5,2],[5,3,5,5],[5,7,8,8],[5,9,6,9],[5,10,6,19],[6,0,15,2],[6,3,15,5],[7,9,8,9],[7,10,8,18],[7,19,8,19],[9,7,11,8],[10,9,11,9],[10,10,11,18],[10,19,11,19],[12,7,15,8],[13,9,13,16],[14,9,15,9],[14,10,15,18],[14,19,15,19],[16,0,17,2],[16,3,17,5],[16,7,19,8],[17,9,17,16],[18,9,19,9],[18,10,19,18],[18,19,19,19],[20,7,23,8],[21,9,21,16],[22,9,23,9],[22,10,23,18],[22,19,23,19],[25,0,26,20],[27,0,27,20],[28,0,28,1],[28,6,28,8],[28,10,28,11],[28,12,28,13],[29,0,29,1],[30,0,31,1],[30,2,31,4],[30,5,31,20],[32,0,35,1],[32,2,32,4],[32,5,32,20],[33,2,33,4],[33,5,33,20],[34,2,34,4],[34,5,34,20],[35,2,35,4],[35,5,35,20],[36,2,36,4],[36,5,36,20],[37,2,37,4],[37,5,37,20],[38,2,38,4],[38,5,38,20],[39,2,39,4],[39,5,39,20],[40,2,40,4],[40,5,40,20],[41,2,41,4],[41,5,41,20],[42,2,42,4],[42,5,42,20],[43,2,43,4],[43,5,43,20],[44,2,44,4],[44,5,44,20],[45,0,45,1],[45,2,45,20],[46,2,46,20],[47,2,47,20],[48,2,48,20]]}
[]
["軽微な変更 説明書(届出）",{"$nulls":21},"シートの保護を解除すると編集が可能になります（パスワードなし）"]
[]
["（あて先）株式会社 確認検査機構アネックス",{"$nulls":10},"令和",null,null,"年",null,null,"月",null,"日"]
[]
["※受付欄",null,null,"※決裁欄",{"$nulls":3},"建築主",null,"住所"]
[{"$nulls":3},"　　年 　月 　日　"]
[{"$nulls":9},"氏名",{"$nulls":9},"印"]
[]
[{"$nulls":7},"代理者",null,"資格","(",null,")","建築士","（",null,"）","登録",null,"号"]
[{"$nulls":9},"氏名"]
[]
[{"$nulls":7},"設計者\n（代表となる設計者）",null,"資格","(",null,")","建築士","（",null,"）","登録",null,"号"]
[{"$nulls":9},"構造・設備 設計一級建築士交付",{"$nulls":7},"第",null,"号"]
[{"$nulls":9},"氏名",{"$nulls":9},"印"]
[]
["※計画変更確認申請",null,null,"要 ・ 否",{"$nulls":3},"設計者\n（構造設計者）",null,"資格","(",null,")","建築士","（",null,"）","登録",null,"号"]
[{"$nulls":9},"構造設計一級建築士交付",{"$nulls":7},"第",null,"号"]
[{"$nulls":9},"氏名",{"$nulls":9},"印",null,null,"←軽微な変更に係る部分が構造に関係する場合、記入してください。"]
[]
[{"$nulls":7},"法適合\n確認者",null,"資格","(",null,")","建築士","（",null,"）","登録",null,"号"]
[{"$nulls":9},"構造・設備 設計一級建築士交付",{"$nulls":7},"第",null,"号",null,null,"←軽微な変更に係る部分が構造及び設備に関係する場合で、"]
[{"$nulls":9},"氏名",{"$nulls":9},"印",null,null,"　建築士法第20条の２第３項もしくは第20条の３第３項の表示"]
[{"$nulls":22},"　（構造・設備の法適合確認）をしたとき記入してください。"]
[]
["施行規則第３条の２に該当する軽微な変更がありましたので、当該変更の内容を下記の通り説明します。\nこの説明書及び添付図書に記載の事項は、事実に相違ありません。"]
[]
["記"]
["確認番号",{"$nulls":3},"第",{"$nulls":4},{"$f":"IF(受付用!B9=\"\",\"\",受付用!B9)","v":""},{"$f":"IF(受付用!C9=\"\",\"\",受付用!C9)","v":""},{"$nulls":3},"号"]
["確認年月日",{"$nulls":5},"令和",null,"年",null,"月",null,"日"]
["軽微な変更の内容",null,"規則第3条の2\n該当項･号",null,null,"内容説明及び変更箇所"]
[]
[" ※右表｢規則第3条の2該当項･号｣欄には、変更内容が該当する条文を明記すること"]
{"$rows_empty":12}
["添付図書リスト"]
[]
[]
[]
[]
["注1","　変更箇所の分かる図書を添付してください。"]
[2,"　該当項･号欄は項目ごとに変更内容が施行規則第3条の2の何項何号に該当するかを明記してください。"]
[3,"　軽微な変更の内容は、項目ごとに内容説明及び変更箇所を明記してください。"]
[4,"　※欄には記入しないで下さい。"]
[5,"　軽微な変更の内容に関係する設計者は、設計者欄に記名及び押印してください。"]
[6,"　検査申請と同時に提出の場合、建築主の印は不要です。"]
[]
[]
[]
[]
[]
[null,"一級"]
[null,"二級"]
[null,"木造"]
[null,"確認建機構ア"]
[null,"変認建機構ア"]
[null,"Ｈ２８"]
[null,2017]
[null,2018]
[null,"2019"]

{"sheet":"計画変更一面","index":22,"n_rows":57,"n_cols":37,"rows_kept":57,"merged":[[13,23,13,24],[13,25,13,26],[13,34,13,35],[13,36,13,42],[16,19,16,30],[17,19,17,28],[20,19,20,30],[21,19,21,28],[25,10,25,11],[25,12,25,16],[25,18,25,19],[25,20,25,22],[26,9,26,10],[28,7,28,31],[29,2,29,31],[30,2,30,31],[41,0,41,2],[41,24,41,26],[53,1,53,4],[54,1,54,4],[55,1,55,4],[56,1,56,4]]}
["第四号様式（第一条の三、第三条、第三条の三関係）（Ａ４）"]
[{"$nulls":33},"シートの保護を解除すると編集が可能になります（パスワードなし）"]
[]
["計画変更確認申請書（建築物）",{"$nulls":32},"（注意）"]
[{"$nulls":33},"共通：　数字は算用数字を、単位はメートル法を用いてください。"]
["（第一面）",{"$nulls":32},"①　申請者又は設計者の氏名の記載を自署で行う場合においては、押印を省略することができます。"]
[{"$nulls":33},"②　※印のある欄は記入しないでください。"]
[]
["　建築基準法第６条第1項又は第６条の２第1項の規定による計画の変更の確認を申請します。　この申請書及"]
["び添付図書に記載の事項は、事実に相違ありません。"]
[]
["指定確認検査機関"]
["株式会社　確認検査機構アネックス  　様"]
[{"$nulls":23},"令和",{"$nulls":3},"年",null,"月",null,"日",null,null,"本日",null,{"$f":"TODAY()","v":"2019-06-03"}]
[]
[]
[]
[{"$nulls":14},"申請者氏名",{"$nulls":15},"印"]
[]
[]
[]
[{"$nulls":14},"設計者氏名",{"$nulls":15},"印"]
[]
[]
["【計画を変更する建築物の直前の確認】"]
[null,"【確認済証番号】",{"$nulls":7},"第",{"$nulls":7},{"$f":"IF(受付用!B9=\"\",\"\",受付用!B9)","v":""},{"$f":"IF(受付用!C9=\"\",\"\",受付用!C9)","v":""},{"$nulls":4},"号"]
[null,"【確認済証交付年月日】",{"$nulls":7},"令和",null,null,"年",null,"月",null,"日"]
[null,"【確認済証交付者】",{"$nulls":7},"　株式会社　確認検査機構アネックス"]
[null,"【計画変更の概要】"]
[]
[]
[]
["※","手数料欄"]
[]
[]
[]
["※受付欄",{"$nulls":7},"※消防関係同意欄",{"$nulls":7},"※決裁欄",{"$nulls":7},"※確認番号欄"]
[]
[]
[{"$f":"IF(X14=\"\",\"\",X14)","v":"令和"},null,null,"年",null,"月",null,"日",{"$nulls":16},{"$f":"IF(X14=\"\",\"\",X14)","v":"令和"},null,null,"年",null,"月",null,"日"]
["第",{"$nulls":5},"変申建機構ア",{"$f":"IF(受付用!B9=\"\",\"\",受付用!B9)","v":""},{"$nulls":16},"第",{"$nulls":5},"変認建機構ア",{"$f":"IF(受付用!B9=\"\",\"\",受付用!B9)","v":""}]
[{"$f":"IF(受付用!C9=\"\",\"\",受付用!C9)","v":""},{"$nulls":6},"号",{"$nulls":16},{"$f":"IF(受付用!C9=\"\",\"\",受付用!C9)","v":""},{"$nulls":6},"号"]
["係員印",{"$nulls":23},"係員印"]
{"$rows_empty":7}
[null,"入力規則"]
[null,"確認建機構ア"]
[null,"変認建機構ア"]
[null,"Ｈ２８"]
[null,2017]
[null,2018]
[null,"2019"]

{"sheet":"選定届 ","index":23,"n_rows":47,"n_cols":37,"rows_kept":47,"merged":[[3,23,3,24],[3,25,3,26],[3,28,3,29],[3,31,3,32],[5,17,7,31],[5,32,7,33],[6,1,6,6],[7,0,8,16],[8,25,8,33],[10,0,10,33],[11,0,11,6],[11,7,11,8],[11,9,11,10],[11,12,11,13],[11,15,11,16],[11,19,11,20],[11,21,11,25],[11,27,11,28],[11,29,11,31],[11,32,11,33],[12,0,12,6],[12,7,12,33],[13,0,19,6],[13,11,13,16],[14,10,14,33],[15,10,15,18],[16,25,16,26],[17,7,17,21],[17,23,17,26],[17,30,17,32],[18,25,18,26],[19,7,19,21],[19,23,19,25],[19,30,19,32],[20,0,25,6],[21,9,21,14],[22,8,22,33],[23,10,23,18],[24,29,24,32],[25,7,25,23],[25,26,25,32],[26,0,31,6],[26,7,26,33],[27,7,27,33],[28,7,28,33],[29,7,29,33],[30,7,30,33],[31,7,31,33],[43,1,43,4],[44,1,44,4],[45,1,45,4],[46,1,46,4]]}
["第十八号様式",{"$nulls":35},"シートの保護を解除すると編集が可能になります（パスワードなし）"]
["選　　定　　届"]
[]
["（あて先）株式会社確認検査機構アネックス",{"$nulls":22},"令和",{"$nulls":3},"年",null,null,"月",null,null,"日"]
["届出者の住所(建築主,設置者または築造主)",{"$nulls":16},"届出者の氏名(法人にあっては、名称及び代表者名）"]
["(法人にあっては、主たる事務所の所在地）",{"$nulls":31},"印"]
["〒"]
[]
[{"$nulls":24},"電話番号"]
[]
["工事施工者、工事監理者を定めましたので、\n株式会社確認検査機構アネックス確認検査業務規定第十五条の規定により届け出ます。"]
["確認済証交付年月日\n及び確認済証番号",{"$nulls":6},"令和",{"$nulls":3},"年",null,null,"月",null,null,"日","第",{"$nulls":7},{"$f":"IF(受付用!B9=\"\",\"\",受付用!B9)","v":""},{"$f":"IF(受付用!C9=\"\",\"\",受付用!C9)","v":""},{"$nulls":4},"号"]
["敷地の地名地番"]
["工　事　監　理　者",{"$nulls":6},"所在地",null,null,"〒"]
[]
[{"$nulls":7},"電話番号"]
[{"$nulls":7},"氏名",{"$nulls":14},"資格",{"$nulls":4},"建築士"]
[{"$nulls":22},"（",{"$nulls":4},"）登録　第",{"$nulls":5},"号"]
[{"$nulls":7},"建築士事務所名",{"$nulls":14},"登録",{"$nulls":4},"級建築士事務所"]
[{"$nulls":22},"（",{"$nulls":3},"）知事登録　第",{"$nulls":6},"号"]
["工　事　施　工　者",{"$nulls":6},"住所（法人にあっては、主たる事務所の所在地）"]
[{"$nulls":8},"〒"]
[]
[{"$nulls":7},"電話番号"]
[{"$nulls":7},"氏名（法人にあっては、名称及び代表者名）",{"$nulls":20},"建設業の許可（",{"$nulls":4},"）"]
[{"$nulls":25},"第",{"$nulls":7},"号"]
["その他必要な事項"]
[]
[]
[]
[]
[]
["注1.この届は、建築主、設置者又は築造主でなければできません。"]
["  2.該当する□には、レ印を記入してください。"]
["　3.工事監理者の欄及び工事施工者の欄については、該当する欄に記入してください。"]
["　4.届出者の氏名の記載を自署で行う場合においては押印を省略することができます。"]
[]
[]
[null,"確認建機構ア"]
[null,"変認建機構ア"]
[null,"一級"]
[null,"二級"]
[null,"木造"]
[null,"Ｈ２８"]
[null,2017]
[null,2018]
[null,"2019"]

{"sheet":"建築主等変更","index":24,"n_rows":89,"n_cols":37,"rows_kept":89,"merged":[[4,23,4,24],[4,25,4,26],[4,28,4,29],[4,31,4,32],[6,17,8,31],[6,32,8,33],[7,1,7,6],[8,0,9,16],[9,25,9,33],[11,0,11,33],[12,0,13,6],[14,0,14,6],[14,7,14,8],[14,9,14,10],[14,12,14,13],[14,15,14,16],[14,19,14,20],[14,21,14,25],[14,27,14,28],[14,29,14,31],[14,32,14,33],[15,0,15,6],[15,7,15,33],[16,0,23,6],[16,7,19,9],[16,25,16,33],[17,11,17,13],[17,14,17,33],[18,32,19,33],[19,10,19,31],[20,7,23,9],[20,25,20,33],[21,11,21,13],[21,14,21,33],[22,32,23,33],[23,10,23,31],[24,0,35,6],[24,7,29,9],[24,25,24,33],[25,11,25,13],[25,14,25,33],[26,25,26,26],[27,10,27,22],[27,24,27,26],[27,27,27,29],[27,30,27,32],[28,25,28,26],[29,10,29,22],[29,24,29,25],[29,30,29,32],[30,7,35,9],[30,25,30,33],[31,11,31,13],[31,14,31,33],[32,25,32,26],[33,10,33,22],[33,24,33,26],[33,27,33,29],[33,30,33,32],[34,25,34,26],[35,10,35,22],[35,24,35,25],[35,30,35,32],[36,0,47,6],[36,7,41,9],[36,25,36,33],[37,11,37,13],[37,14,37,33],[38,25,38,26],[39,10,39,22],[39,24,39,26],[39,27,39,29],[39,30,39,32],[40,25,40,26],[41,10,41,22],[41,24,41,25],[41,30,41,32],[42,7,47,9],[42,25,42,33],[43,11,43,13],[43,14,43,33],[44,25,44,26],[45,10,45,22],[45,24,45,26],[45,27,45,29],[45,30,45,32],[46,25,46,26],[47,10,47,22],[47,24,47,25],[47,30,47,32],[48,0,55,6],[48,7,51,9],[48,25,48,33],[49,11,49,13],[49,14,49,33],[50,25,50,27],[50,29,50,32],[51,10,51,33],[52,7,55,9],[52,25,52,33],[53,11,53,13],[53,14,53,33],[54,25,54,27],[54,29,54,32],[55,10,55,33],[56,0,57,6],[56,7,56,33],[57,7,57,33],[85,1,85,4],[86,1,86,4],[87,1,87,4],[88,1,88,4]]}
[]
["第十九号様式",{"$nulls":35},"シートの保護を解除すると編集が可能になります（パスワードなし）"]
["建 築 主 等 変 更 届"]
[]
["（あて先）株式会社確認検査機構アネックス",{"$nulls":22},"令和",{"$nulls":3},"年",null,null,"月",null,null,"日"]
["届出者の住所(建築主,設置者または築造主)",{"$nulls":16},"届出者の氏名(法人にあっては、名称及び代表者名）"]
["(法人にあっては、主たる事務所の所在地）",{"$nulls":31},"印"]
["〒"]
[]
[{"$nulls":24},"電話番号"]
[]
["建築主等の変更が有りましたので、株式会社確認検査機構アネックス確認検査業務規定第十五条の規定により届け出ます。"]
["変更の種別",{"$nulls":6},"□","建築主",{"$nulls":3},"□","設置者",{"$nulls":3},"□","築造主",{"$nulls":3},"□","代理者",{"$nulls":3},"□","工事監理者"]
[{"$nulls":7},"□","工事施工者"]
["確認済証交付年月日\n及び確認済証番号",{"$nulls":6},"令和",{"$nulls":3},"年",null,null,"月",null,null,"日","第",{"$nulls":7},{"$f":"IF(受付用!B9=\"\",\"\",受付用!B9)","v":""},{"$f":"IF(受付用!C9=\"\",\"\",受付用!C9)","v":""},{"$nulls":4},"号"]
["敷地の地名地番"]
["建築主、設置者\n又は築造主",{"$nulls":6},"変更前",null,null,"住所（法人にあっては、主たる事務所の所在地）",{"$nulls":11},"電話番号"]
[{"$nulls":10},"〒"]
[{"$nulls":10},"氏名（法人にあっては、名称及び代表者名）",{"$nulls":21},"印"]
[]
[{"$nulls":7},"変更後",null,null,"住所（法人にあっては、主たる事務所の所在地）",{"$nulls":11},"電話番号"]
[{"$nulls":10},"〒"]
[{"$nulls":10},"氏名（法人にあっては、名称及び代表者名）",{"$nulls":21},"印"]
[]
["代　　理　　者",{"$nulls":6},"変更前",null,null,"所在地",{"$nulls":11},"電話番号"]
[{"$nulls":10},"〒"]
[{"$nulls":10},"氏名",{"$nulls":12},"資格",{"$nulls":3},"建築士"]
[{"$nulls":23},"（",{"$nulls":3},"）登録　第",{"$nulls":5},"号"]
[{"$nulls":10},"建築士事務所名",{"$nulls":12},"登録",{"$nulls":3},"建築士事務所"]
[{"$nulls":23},"（",null,null,"）知事登録　　第",{"$nulls":6},"号"]
[{"$nulls":7},"変更後",null,null,"所在地",{"$nulls":11},"電話番号"]
[{"$nulls":10},"〒"]
[{"$nulls":10},"氏名",{"$nulls":12},"資格",{"$nulls":3},"建築士"]
[{"$nulls":23},"（",{"$nulls":3},"）登録　第",{"$nulls":5},"号"]
[{"$nulls":10},"建築士事務所名",{"$nulls":12},"登録",{"$nulls":3},"建築士事務所"]
[{"$nulls":23},"（",null,null,"）知事登録　　第",{"$nulls":6},"号"]
["工　事　監　理　者",{"$nulls":6},"変更前",null,null,"所在地",{"$nulls":11},"電話番号"]
[{"$nulls":10},"〒"]
[{"$nulls":10},"氏名",{"$nulls":12},"資格",{"$nulls":3},"建築士"]
[{"$nulls":23},"（",{"$nulls":3},"）登録　第",{"$nulls":5},"号"]
[{"$nulls":10},"建築士事務所名",{"$nulls":12},"登録",{"$nulls":3},"建築士事務所"]
[{"$nulls":23},"（",null,null,"）知事登録　　第",{"$nulls":6},"号"]
[{"$nulls":7},"変更後",null,null,"所在地",{"$nulls":11},"電話番号"]
[{"$nulls":10},"〒"]
[{"$nulls":10},"氏名",{"$nulls":12},"資格",{"$nulls":3},"建築士"]
[{"$nulls":23},"（",{"$nulls":3},"）登録　第",{"$nulls":5},"号"]
[{"$nulls":10},"建築士事務所名",{"$nulls":12},"登録",{"$nulls":3},"建築士事務所"]
[{"$nulls":23},"（",null,null,"）知事登録　　第",{"$nulls":6},"号"]
["工　事　施　工　者",{"$nulls":6},"変更前",null,null,"住所（法人にあっては、主たる事務所の所在地）",{"$nulls":11},"電話番号"]
[{"$nulls":10},"〒"]
[{"$nulls":10},"氏名（法人にあっては、名称及び代表者名）",{"$nulls":13},"建設業の許可（",{"$nulls":3},"）第",{"$nulls":4},"号"]
[]
[{"$nulls":7},"変更後",null,null,"住所（法人にあっては、主たる事務所の所在地）",{"$nulls":11},"電話番号"]
[{"$nulls":10},"〒"]
[{"$nulls":10},"氏名（法人にあっては、名称及び代表者名）",{"$nulls":13},"建設業の許可（",{"$nulls":3},"）第",{"$nulls":4},"号"]
[]
["備　　　　　　考"]
[]
["注1　この届は、建築主、設置者又は築造主でなければできません。"]
["　2　該当する□には、レ印を記入してください。"]
["　3　届出者の氏名の記載を自署で行う場合に於いては押印を省略することができます。"]
["　4　届出には変更される確認済証と副本を提出して下さい。"]
["　5　代理者及び建築主に変更が有る場合は新たに委任状を添付してください。"]
[]
[]
[]
[]
[null,"□"]
[null,"■"]
[]
[null,"確認建機構ア",{"$nulls":5},"一級"]
[null,"変認建機構ア",{"$nulls":5},"二級"]
[{"$nulls":7},"木造"]
[]
[{"$nulls":7},"大臣"]
[{"$nulls":7},"滋賀県知事"]
[{"$nulls":7},"京都府知事"]
[{"$nulls":7},"大阪府知事"]
[{"$nulls":7},"奈良県知事"]
[]
[{"$nulls":7},"滋賀県"]
[{"$nulls":7},"京都府"]
[{"$nulls":7},"大阪府"]
[{"$nulls":7},"奈良県"]
[]
[null,"Ｈ２８"]
[null,2017]
[null,2018]
[null,"2019"]

{"sheet":"中間一面","index":25,"n_rows":57,"n_cols":34,"rows_kept":57,"merged":[[2,0,2,2],[15,23,15,24],[15,25,15,26],[17,19,17,30],[18,19,18,28],[23,19,23,28],[39,0,39,1],[39,24,39,25],[41,0,41,2],[41,24,41,26]]}
["第二十六号様式（第四条の八、第四条の十一の二関係）（A4）"]
[{"$nulls":33},"シートの保護を解除すると編集が可能になります（パスワードなし）"]
[]
["中間検査申請書"]
[]
["（第一面）"]
[]
[]
["　特定工程に係る工事を終えましたので、建築基準法第７条の３第２項又は第７条の４第１項（これ"]
["らの規定を同法第８７条の２又は第８８条第１項において準用する場合を含む。）の規定により、検"]
["査を申請します。この申請書及び添付図書に記載の事項は、事実に相違ありません。"]
[]
[]
["指定確認検査機関"]
["株式会社　確認検査機構アネックス  　様"]
[{"$nulls":23},"令和",{"$nulls":3},"年",null,"月",null,"日"]
[{"$nulls":33},"建築主等変更届の提出がないか確認してください"]
[]
[{"$nulls":14},"申請者氏名",{"$nulls":15},"印"]
[]
[]
["第四面に記載の事項は、事実に相違ありません。"]
[]
[{"$nulls":14},"工事監理者氏名",{"$nulls":15},"印"]
[]
[]
[null,null,"【検査を申請する建築物等】"]
[null,null,"■","建築物",{"$nulls":7},"□","建築設備（昇降機）",{"$nulls":9},"□","建築設備（昇降機以外）"]
[null,null,"□","工作物（昇降機）",{"$nulls":7},"□","工作物（法第８８条第１項）"]
[]
[]
["※","手数料欄"]
[]
[]
[]
[]
["※受付欄　　　　",{"$nulls":7},"※検査の特例欄",{"$nulls":4},"※検査欄",{"$nulls":5},"※決裁欄",{"$nulls":4},"※検査済証欄"]
[]
[]
[{"$f":"IF(X16=\"\",\"\",X16)","v":"令和"},null,null,"年",null,"月",null,"日",{"$nulls":16},{"$f":"IF(X16=\"\",\"\",X16)","v":"令和"},null,null,"年",null,"月",null,"日"]
["第",{"$nulls":5},"中間建機構ア",{"$f":"IF(受付用!B11=\"\",\"\",受付用!B11)","v":""},{"$nulls":16},"第",{"$nulls":5},"中間建機構ア",{"$f":"IF(受付用!B11=\"\",\"\",受付用!B11)","v":""}]
[{"$f":"IF(受付用!C11=\"\",\"\",受付用!C11)","v":""},{"$nulls":6},"号","有　・　無",{"$nulls":15},{"$f":"IF(受付用!C11=\"\",\"\",受付用!C11)","v":""},{"$nulls":6},"号"]
["係員印",{"$nulls":23},"係員印"]
{"$rows_empty":7}
[null,"（注意）第一面"]
[null,null,"数字は算用数字を、単位はメートル法を用いてください。"]
[null,"①","申請者又は工事監理者の氏名の記載を自署で行う場合においては、押印を省略することができます。"]
[null,"②","「検査を申請する建築物等」の欄は、該当するチェックボックスに「レ」マークを入れてください。"]
[null,null,"建築基準法第88条第１項に規定する工作物のうち同法施行令第138条第２項第１号に掲げるものにあつ"]
[null,null,"ては、「工作物（昇降機）」のチェックボックスに「レ」マークを入れてください。"]
[null,"③","※印のある欄は記入しないでください。"]

{"sheet":"中間二面","index":26,"n_rows":175,"n_cols":35,"rows_kept":175,"merged":[[5,9,5,31],[6,9,6,31],[7,10,7,15],[8,9,8,31],[9,9,9,15],[13,10,13,11],[13,19,13,22],[13,27,13,30],[14,9,14,31],[15,10,15,11],[15,19,15,21],[15,27,15,30],[16,9,16,31],[17,10,17,15],[18,9,18,31],[19,9,19,15],[24,10,24,11],[24,19,24,22],[24,27,24,30],[25,9,25,31],[26,10,26,11],[26,19,26,21],[26,27,26,30],[27,9,27,31],[28,10,28,15],[29,9,29,31],[30,9,30,15],[31,9,31,31],[34,10,34,11],[34,19,34,22],[34,27,34,30],[35,9,35,31],[36,10,36,11],[36,19,36,21],[36,27,36,30],[37,9,37,31],[38,10,38,15],[39,9,39,31],[40,9,40,15],[41,9,41,31],[43,10,43,11],[43,19,43,22],[43,27,43,30],[44,9,44,31],[45,10,45,11],[45,19,45,21],[45,27,45,30],[46,9,46,31],[47,10,47,15],[48,9,48,31],[49,9,49,15],[50,9,50,31],[52,10,52,11],[52,19,52,22],[52,27,52,30],[53,9,53,31],[54,10,54,11],[54,19,54,21],[54,27,54,30],[55,9,55,31],[56,10,56,15],[57,9,57,31],[58,9,58,15],[59,9,59,31],[64,10,64,11],[64,19,64,22],[64,27,64,30],[65,9,65,31],[66,10,66,11],[66,19,66,21],[66,27,66,30],[67,9,67,31],[68,10,68,15],[69,9,69,31],[70,9,70,15],[71,11,71,31],[74,10,74,11],[74,19,74,22],[74,27,74,30],[75,9,75,31],[76,10,76,11],[76,19,76,21],[76,27,76,30],[77,9,77,31],[78,10,78,15],[79,9,79,31],[80,9,80,15],[81,11,81,31],[83,10,83,11],[83,19,83,22],[83,27,83,30],[84,9,84,31],[85,10,85,11],[85,19,85,21],[85,27,85,30],[86,9,86,31],[87,10,87,15],[88,9,88,31],[89,9,89,15],[90,11,90,31],[92,10,92,11],[92,19,92,22],[92,27,92,30],[93,9,93,31],[94,10,94,11],[94,19,94,21],[94,27,94,30],[95,9,95,31],[96,10,96,15],[97,9,97,31],[98,9,98,15],[99,11,99,31],[104,7,104,31],[105,7,105,31],[106,8,106,13],[107,7,107,31],[108,7,108,13],[109,7,109,13],[110,11,110,31],[113,7,113,31],[114,7,114,31],[115,8,115,13],[116,7,116,31],[117,7,117,13],[118,7,118,13],[119,11,119,31],[121,7,121,31],[122,7,122,31],[123,8,123,13],[124,7,124,31],[125,7,125,13],[126,7,126,13],[127,11,127,31],[129,7,129,31],[130,7,130,31],[131,8,131,13],[132,7,132,31],[133,7,133,13],[134,7,134,13],[135,11,135,31],[139,7,139,31],[140,13,140,16],[140,19,140,25],[141,7,141,31],[142,8,142,13],[143,7,143,31],[144,7,144,13],[147,4,147,31],[148,4,148,31],[149,4,149,31],[150,4,150,31]]}
["建築主等変更届、選定届の提出により確認申請書から記載に変更がないか確認してください。"]
["（第二面）"]
[null,"建築主、設置者又は築造主等の概要",{"$nulls":31},"シートの保護を解除すると編集が可能になります（パスワードなし）"]
[]
["【1.建築主】"]
[null,"【イ.氏名のフリガナ】"]
[null,"【ロ.氏名】"]
[null,"【ハ.郵便番号】",{"$nulls":7},"〒"]
[null,"【ニ.住所】"]
[null,"【ホ.電話番号】"]
[]
[]
["【2.代理者】"]
[null,"【イ.資格】",{"$nulls":7},"（",null,null,"）","建築士",{"$nulls":4},"（",{"$nulls":4},"）","登録",null,"第",{"$nulls":4},"号"]
[null,"【ロ.氏名】"]
[null,"【ハ.建築士事務所名】",{"$nulls":7},"（",null,null,"）","建築士事務所",{"$nulls":4},"（",{"$nulls":3},"）","知事登録第",{"$nulls":7},"号"]
[]
[null,"【ニ.郵便番号】",{"$nulls":7},"〒"]
[null,"【ホ.所在地】"]
[null,"【へ.電話番号】"]
[]
[]
["【3.設計者】"]
[null,"(代表となる設計者)"]
[null,"【イ.資格】",{"$nulls":7},"（",null,null,"）","建築士",{"$nulls":4},"（",{"$nulls":4},"）","登録",null,"第",{"$nulls":4},"号"]
[null,"【ロ.氏名】"]
[null,"【ハ.建築士事務所名】",{"$nulls":7},"（",null,null,"）","建築士事務所",{"$nulls":4},"（",{"$nulls":3},"）","知事登録第",{"$nulls":7},"号"]
[]
[null,"【ニ.郵便番号】",{"$nulls":7},"〒"]
[null,"【ホ.所在地】"]
[null,"【へ.電話番号】"]
[null,"【ト.作成した設計図書】"]
[]
[null,"(その他の設計者)"]
[null,"【イ.資格】",{"$nulls":7},"（",null,null,"）","建築士",{"$nulls":4},"（",{"$nulls":4},"）","登録",null,"第",{"$nulls":4},"号"]
[null,"【ロ.氏名】"]
[null,"【ハ.建築士事務所名】",{"$nulls":7},"（",null,null,"）","建築士事務所",{"$nulls":4},"（",{"$nulls":3},"）","知事登録第",{"$nulls":7},"号"]
[]
[null,"【ニ.郵便番号】",{"$nulls":7},{"$f":"IF(K39=\"\",\"\",\"〒\")","v":""}]
[null,"【ホ.所在地】"]
[null,"【へ.電話番号】"]
[null,"【ト.作成した設計図書】"]
[]
[null,"【イ.資格】",{"$nulls":7},"（",null,null,"）","建築士",{"$nulls":4},"（",{"$nulls":4},"）","登録",null,"第",{"$nulls":4},"号"]
[null,"【ロ.氏名】"]
[null,"【ハ.建築士事務所名】",{"$nulls":7},"（",null,null,"）","建築士事務所",{"$nulls":4},"（",{"$nulls":3},"）","知事登録第",{"$nulls":7},"号"]
[]
[null,"【ニ.郵便番号】",{"$nulls":7},{"$f":"IF(K48=\"\",\"\",\"〒\")","v":""}]
[null,"【ホ.所在地】"]
[null,"【へ.電話番号】"]
[null,"【ト.作成した設計図書】"]
[]
[null,"【イ.資格】",{"$nulls":7},"（",null,null,"）","建築士",{"$nulls":4},"（",{"$nulls":4},"）","登録",null,"第",{"$nulls":4},"号"]
[null,"【ロ.氏名】"]
[null,"【ハ.建築士事務所名】",{"$nulls":7},"（",null,null,"）","建築士事務所",{"$nulls":4},"（",{"$nulls":3},"）","知事登録第",{"$nulls":7},"号"]
[]
[null,"【ニ.郵便番号】",{"$nulls":7},{"$f":"IF(K57=\"\",\"\",\"〒\")","v":""}]
[null,"【ホ.所在地】"]
[null,"【へ.電話番号】"]
[null,"【ト.作成した設計図書】"]
[]
[]
["【4.工事監理者】"]
[null,"(代表となる工事監理者)"]
[null,"【イ.資格】",{"$nulls":7},"（",null,null,"）","建築士",{"$nulls":4},"（",{"$nulls":4},"）","登録",null,"第",{"$nulls":4},"号"]
[null,"【ロ.氏名】"]
[null,"【ハ.建築士事務所名】",{"$nulls":7},"（",null,null,"）","建築士事務所",{"$nulls":4},"（",{"$nulls":3},"）","知事登録第",{"$nulls":7},"号"]
[]
[null,"【ニ.郵便番号】",{"$nulls":7},"〒"]
[null,"【ホ.所在地】"]
[null,"【へ.電話番号】"]
[null,"【ト.工事と照合した設計図書】"]
[]
[null,"(その他の工事監理者)"]
[null,"【イ.資格】",{"$nulls":7},"（",null,null,"）","建築士",{"$nulls":4},"（",{"$nulls":4},"）","登録",null,"第",{"$nulls":4},"号"]
[null,"【ロ.氏名】"]
[null,"【ハ.建築士事務所名】",{"$nulls":7},"（",null,null,"）","建築士事務所",{"$nulls":4},"（",{"$nulls":3},"）","知事登録第",{"$nulls":7},"号"]
[]
[null,"【ニ.郵便番号】",{"$nulls":7},{"$f":"IF(K79=\"\",\"\",\"〒\")","v":""}]
[null,"【ホ.所在地】"]
[null,"【へ.電話番号】"]
[null,"【ト.工事と照合した設計図書】"]
[]
[null,"【イ.資格】",{"$nulls":7},"（",null,null,"）","建築士",{"$nulls":4},"（",{"$nulls":4},"）","登録",null,"第",{"$nulls":4},"号"]
[null,"【ロ.氏名】"]
[null,"【ハ.建築士事務所名】",{"$nulls":7},"（",null,null,"）","建築士事務所",{"$nulls":4},"（",{"$nulls":3},"）","知事登録第",{"$nulls":7},"号"]
[]
[null,"【ニ.郵便番号】",{"$nulls":7},{"$f":"IF(K88=\"\",\"\",\"〒\")","v":""}]
[null,"【ホ.所在地】"]
[null,"【へ.電話番号】"]
[null,"【ト.工事と照合した設計図書】"]
[]
[null,"【イ.資格】",{"$nulls":7},"（",null,null,"）","建築士",{"$nulls":4},"（",{"$nulls":4},"）","登録",null,"第",{"$nulls":4},"号"]
[null,"【ロ.氏名】"]
[null,"【ハ.建築士事務所名】",{"$nulls":7},"（",null,null,"）","建築士事務所",{"$nulls":4},"（",{"$nulls":3},"）","知事登録第",{"$nulls":7},"号"]
[]
[null,"【ニ.郵便番号】",{"$nulls":7},{"$f":"IF(K97=\"\",\"\",\"〒\")","v":""}]
[null,"【ホ.所在地】"]
[null,"【へ.電話番号】"]
[null,"【ト.工事と照合した設計図書】"]
[]
[]
["【5.建築設備の設計に関し意見を聴いた者】"]
[null,"(代表となる建築設備の工事監理に関し意見を聴いた者)"]
[null,"【イ.氏名】"]
[null,"【ロ.勤務先】"]
[null,"【ハ.郵便番号】",{"$nulls":5},{"$f":"IF(I107=\"\",\"\",\"〒\")","v":""}]
[null,"【ニ.所在地】"]
[null,"【ホ.電話番号】"]
[null,"【ヘ.登録番号】"]
[null,"【ト.意見を聴いた設計図書】"]
[]
[null,"(その他の建築設備の工事監理に関し意見を聴いた者)"]
[null,"【イ.氏名】"]
[null,"【ロ.勤務先】"]
[null,"【ハ.郵便番号】",{"$nulls":5},{"$f":"IF(I116=\"\",\"\",\"〒\")","v":""}]
[null,"【ニ.所在地】"]
[null,"【ホ.電話番号】"]
[null,"【ヘ.登録番号】"]
[null,"【ト.意見を聴いた設計図書】"]
[]
[null,"【イ.氏名】"]
[null,"【ロ.勤務先】"]
[null,"【ハ.郵便番号】",{"$nulls":5},{"$f":"IF(I124=\"\",\"\",\"〒\")","v":""}]
[null,"【ニ.所在地】"]
[null,"【ホ.電話番号】"]
[null,"【ヘ.登録番号】"]
[null,"【ト.意見を聴いた設計図書】"]
[]
[null,"【イ.氏名】"]
[null,"【ロ.勤務先】"]
[null,"【ハ.郵便番号】",{"$nulls":5},{"$f":"IF(I132=\"\",\"\",\"〒\")","v":""}]
[null,"【ニ.所在地】"]
[null,"【ホ.電話番号】"]
[null,"【ヘ.登録番号】"]
[null,"【ト.意見を聴いた設計図書】"]
[]
[]
["【6.工事施工者】"]
[null,"【イ.氏名】"]
[null,"【ロ.営業所名】",{"$nulls":5},"建設業の許可",{"$nulls":4},"（",{"$nulls":4},"）","第",{"$nulls":7},"号"]
[]
[null,"【ハ.郵便番号】",{"$nulls":5},"〒"]
[null,"【ニ.所在地】"]
[null,"【ホ.電話番号】"]
[]
[]
["【7.備考】"]
[]
[{"$nulls":33},"←","建築物の名称又は工事名(フリガナ）"]
[{"$nulls":33},"←","建築物の名称又は工事名"]
[]
[]
[]
[]
[null,"（注意）第二面"]
[null,null,"数字は算用数字を、単位はメートル法を用いてください。"]
[null,"①","建築主、設置者又は築造主が２以上のときは、１欄は代表となる建築主、設置者又は築造主について"]
[null,null,"記入し、別紙に他の建築主、設置者又は築造主についてそれぞれ必要な事項を記入して添えてください。"]
[null,"②","建築主、設置者又は築造主からの委任を受けて申請を行う者がいる場合においては、２欄に記入して"]
[null,null,"ください。"]
[null,"③","２欄、３欄及び５欄は、代理者、設計者又は工事監理者が建築士事務所に属しているときは、その名"]
[null,null,"称を書き、建築士事務所に属していないときは、所在地はそれぞれ代理者、設計者又は工事監理者の住"]
[null,null,"所を書いてください。"]
[null,"④","３欄、４欄及び５欄は、それぞれ代表となる設計者、工事監理者及び建築設備の工事監理に関し意見"]
[null,null,"を聴いた者並びに申請に係る建築物に係る他のすべての設計者、工事監理者及び建築設備の工事監理に"]
[null,null,"関し意見を聴いた者について記入してください。記入欄が不足する場合には、別紙に必要な事項を記入"]
[null,null,"して添えてください。"]
[null,"⑤","５欄は、建築士法第20条第５項に規定する場合（工事監理に係る場合に限る。）に、同項に定める資"]
[null,null,"格を有する者について記入し、所在地は、その者が勤務しているときは勤務先の所在地を、勤務してい"]
[null,null,"ないときはその者の住所を登録番号は建築士法施行規則（昭和25年建設省令第38号）第17条の35第"]
[null,null,"１項の規定による登録を受けている場合の当該登録番号を書いてください。"]
[null,"⑥","６欄は、工事施工者が２以上のときは、代表となる工事施工者について記入し、別紙に他の工事施工者"]
[null,null,"について棟別にそれぞれ必要な事項を記入して添えてください。"]
[null,"⑦","建築物又は工作物の名称又は工事名が定まつているときは、７欄に記入してください。"]

{"sheet":"中間三面","index":27,"n_rows":65,"n_cols":65,"rows_kept":65,"merged":[[3,7,3,32],[4,7,4,32],[6,22,6,27],[9,22,9,31],[10,12,10,13],[10,14,10,17],[10,19,10,20],[10,21,10,23],[11,12,11,13],[11,14,11,15],[11,17,11,18],[11,20,11,21],[12,10,12,29],[13,12,13,13],[13,14,13,15],[13,17,13,18],[13,20,13,21],[14,12,14,13],[14,14,14,15],[14,17,14,18],[14,20,14,21],[16,12,16,31],[17,12,17,13],[17,14,17,15],[17,17,17,18],[17,20,17,21],[18,12,18,21],[19,14,19,19],[19,24,19,29],[20,13,20,20],[20,23,20,30],[21,13,21,20],[21,23,21,30],[22,13,22,20],[22,23,22,30],[23,13,23,14],[23,23,23,24],[24,14,24,19],[24,24,24,29],[25,13,25,20],[25,23,25,30],[26,13,26,14],[26,23,26,24],[28,11,28,32],[29,6,29,32],[30,1,30,32],[31,1,31,32],[32,1,32,32],[33,1,33,32],[34,1,34,32],[35,1,35,32],[37,1,37,32],[38,1,38,32],[39,1,39,32],[40,1,40,32],[43,37,43,40],[44,37,44,40],[45,37,45,40],[46,37,46,40]]}
["第三面"]
[null,"申請する工事の概要",{"$nulls":32},"シートの保護を解除すると編集が可能になります（パスワードなし）"]
["【1.建築場所、設置場所又は築造場所】",{"$nulls":63},"確認建機構ア"]
[null,"【イ.地名地番】",{"$nulls":62},"変認建機構ア"]
[null,"【ロ.住居表示】",{"$nulls":62},"㈱確認検査機構アネックス"]
["【2.工事種別】",{"$nulls":63},"第○○中間建機構ア○○○"]
[null,"【イ.建築基準法施行令第１０条各号に掲げる建築物の区分】",{"$nulls":19},"第",{"$nulls":6},"号",{"$nulls":35},1]
[null,"【ロ.工事種別】",{"$nulls":5},"□","新築",{"$nulls":5},"□","増築",{"$nulls":5},"□","改築",{"$nulls":5},"□","移転",{"$nulls":34},2]
[{"$nulls":7},"□","大規模の修繕",{"$nulls":5},"□","大規模の模様替",{"$nulls":5},"□","建築設備の設置",{"$nulls":41},3]
[null,"【ハ.建築基準法第68条の20第2項の検査の特例に係る認証番号】",{"$nulls":62},4]
["【3.確認済証番号】",{"$nulls":10},"第",{"$nulls":6},{"$f":"IF(受付用!B11=\"\",\"\",受付用!B11)","v":""},{"$f":"IF(受付用!C11=\"\",\"\",受付用!C11)","v":""},{"$nulls":4},"号"]
["【4.確認済証交付年月日】",{"$nulls":11},"令和",{"$nulls":3},"年",null,null,"月",null,null,"日"]
["【5.確認済証交付者】",{"$nulls":9},"株式会社確認検査機構アネックス　代表取締役　稲垣　雄一"]
["【6.工事着手年月日】",{"$nulls":11},"令和",{"$nulls":3},"年",null,null,"月",null,null,"日",{"$nulls":14},"●滋賀県●"]
["【7.工事完了予定年月日】",{"$nulls":11},"令和",{"$nulls":3},"年",null,null,"月",null,null,"日",{"$nulls":14},"土台、柱、梁及び筋かいを金物により接合する工事の工程"]
["【8.特定工程】",{"$nulls":36},"壁を設置する工事の工程"]
[null,"【イ.特定工程】",{"$nulls":35},"鉄骨の軸組を溶接し、又はボルト等により接合する工事(建て方)の工程"]
[null,"【ロ.特定工程工事終了年月日】",{"$nulls":10},"令和",{"$nulls":3},"年",null,null,"月",null,null,"日",{"$nulls":14},"2階の床版の取付け又は床版の鉄筋を配置する工事の工程"]
[null,"【ハ.検査対象床面積】",{"$nulls":20},"㎡",{"$nulls":14},"基礎及び地中梁に鉄筋を配置する工事の工程"]
["【9.今回申請以前の中間検査】",{"$nulls":11},"（第",{"$nulls":7},"回","）","（第",{"$nulls":7},"回","）",{"$nulls":5},"2階の床及びこれを支持する梁に鉄筋を配置する工事の工程"]
[null,"【イ.特定工程】",{"$nulls":10},"（",{"$nulls":8},"）","（",{"$nulls":8},"）",{"$nulls":5},"●京都市●"]
[null,"【ロ.中間検査合格証交付者】 ",{"$nulls":10},"（",{"$nulls":8},"）","（",{"$nulls":8},"）",{"$nulls":5},"土台，柱，はり及び筋かいを金物等により接合する工事の工程"]
[null,"【ハ.中間検査合格証番号】",{"$nulls":10},"（",{"$nulls":8},"）","（",{"$nulls":8},"）",{"$nulls":5},"木材で組まれた枠組みを設置する工事の過程"]
[null,"【ニ.交付年月日】　",{"$nulls":10},"（","令和",null,null,"年",null,"月",null,"日","）","（","令和",null,null,"年",null,"月",null,"日","）",{"$nulls":5},"基礎又は地中はりの配筋工事の工程"]
["【10.今回申請以降の中間検査】",{"$nulls":11},"（第",{"$nulls":7},"回","）","（第",{"$nulls":7},"回","）",{"$nulls":5},"最初の床版を取り付ける工事の工程"]
[null,"【イ.特定工程】",{"$nulls":10},"（",{"$nulls":8},"）","（",{"$nulls":8},"）",{"$nulls":5},"2階の床及びこれを支持するはりに鉄筋を配置する工事の工程"]
[null,"【ロ.特定工程工事終了予定年月日】",{"$nulls":10},"（","令和",null,null,"年",null,"月",null,"日","）","（","令和",null,null,"年",null,"月",null,"日","）",{"$nulls":5},"●宇治市●"]
["【11.確認以降の軽微な変更の概要】",{"$nulls":36},"木造の軸組を金物等により接合する工事の工程"]
[null,"【イ.変更された設計図書の種類】",{"$nulls":35},"木材で組まれた枠組を設置する工事の工程"]
[null,"【ロ.変更の概要】",{"$nulls":35},"2階の床の配筋工事の工程"]
[{"$nulls":37},"2階のはりおよび床版の取付け工事の工程"]
[{"$nulls":37},"屋根床版の配筋工事または建方工事の工程"]
[{"$nulls":37},"●京都府●"]
[{"$nulls":37},"木造の軸組を金物等により接合する工事の工程"]
[{"$nulls":37},"耐力壁の設置工事の工程"]
[{"$nulls":37},"２階の床及びこれを支持するはりの配筋工事の工程"]
["【12.備考】",{"$nulls":36},"２階のはり及び床版の取付け工事の工程"]
[{"$nulls":37},"屋根床版の配筋工事又は建方工事の工程"]
[{"$nulls":37},"●大阪府・奈良県は直接入力してください●"]
[]
[]
[]
[]
[null,"（注意）第一面",{"$nulls":35},"Ｈ２８"]
[null,null,"数字は算用数字を、単位はメートル法を用いてください。",{"$nulls":34},2017]
[null,"①","住居表示が定まつているときは、１欄の「ロ」に記入してください。",{"$nulls":34},2018]
[null,"②","２欄の「イ」は、建築物が建築基準法施行令第10条各号に掲げる建築物に該当する場合に、当該各号",{"$nulls":34},"2019"]
[null,null,"の数字を記入してください。"]
[null,"③","２欄の「ロ」は、該当するチェックボックスに「レ」マークを入れてください。"]
[null,"④","２欄の「ハ」は、認証型式部材等製造者が製造をした当該認証に係る型式部材等を有する場合に、その"]
[null,null,"認証番号を記載してください。"]
[null,"⑤","３欄、４欄及び５欄は、計画変更の確認を受けている場合は直前の計画変更の確認について記載して"]
[null,null,"ください。"]
[null,"⑥","８欄の「ハ」は、検査対象となる部分の床面積の合計に相当する面積を記入してください。"]
[null,"⑦","９欄及び10欄は、記入欄が不足する場合には、別紙に必要な事項を記入して添えてください。"]
[null,"⑧","11欄は、軽微な設計変更が２以上あるときは、その一について記入し、別紙にその他の軽微な設計変"]
[null,null,"更について、必要な事項を記入して添えてください。"]
[null,"⑨","11欄の「ロ」は、変更の内容、変更の理由等の概要を記入してください。"]
[null,"⑩","11欄は、既に中間検査を受けたものにあつては、この申請を直前の中間検査を申請した建築主事に対"]
[null,null,"して行う場合には、確認から直前の中間検査までに生じた軽微な設計変更の概要について記入する必要"]
[null,null,"はありません。また、それ以外の場合で、確認から直前の中間検査までに生じた軽微な設計変更の概要"]
[null,null,"についてこの欄に記載すべき事項を記載した書類を別に添付すれば、その部分について記入する必要は"]
[null,null,"ありません。"]
[null,"⑪","11欄は、申請建築物について変更後も建築物の計画が建築基準関係規定に適合することが明らかなこ"]
[null,null,"とが確かめられた旨の図書を添えてください。"]

{"sheet":"中間四面","index":28,"n_rows":50,"n_cols":9,"rows_kept":50,"merged":[[3,0,4,0],[3,1,4,1],[3,2,4,2],[3,3,4,3],[3,4,4,4],[3,5,4,5],[3,7,4,7],[16,1,16,6]]}
["（第四面）"]
["工事監理の状況",{"$nulls":7},"シートの保護を解除すると編集が可能になります（パスワードなし）"]
[]
[null,"確認を行つた部位、材料の種類等","照合内容","照合を行つた設計図書","設計図書の内容について設計者に確認した事項","照合方法","照合結果"]
[{"$nulls":6},"（不適の場合には建築主に対して行った報告の内容）"]
["敷地の形状、高さ、衛生及び安全"]
["主要構造部及び主要構造部以外の構造耐力上主要な部分に用いる材料（接合材料を含む。）の種類、品質、形状及び寸法"]
["主要構造部及び主要構造部以外の構造耐力上主要な部分に用いる材料の接合状況、接合部分の形状等"]
["建築物の各部分の位置、形状及び大きさ"]
["構造耐力上主要な部分の防錆、防腐及び防蟻措置及び状況"]
["特定天井に用いる材料の種類並びに当該特定天井の構造及び施工状況"]
["居室の内装仕上げに用いる建築材料の種別及び当該材料を用いる部分の面積"]
["天井及び壁の室内に面する部分に係る仕上げの材料の種別及び厚さ"]
["開口部に設ける建具の種類及び大きさ"]
["建築設備に用いる材料の種類並びにその照合した内容、構造及び施工状況（区画貫通部の処理状況を含む。）"]
["備         考\n（住宅用防災機器について記載）"]
["備         考"]
[]
[]
["（注意）第一面"]
[null,"数字は算用数字を、単位はメートル法を用いてください。"]
["①","申請建築物（建築基準法第７条の５及び第68条の20第２項（建築物である認証型式部材等に係る場合"]
[null,"に限る。）の適用を受けず、かつ、建築士法第３条から第３条の３までの規定に含まれないものを除く。"]
[null,"以下同じ。）に関する当該特定工程に係る工事までの工事監理の状況について記載してください。ただし、"]
[null,"既に中間検査を受けたものにあつては、この申請を直前の中間検査を申請した建築主事に対して行う場合"]
[null,"には、確認から直前の中間検査までの工事監理の状況について記入する必要はありません。また、それ以"]
[null,"外の場合で、確認から直前の中間検査までの工事監理の状況についてこの書類に記載すべき事項を記載し"]
[null,"た書類を別に添付すれば、その部分について記入する必要はありません。"]
["②","申請建築物が複数の構造方法からなる場合には、それぞれの構造の部分ごとに記載してください。"]
["③","接合状況のうち、鋼材等の金属材料の溶接又は圧接部分に係る内部欠陥の検査、強度検査等の確認につ"]
[null,"いては、当該部分に係る検査を行つた者の氏名及び資格並びに当該検査に係るサンプル数及びその結果を"]
[null,"記載してください。"]
["④","材料のうち、コンクリートについては、四週圧縮強度、塩化物量、アルカリ骨材反応等の試験又は検査"]
[null,"（以下「試験等」という。）を行つた者、試験等に係るサンプル数及び試験等の結果について記載してく"]
[null,"ださい。"]
["⑤","「特定天井に用いる材料の種類並びに当該特定天井の構造及び施工状況」は、建築基準法施行令第39"]
[null,"条第３項、第81条第１項第３号、第82条の５第７号又は第137条の２第１号イ(3)の規定の適用を受ける"]
[null,"部分について記載してください。"]
["⑥","「居室の内装の仕上げに用いる建築材料の種別及び当該建築材料を用いる部分の面積」は、建築基準法"]
[null,"施行令第20条の７第１項第１号に規定する内装の仕上げに用いる建築材料の種別並びに当該建築材料を"]
[null,"用いる内装の仕上げの部分及び当該部分の面積について記載してください。"]
["⑦","「天井及び壁の室内に面する部分に係る仕上げ」は、建築基準法第35条の２の規定の適用を受ける部"]
[null,"分について記載してください。"]
["⑧","「開口部」は、防火設備の設置が義務付けられている部分、建築基準法第28条第１項の規定の適用を"]
[null,"受ける部分及び同法第35条の適用を受ける部分について記載してください。"]
["⑨","「照合結果」は、「適」・「不適」のいずれかを記入し、工事施工者が注意に従わなかつた場合には「不"]
[null,"適」を記入してください。また、不適の場合には建築主に対して行つた報告の内容を記載してください。"]
["⑩","ここに書き表せない事項で特に報告すべき事項は、備考欄又は別紙に記載して添えてください。"]
["⑪","この書類に記載すべき事項を含む報告書を別に添付すれば、この書類を別途提出する必要はありませ"]
[null,"ん。"]

{"sheet":"中間ﾁｪｯｸA表","index":29,"n_rows":77,"n_cols":62,"rows_kept":77,"merged":[[14,1,14,56],[15,1,16,34],[15,35,16,56],[15,59,15,68],[17,1,17,56],[17,60,17,68],[18,1,18,2],[18,3,18,10],[18,11,18,12],[18,13,18,15],[18,16,18,21],[18,22,18,23],[18,24,18,26],[18,27,18,29],[18,30,18,31],[18,32,18,41],[18,42,18,44],[18,45,18,46],[18,47,18,48],[18,49,18,50],[18,51,18,52],[18,53,18,54],[18,55,18,56],[18,60,18,68],[19,1,20,2],[19,3,19,10],[19,11,19,56],[19,60,19,68],[20,3,20,10],[20,11,20,56],[20,60,20,68],[21,1,22,2],[21,3,21,10],[21,11,21,14],[21,15,21,22],[21,23,21,30],[21,31,21,40],[21,41,21,44],[21,45,21,46],[21,47,21,54],[21,55,21,56],[21,60,21,68],[22,3,22,10],[22,11,22,53],[22,54,22,56],[22,60,22,68],[23,1,23,56],[23,60,23,68],[24,1,28,8],[24,9,28,37],[24,38,25,56],[24,60,24,68],[26,38,26,39],[26,41,26,45],[26,46,28,49],[26,50,28,56],[27,38,27,39],[27,41,27,45],[28,38,28,39],[28,41,28,45],[29,1,29,2],[29,3,29,8],[29,9,29,37],[29,38,29,45],[29,46,29,49],[29,50,29,56],[30,1,31,2],[30,3,31,8],[30,9,30,37],[30,38,30,45],[30,46,30,49],[30,50,30,56],[31,9,31,37],[31,38,31,45],[31,46,31,49],[31,50,31,56],[32,1,36,2],[32,3,36,8],[32,9,32,37],[32,38,32,45],[32,46,32,49],[32,50,32,56],[33,9,33,37],[33,38,33,45],[33,46,33,49],[33,50,33,56],[34,9,34,37],[34,38,34,45],[34,46,34,49],[34,50,34,56],[35,9,35,37],[35,38,35,45],[35,46,35,49],[35,50,35,56],[36,9,36,37],[36,38,36,45],[36,46,36,49],[36,50,36,56],[37,1,40,2],[37,3,40,8],[37,9,37,37],[37,38,37,45],[37,46,37,49],[37,50,37,56],[38,9,38,37],[38,38,38,45],[38,46,38,49],[38,50,38,56],[39,9,39,37],[39,38,39,45],[39,46,39,49],[39,50,39,56],[40,9,40,37],[40,38,40,45],[40,46,40,49],[40,50,40,56],[41,1,41,2],[41,3,41,8],[41,15,41,17],[41,18,41,37],[41,38,41,45],[41,46,41,49],[41,50,41,56],[42,1,44,2],[42,3,44,8],[42,9,42,37],[42,38,42,45],[42,46,42,49],[42,50,42,56],[43,9,43,37],[43,38,43,45],[43,46,43,49],[43,50,43,56],[44,9,44,37],[44,38,44,45],[44,46,44,49],[44,50,44,56],[45,1,47,2],[45,3,47,8],[45,9,45,37],[45,38,45,45],[45,46,45,49],[45,50,45,56],[46,9,46,37],[46,38,46,45],[46,46,46,49],[46,50,46,56],[47,9,47,37],[47,38,47,45],[47,46,47,49],[47,50,47,56],[48,1,49,2],[48,3,49,8],[48,9,48,37],[48,38,48,45],[48,46,48,49],[48,50,48,56],[49,9,49,37],[49,38,49,45],[49,46,49,49],[49,50,49,56],[50,1,50,56],[51,1,51,2],[51,3,51,56],[52,3,52,56],[53,1,53,2],[53,3,53,56],[54,1,54,56],[55,1,55,56],[56,1,56,56],[57,1,57,56],[58,1,58,56],[59,1,59,56],[60,1,60,56],[61,1,61,56],[62,1,62,56],[63,1,63,56],[66,3,66,7],[66,9,66,14],[66,16,66,20]]}
[null,"工事監理の状況（中間検査時チェックシート）の取扱いについて（概要）"]
[null,null,"◆","検査申請時に添付するシートは、原則として、A表＋B表に建築物の構造に応じたC1～8表を添付してください。",{"$nulls":57},"シートの保護を解除すると編集が可能になります（パスワードなし）"]
[null,null,"◆","特定工程が2回（RC造等）の場合には、基礎工程の検査申請時にA表＋B表を添付し、上部工程の検査申請時には"]
[{"$nulls":3},"C1～8表のいずれかのみを添付してください。"]
[null,null,"◆","SRC造については、上部工程の検査申請時には、C3、4表の両方を添付してください。"]
[null,null,"◆","混構造の場合には、検査工程については、主たる構造の指定内容に従うが、チェックシートについては、C1～8表の"]
[{"$nulls":3},"うち、混在する各構造に応じた全てのシートを添付してください。"]
[null,null,"◆","Ａ、Ｂ，Ｃ表に併せて、各工程ごと（特に検査時見え隠れ部分）の施工状況が確認できる資料(施工写真、試験成績"]
[{"$nulls":3},"書、材料の出荷証明書等)を提出してください。"]
[null,null,"◆","上記確認資料(写真)については、黒板等で物件名、撮影年月日が確認できるように撮影してください。"]
[null,null,"◆","中間検査対象外の建築物について添付するシートは、B表と建築物の構造に応じたC1～8表を添付してください。"]
[null,null,"◆","中間検査以降に行われた構造耐力上主要な部分の施工については、建築物の構造に応じたC1～8表を添付して"]
[{"$nulls":3},"ください。"]
[]
[]
[null,"工事監理の状況　A表（集団規定等）"]
[]
[]
[null,1,null,"確認済証番号",{"$nulls":7},"第",null,{"$f":"IF(中間三面!M11=\"\",\"\",中間三面!M11)","v":""},null,null,{"$f":"IF(中間三面!O11=\"\",\"\",中間三面!O11)","v":""},{"$nulls":5},{"$f":"IF(中間三面!S11=\"\",\"\",中間三面!S11)","v":""},null,{"$f":"IF(中間三面!T11=\"\",\"\",中間三面!T11)","v":""},null,null,{"$f":"IF(中間三面!V11=\"\",\"\",中間三面!V11)","v":""},null,null,"号",null,"確認済証交付日",{"$nulls":9},{"$f":"IF(中間三面!M12=\"\",\"\",中間三面!M12)","v":"令和"},null,null,{"$f":"IF(中間三面!O12=\"\",\"\",中間三面!O12)","v":""},null,"年",null,{"$f":"IF(中間三面!R12=\"\",\"\",中間三面!R12)","v":""},null,"月",null,{"$f":"IF(中間三面!U12=\"\",\"\",中間三面!U12)","v":""},null,"日"]
[null,2,null,"建築場所",{"$nulls":7},{"$f":"IF(中間三面!H4=\"\",\"\",中間三面!H4)","v":""}]
[{"$nulls":3},"建築主氏名",{"$nulls":7},{"$f":"IF(中間二面!J7=\"\",\"\",IF(別紙追加様式!J6=\"\",中間二面!J7,中間二面!J7&\"　・　\"&別紙追加様式!J6))","v":""}]
[null,3,null,"工事監理者",{"$nulls":7},"資格",{"$nulls":3},{"$f":"IF(中間二面!K65=\"\",\"\",中間二面!K65&\"建築士\")","v":""},{"$nulls":7},"建築士番号",{"$nulls":7},{"$f":"IF(中間二面!T65=\"\",\"\",中間二面!T65)","v":""},{"$nulls":9},"登録",{"$nulls":3},"第",null,{"$f":"IF(中間二面!AB65=\"\",\"\",中間二面!AB65)","v":""},{"$nulls":7},"号"]
[{"$nulls":3},"監理者氏名",{"$nulls":7},{"$f":"IF(中間二面!J66=\"\",\"\",中間二面!J66)","v":""},{"$nulls":42},"印"]
[]
[null,"監　理　項　目",{"$nulls":36},"監　理　記　録"]
[]
[{"$nulls":38},"A",null,"：","目視検査",{"$nulls":4},"結果",{"$nulls":3},"備考"]
[{"$nulls":38},"B",null,"：","実測検査"]
[{"$nulls":38},"C",null,"：","施工者報告"]
[null,1,null,"確認の表示\n(法89条)",{"$nulls":5},"①確認表示板の設置及び記載内容の確認"]
[null,2,null,"敷地の安全性\n(法19条)",{"$nulls":5},"①がけ、又は擁壁の安全性について"]
[{"$nulls":9},"②切り土、盛り土の状況"]
["○",3,null,"敷地と道路\nの関係\n(法42条､43条)",{"$nulls":5},"①道路の幅員"]
["○",{"$nulls":8},"②接道長さの確認"]
["○",{"$nulls":8},"③路地状通路の幅、距離"]
["○",{"$nulls":8},"④法42条2項道路の後退"]
[{"$nulls":9},"⑤法43条許可条件との整合"]
["○",4,null,"敷地形状及び\n建物配置等\n(法52条～\n53条の2)",{"$nulls":5},"①敷地形状等（敷地の形、境界明示及び高低差等）"]
["○",{"$nulls":8},"②建物配置（道路・隣地境界からの寸法距離）"]
[{"$nulls":9},"③確認申請の平面図との照合（平面プランの確認）"]
[{"$nulls":9},"④既存建物の有無（建ぺい率、容積率等）"]
["○",5,null,"壁面後退等\n(法54条)",{"$nulls":5},"①外壁後退【",{"$nulls":8},"m】の確認（検査項目4にも関連）"]
[null,6,null,"道路斜線等\n(法56条､\n56条の2)",{"$nulls":5},"①建築確認図面の立面図、断面図との照合"]
["○",{"$nulls":8},"②最高高さ、軒高さ、庇・軒出寸法の確認"]
["○",{"$nulls":8},"③"]
[null,7,null,"工事現場の\n危害防止\n（法90条）",{"$nulls":5},"①仮囲い等の設置状況"]
[{"$nulls":9},"②危害防止措置（根切りによる転倒防止等）"]
[{"$nulls":9},"③その他"]
[{"$nulls":3},"その他",{"$nulls":5},"①"]
[{"$nulls":9},"②"]
[]
[null,"※",null,"工事監理者は、監理記録欄に監理状況の結果を記入し、中間検査申請書と同時に提出してください。"]
[{"$nulls":3},"なお、否となった事項についてはそれに対する措置等を下記に記入してください。"]
[null,"※",null,"該当する項目のみ記入してください。"]
{"$rows_empty":11}
[{"$nulls":3},"中間二面建築主",{"$nulls":8},{"$f":"IF(中間二面!J7=\"\",\"\",中間二面!J7)","v":""}]
[]
[{"$nulls":3},"A ・ B ・ C",{"$nulls":5},"A ・ B ・ C",{"$nulls":6},"適 ・否"]
[]
[{"$nulls":3},"Ⓐ",{"$nulls":5},"Ⓐ ・ Ⓑ",{"$nulls":6},"適"]
[{"$nulls":3},"Ⓐ ・ Ⓑ",{"$nulls":5},"Ⓐ ・ Ⓑ ・ Ⓒ",{"$nulls":6},"否"]
[{"$nulls":3},"Ⓐ ・ Ⓒ",{"$nulls":5},"Ⓑ",{"$nulls":6},"該当なし"]
[{"$nulls":3},"Ⓐ ・ Ⓑ ・ Ⓒ",{"$nulls":5},"Ⓑ ・ Ⓒ",{"$nulls":6},"-"]
[{"$nulls":3},"Ⓑ",{"$nulls":5},"-"]
[{"$nulls":3},"Ⓑ ・ Ⓒ"]
[{"$nulls":3},"Ⓒ"]
[{"$nulls":3},"-"]

{"sheet":"B表【基礎】","index":30,"n_rows":107,"n_cols":61,"rows_kept":107,"merged":[[1,1,1,56],[2,1,3,36],[2,37,3,56],[4,1,4,56],[5,1,9,8],[5,9,9,37],[5,38,6,56],[7,38,7,39],[7,41,7,45],[7,46,9,49],[7,50,9,56],[8,38,8,39],[8,41,8,45],[9,38,9,39],[9,41,9,45],[10,1,11,2],[10,3,11,8],[10,9,10,37],[10,38,10,45],[10,46,10,49],[10,50,10,56],[11,9,11,37],[11,38,11,45],[11,46,11,49],[11,50,11,56],[12,1,13,2],[12,3,13,8],[12,9,12,37],[12,38,12,45],[12,46,12,49],[12,50,12,56],[13,9,13,37],[13,38,13,45],[13,46,13,49],[13,50,13,56],[14,1,18,2],[14,3,18,8],[14,9,14,37],[14,38,14,45],[14,46,14,49],[14,50,14,56],[15,9,15,37],[15,38,15,45],[15,46,15,49],[15,50,15,56],[16,9,16,37],[16,38,16,45],[16,46,16,49],[16,50,16,56],[17,9,17,37],[17,38,17,45],[17,46,17,49],[17,50,17,56],[18,9,18,37],[18,38,18,45],[18,46,18,49],[18,50,18,56],[19,1,47,2],[19,3,47,8],[19,9,20,14],[19,15,19,37],[19,38,19,45],[19,46,19,49],[19,50,19,56],[20,15,20,37],[20,38,20,45],[20,46,20,49],[20,50,20,56],[21,9,23,14],[21,15,21,37],[21,38,21,45],[21,46,21,49],[21,50,21,56],[22,15,22,37],[22,38,22,45],[22,46,22,49],[22,50,22,56],[23,15,23,37],[23,38,23,45],[23,46,23,49],[23,50,23,56],[24,9,26,14],[24,15,24,37],[24,38,24,45],[24,46,24,49],[24,50,24,56],[25,15,25,37],[25,38,25,45],[25,46,25,49],[25,50,25,56],[26,15,26,37],[26,38,26,45],[26,46,26,49],[26,50,26,56],[27,9,31,14],[27,15,27,37],[27,38,27,45],[27,46,27,49],[27,50,27,56],[28,15,28,37],[28,38,28,45],[28,46,28,49],[28,50,28,56],[29,15,29,37],[29,38,29,45],[29,46,29,49],[29,50,29,56],[30,15,30,37],[30,38,30,45],[30,46,30,49],[30,50,30,56],[31,15,31,37],[31,38,31,45],[31,46,31,49],[31,50,31,56],[32,9,38,14],[32,15,32,37],[32,38,32,45],[32,46,32,49],[32,50,32,56],[33,15,33,37],[33,38,33,45],[33,46,33,49],[33,50,33,56],[34,15,34,37],[34,38,34,45],[34,46,34,49],[34,50,34,56],[35,15,35,37],[35,38,35,45],[35,46,35,49],[35,50,35,56],[36,15,36,37],[36,38,36,45],[36,46,36,49],[36,50,36,56],[37,15,37,37],[37,38,37,45],[37,46,37,49],[37,50,37,56],[38,15,38,37],[38,38,38,45],[38,46,38,49],[38,50,38,56],[39,9,40,14],[39,15,39,37],[39,38,39,45],[39,46,39,49],[39,50,39,56],[40,15,40,37],[40,38,40,45],[40,46,40,49],[40,50,40,56],[41,9,43,14],[41,15,41,37],[41,38,41,45],[41,46,41,49],[41,50,41,56],[42,15,42,37],[42,38,42,45],[42,46,42,49],[42,50,42,56],[43,15,43,37],[43,38,43,45],[43,46,43,49],[43,50,43,56],[44,9,47,14],[44,15,44,37],[44,38,44,45],[44,46,44,49],[44,50,44,56],[45,15,45,37],[45,38,45,45],[45,46,45,49],[45,50,45,56],[46,15,46,37],[46,38,46,45],[46,46,46,49],[46,50,46,56],[47,15,47,37],[47,38,47,45],[47,46,47,49],[47,50,47,56],[48,1,56,2],[48,3,56,8],[48,9,48,37],[48,38,48,45],[48,46,48,49],[48,50,48,56],[49,9,49,37],[49,38,49,45],[49,46,49,49],[49,50,49,56],[50,9,50,37],[50,38,50,45],[50,46,50,49],[50,50,50,56],[51,9,51,37],[51,38,51,45],[51,46,51,49],[51,50,51,56],[52,9,52,37],[52,38,52,45],[52,46,52,49],[52,50,52,56],[53,9,53,37],[53,38,53,45],[53,46,53,49],[53,50,53,56],[54,9,54,37],[54,38,54,45],[54,46,54,49],[54,50,54,56],[55,9,55,37],[55,38,55,45],[55,46,55,49],[55,50,55,56],[56,9,56,37],[56,38,56,45],[56,46,56,49],[56,50,56,56],[57,1,64,2],[57,3,64,8],[57,9,60,14],[57,15,57,37],[57,38,57,45],[57,46,57,49],[57,50,57,56],[58,15,58,37],[58,38,58,45],[58,46,58,49],[58,50,58,56],[59,15,59,37],[59,38,59,45],[59,46,59,49],[59,50,59,56],[60,15,60,37],[60,38,60,45],[60,46,60,49],[60,50,60,56],[61,9,64,14],[61,15,61,37],[61,38,61,45],[61,46,61,49],[61,50,61,56],[62,15,62,37],[62,38,62,45],[62,46,62,49],[62,50,62,56],[63,15,63,37],[63,38,63,45],[63,46,63,49],[63,50,63,56],[64,15,64,37],[64,38,64,45],[64,46,64,49],[64,50,64,56],[65,1,66,2],[65,3,66,8],[65,9,65,37],[65,38,65,45],[65,46,65,49],[65,50,65,56],[66,9,66,37],[66,38,66,45],[66,46,66,49],[66,50,66,56],[67,1,72,2],[67,3,72,8],[67,9,67,37],[67,38,67,45],[67,46,67,49],[67,50,67,56],[68,9,68,37],[68,38,68,45],[68,46,68,49],[68,50,68,56],[69,9,69,37],[69,38,69,45],[69,46,69,49],[69,50,69,56],[70,9,70,37],[70,38,70,45],[70,46,70,49],[70,50,70,56],[71,9,71,37],[71,38,71,45],[71,46,71,49],[71,50,71,56],[72,9,72,37],[72,38,72,45],[72,46,72,49],[72,50,72,56],[73,1,73,56],[74,1,74,2],[74,3,74,56],[75,3,75,56],[76,1,76,2],[76,3,76,56],[77,1,77,56],[78,1,78,56],[79,1,79,56],[80,1,80,56],[81,1,81,56],[82,1,82,56],[83,1,83,56],[84,1,84,56],[85,1,85,56],[86,1,86,56],[89,1,89,2],[89,3,89,56],[90,3,90,56],[91,3,91,56],[92,3,92,56],[93,3,93,56]]}
[{"$nulls":60},"シートの保護を解除すると編集が可能になります（パスワードなし）"]
[]
[null,"工事監理の状況　B表（基礎工程）"]
[]
[]
[null,"監　理　項　目",{"$nulls":36},"監　理　記　録"]
[]
[{"$nulls":38},"A",null,"：","目視検査",{"$nulls":4},"結果",{"$nulls":3},"備考"]
[{"$nulls":38},"B",null,"：","実測検査"]
[{"$nulls":38},"C",null,"：","施工者報告"]
[null,1,null,"基礎種別",{"$nulls":5},"①基礎種別（連続、ベタ、独立、杭、地盤改良等）"]
[{"$nulls":9},"②支持地盤の確認"]
[null,2,null,"使用材料",{"$nulls":5},"①鋼材の種類"]
[{"$nulls":9},"②コンクリートの種類、配合"]
["○","3※",null,"基礎構造体\nの確認",{"$nulls":5},"①形状、寸法"]
["○",{"$nulls":8},"②鉄筋の径、本数、配置等"]
["○",{"$nulls":8},"③継手位置、定着長さ等"]
["○",{"$nulls":8},"④かぶり厚さ"]
["○",{"$nulls":8},"⑤耐圧版の厚さ"]
[null,"4※",null,"基礎構造体\nの確認",{"$nulls":5},"全体形状及び部材配置",{"$nulls":5},"①建築物の平面形状"]
[{"$nulls":15},"②柱、地中梁等の配置"]
["○",{"$nulls":8},"ベース",{"$nulls":5},"①部材の方向、形状、寸法"]
["○",{"$nulls":14},"②鉄筋の径、本数、間隔"]
["○",{"$nulls":14},"③かぶり厚さ"]
["○",{"$nulls":8},"耐圧版",{"$nulls":5},"①主筋及び配力筋の径、配置等"]
["○",{"$nulls":14},"②耐圧版の厚さ"]
["○",{"$nulls":14},"③かぶり厚さ"]
["○",{"$nulls":8},"柱",{"$nulls":5},"①部材の形状、寸法"]
["○",{"$nulls":14},"②主筋の径、本数、配置"]
["○",{"$nulls":14},"③継手位置、定着長さ、フック"]
["○",{"$nulls":14},"④帯筋の径、配置等"]
["○",{"$nulls":14},"⑤かぶり厚さ"]
["○",{"$nulls":8},"地中梁",{"$nulls":5},"①部材の形状、寸法"]
["○",{"$nulls":14},"②主筋の径、本数、配置"]
[{"$nulls":15},"③中吊り筋（2段筋）の位置"]
["○",{"$nulls":14},"④継手位置、定着長さ、フック"]
["○",{"$nulls":14},"⑤あばら筋及び幅止め筋の径、配置等"]
[{"$nulls":15},"⑥貫通孔の補強筋"]
["○",{"$nulls":14},"⑦かぶり厚さ"]
["○",{"$nulls":8},"圧接継手",{"$nulls":5},"①継手位置"]
["○",{"$nulls":14},"②圧接部の外観、ふくらみ"]
["○",{"$nulls":8},"型枠",{"$nulls":5},"①各部分の寸法"]
[{"$nulls":15},"②せき板、支保工等の設置状況"]
[{"$nulls":15},"③型枠内の清掃、異物の除去"]
[{"$nulls":9},"その他",{"$nulls":5},"①差し筋の設置状況"]
[{"$nulls":15},"②"]
[{"$nulls":15},"③"]
[{"$nulls":15},"④"]
["○",5,null,"杭基礎",{"$nulls":5},"①杭芯位置の確認"]
["○",{"$nulls":8},"②杭の種別、径、長さ、本数等"]
[{"$nulls":9},"③継手の溶接状況"]
["○",{"$nulls":8},"④杭頭のレベル、偏芯等"]
[{"$nulls":9},"⑤杭周充填液等の配合、強度試験"]
["○",{"$nulls":8},"⑥場所打ち杭の掘削孔径、深さ等"]
[{"$nulls":9},"⑦場所打ち杭のコンクリート配合、強度等　"]
[{"$nulls":9},"⑧支持層到達の確認"]
[{"$nulls":9},"⑨杭芯ずれによる補強筋の追加"]
["○",6,null,"地盤改良工事",{"$nulls":5},"表層改良",{"$nulls":5},"①施工範囲、改良厚等"]
[{"$nulls":15},"②改良剤の添加量"]
[{"$nulls":15},"③埋戻し、転圧状況"]
[{"$nulls":15},"④改良地盤耐力の確認"]
["○",{"$nulls":8},"柱状改良",{"$nulls":5},"①杭芯位置の確認"]
["○",{"$nulls":14},"②径、長さ、本数等"]
["○",{"$nulls":14},"③杭頭のレベル、偏芯等"]
[{"$nulls":15},"④改良地盤耐力の確認"]
[null,7,null,"地業工事等",{"$nulls":5},"①栗石、砕石等の敷き均し、転圧"]
[{"$nulls":9},"②埋戻し土の転圧"]
[null,8,null,"その他",{"$nulls":5},"①"]
[{"$nulls":9},"②"]
[{"$nulls":9},"③"]
[{"$nulls":9},"④"]
[{"$nulls":9},"⑤"]
[{"$nulls":9},"⑥"]
[]
[null,"※",null,"工事監理者は、監理記録欄に監理状況の結果を記入し、中間検査申請書と同時に提出してください。"]
[{"$nulls":3},"なお、否となった事項についてはそれに対する措置等を下記に記入してください。"]
[null,"※",null,"該当する項目のみ記入してください。"]
{"$rows_empty":12}
[null,"※",null,"記入上の注意事項"]
[{"$nulls":3},"鉄筋コンクリート造、鉄骨鉄筋コンクリート造及びプレキャスト鉄筋コンクリート造の建築物については、"]
[{"$nulls":3},"基礎構造体の確認欄は４欄に記入することとし、３欄は記入不要とする。"]
[{"$nulls":3},"補強コンクリートブロック造及び組積造については、基礎構造体の確認欄は３欄に記入することとするが、"]
[{"$nulls":3},"必要に応じて4欄の該当項目についても記入すること。"]
[]
[]
[]
[{"$nulls":3},"A ・ B ・ C",{"$nulls":5},"A ・ B ・ C",{"$nulls":6},"適 ・否"]
[]
[{"$nulls":3},"Ⓐ",{"$nulls":5},"Ⓐ ・ Ⓑ",{"$nulls":6},"適"]
[{"$nulls":3},"Ⓐ ・ Ⓑ",{"$nulls":5},"Ⓐ ・ Ⓑ ・ Ⓒ",{"$nulls":6},"否"]
[{"$nulls":3},"Ⓐ ・ Ⓒ",{"$nulls":5},"Ⓑ",{"$nulls":6},"該当なし"]
[{"$nulls":3},"Ⓐ ・ Ⓑ ・ Ⓒ",{"$nulls":5},"Ⓑ ・ Ⓒ",{"$nulls":6},"-"]
[{"$nulls":3},"Ⓑ",{"$nulls":5},"-"]
[{"$nulls":3},"Ⓑ ・ Ⓒ"]
[{"$nulls":3},"Ⓒ"]
[{"$nulls":3},"-"]

{"sheet":"C1表【木造軸組】","index":31,"n_rows":67,"n_cols":60,"rows_kept":67,"merged":[[1,1,1,56],[2,1,3,36],[2,37,3,56],[4,1,4,56],[5,1,5,56],[6,1,10,8],[6,9,10,37],[6,38,7,56],[8,38,8,39],[8,41,8,45],[8,46,10,49],[8,50,10,56],[9,38,9,39],[9,41,9,45],[10,38,10,39],[10,41,10,45],[11,1,14,2],[11,3,14,8],[11,9,11,37],[11,38,11,45],[11,46,11,49],[11,50,11,56],[12,9,12,37],[12,38,12,45],[12,46,12,49],[12,50,12,56],[13,9,13,37],[13,38,13,45],[13,46,13,49],[13,50,13,56],[14,9,14,37],[14,38,14,45],[14,46,14,49],[14,50,14,56],[15,1,16,2],[15,3,16,8],[15,9,15,37],[15,38,15,45],[15,46,15,49],[15,50,15,56],[16,9,16,37],[16,38,16,45],[16,46,16,49],[16,50,16,56],[17,1,19,2],[17,3,19,8],[17,9,17,37],[17,38,17,45],[17,46,17,49],[17,50,17,56],[18,9,18,37],[18,38,18,45],[18,46,18,49],[18,50,18,56],[19,9,19,37],[19,38,19,45],[19,46,19,49],[19,50,19,56],[20,1,23,2],[20,3,23,8],[20,9,20,37],[20,38,20,45],[20,46,20,49],[20,50,20,56],[21,9,21,37],[21,38,21,45],[21,46,21,49],[21,50,21,56],[22,9,22,37],[22,38,22,45],[22,46,22,49],[22,50,22,56],[23,9,23,37],[23,38,23,45],[23,46,23,49],[23,50,23,56],[24,1,26,2],[24,3,26,8],[24,9,24,37],[24,38,24,45],[24,46,24,49],[24,50,24,56],[25,9,25,37],[25,38,25,45],[25,46,25,49],[25,50,25,56],[26,9,26,37],[26,38,26,45],[26,46,26,49],[26,50,26,56],[27,1,31,2],[27,3,31,8],[27,9,29,14],[27,15,27,37],[27,38,27,45],[27,46,27,49],[27,50,27,56],[28,15,28,37],[28,38,28,45],[28,46,28,49],[28,50,28,56],[29,15,29,37],[29,38,29,45],[29,46,29,49],[29,50,29,56],[30,9,31,14],[30,15,30,37],[30,38,30,45],[30,46,30,49],[30,50,30,56],[31,15,31,37],[31,38,31,45],[31,46,31,49],[31,50,31,56],[32,1,34,2],[32,3,34,8],[32,9,32,37],[32,38,32,45],[32,46,32,49],[32,50,32,56],[33,9,33,37],[33,38,33,45],[33,46,33,49],[33,50,33,56],[34,9,34,37],[34,38,34,45],[34,46,34,49],[34,50,34,56],[35,1,36,2],[35,3,36,8],[35,9,35,37],[35,38,35,45],[35,46,35,49],[35,50,35,56],[36,9,36,37],[36,38,36,45],[36,46,36,49],[36,50,36,56],[37,1,39,2],[37,3,39,8],[37,9,37,37],[37,38,37,45],[37,46,37,49],[37,50,37,56],[38,9,38,37],[38,38,38,45],[38,46,38,49],[38,50,38,56],[39,9,39,37],[39,38,39,45],[39,46,39,49],[39,50,39,56],[40,1,40,56],[41,1,41,2],[41,3,41,56],[42,3,42,56],[43,1,43,2],[43,3,43,56],[44,1,44,56],[45,1,45,56],[46,1,46,56],[47,1,47,56],[48,1,48,56],[49,1,49,56],[50,1,50,56],[51,1,51,56],[52,1,52,56],[53,1,53,56]]}
[{"$nulls":59},"シートの保護を解除すると編集が可能になります（パスワードなし）"]
[]
[null,"工事監理の状況　C１表（木造軸組構造）"]
[]
[]
[]
[null,"監　理　項　目",{"$nulls":36},"監　理　記　録"]
[]
[{"$nulls":38},"A",null,"：","目視検査",{"$nulls":4},"結果",{"$nulls":3},"備考"]
[{"$nulls":38},"B",null,"：","実測検査"]
[{"$nulls":38},"C",null,"：","施工者報告"]
[null,1,null,"全体形状及び\n部材の配置",{"$nulls":5},"①建築物の形状"]
[{"$nulls":9},"②柱の配置"]
[{"$nulls":9},"③耐力壁の配置"]
[{"$nulls":9},"④小屋組の形状"]
[null,2,null,"基礎",{"$nulls":5},"①床下換気口等の設置"]
[{"$nulls":9},"②構造体のひび割れの有無"]
["○",3,null,"土台",{"$nulls":5},"①部材の形状、寸法"]
[{"$nulls":9},"②アンカーボルトの据付及び緊結状況"]
[{"$nulls":9},"③火打ち材の設置"]
["○",4,null,"柱",{"$nulls":5},"①部材の形状、寸法"]
[{"$nulls":9},"②通し柱の設置"]
[{"$nulls":9},"③接合金物の設置"]
[{"$nulls":9},"④部材の緊結"]
["○",5,null,"横架材",{"$nulls":5},"①部材の形状、寸法"]
[{"$nulls":9},"②部材下部中央の欠き込み禁止"]
[{"$nulls":9},"③部材の緊結"]
["○",6,null,"耐力壁",{"$nulls":5},"筋かい",{"$nulls":5},"①部材の形状、寸法"]
[{"$nulls":15},"②補強金物の取付け"]
[{"$nulls":15},"③欠き込み禁止"]
[{"$nulls":9},"壁材",{"$nulls":5},"①板材の種類、厚さ"]
[{"$nulls":15},"②壁材の釘留め状況（種類、間隔等）"]
["○",7,null,"床組",{"$nulls":5},"①大引、根太の形状、寸法"]
[{"$nulls":9},"②火打ち材の設置"]
[{"$nulls":9},"③剛性床"]
["○",8,null,"小屋組",{"$nulls":5},"①母屋、垂木の形状、寸法、部材の緊結等"]
[{"$nulls":9},"②振れ止め"]
["○",9,null,"その他",{"$nulls":5},"①地盤面からの床高さ"]
[{"$nulls":9},"②防腐・防蟻措置"]
[{"$nulls":9},"③"]
[]
[null,"※",null,"工事監理者は、監理記録欄に監理状況の結果を記入し、中間検査申請書と同時に提出してください。"]
[{"$nulls":3},"なお、否となった事項についてはそれに対する措置等を下記に記入してください。"]
[null,"※",null,"該当する項目のみ記入してください。"]
{"$rows_empty":13}
[{"$nulls":3},"A ・ B ・ C",{"$nulls":5},"A ・ B ・ C",{"$nulls":6},"適 ・否"]
[]
[{"$nulls":3},"Ⓐ",{"$nulls":5},"Ⓐ ・ Ⓑ",{"$nulls":6},"適"]
[{"$nulls":3},"Ⓐ ・ Ⓑ",{"$nulls":5},"Ⓐ ・ Ⓑ ・ Ⓒ",{"$nulls":6},"否"]
[{"$nulls":3},"Ⓐ ・ Ⓒ",{"$nulls":5},"Ⓑ",{"$nulls":6},"該当なし"]
[{"$nulls":3},"Ⓐ ・ Ⓑ ・ Ⓒ",{"$nulls":5},"Ⓑ ・ Ⓒ",{"$nulls":6},"-"]
[{"$nulls":3},"Ⓑ",{"$nulls":5},"-"]
[{"$nulls":3},"Ⓑ ・ Ⓒ"]
[{"$nulls":3},"Ⓒ"]
[{"$nulls":3},"-"]

{"sheet":"C2表【2×4】","index":32,"n_rows":68,"n_cols":60,"rows_kept":68,"merged":[[1,1,1,56],[2,1,3,36],[2,37,3,56],[4,1,4,56],[5,1,5,56],[6,1,10,8],[6,9,10,37],[6,38,7,56],[8,38,8,39],[8,41,8,45],[8,46,10,49],[8,50,10,56],[9,38,9,39],[9,41,9,45],[10,38,10,39],[10,41,10,45],[11,1,14,2],[11,3,14,8],[11,9,11,37],[11,38,11,45],[11,46,11,49],[11,50,11,56],[12,9,12,37],[12,38,12,45],[12,46,12,49],[12,50,12,56],[13,9,13,37],[13,38,13,45],[13,46,13,49],[13,50,13,56],[14,9,14,37],[14,38,14,45],[14,46,14,49],[14,50,14,56],[15,1,16,2],[15,3,16,8],[15,9,15,37],[15,38,15,45],[15,46,15,49],[15,50,15,56],[16,9,16,37],[16,38,16,45],[16,46,16,49],[16,50,16,56],[17,1,18,2],[17,3,18,8],[17,9,17,37],[17,38,17,45],[17,46,17,49],[17,50,17,56],[18,9,18,37],[18,38,18,45],[18,46,18,49],[18,50,18,56],[19,1,20,2],[19,3,20,8],[19,9,19,37],[19,38,19,45],[19,46,19,49],[19,50,19,56],[20,9,20,37],[20,38,20,45],[20,46,20,49],[20,50,20,56],[21,1,25,2],[21,3,25,8],[21,9,21,37],[21,38,21,45],[21,46,21,49],[21,50,21,56],[22,9,22,37],[22,38,22,45],[22,46,22,49],[22,50,22,56],[23,9,23,37],[23,38,23,45],[23,46,23,49],[23,50,23,56],[24,9,24,37],[24,38,24,45],[24,46,24,49],[24,50,24,56],[25,9,25,37],[25,38,25,45],[25,46,25,49],[25,50,25,56],[26,1,30,2],[26,3,30,8],[26,9,26,37],[26,38,26,45],[26,46,26,49],[26,50,26,56],[27,9,27,37],[27,38,27,45],[27,46,27,49],[27,50,27,56],[28,9,28,37],[28,38,28,45],[28,46,28,49],[28,50,28,56],[29,9,29,37],[29,38,29,45],[29,46,29,49],[29,50,29,56],[30,9,30,37],[30,38,30,45],[30,46,30,49],[30,50,30,56],[31,1,34,2],[31,3,34,8],[31,9,31,37],[31,38,31,45],[31,46,31,49],[31,50,31,56],[32,9,32,37],[32,38,32,45],[32,46,32,49],[32,50,32,56],[33,9,33,37],[33,38,33,45],[33,46,33,49],[33,50,33,56],[34,9,34,37],[34,38,34,45],[34,46,34,49],[34,50,34,56],[35,1,39,2],[35,3,39,8],[35,9,35,37],[35,38,35,45],[35,46,35,49],[35,50,35,56],[36,9,36,37],[36,38,36,45],[36,46,36,49],[36,50,36,56],[37,9,37,37],[37,38,37,45],[37,46,37,49],[37,50,37,56],[38,9,38,37],[38,38,38,45],[38,46,38,49],[38,50,38,56],[39,9,39,37],[39,38,39,45],[39,46,39,49],[39,50,39,56],[40,1,40,56],[41,1,41,2],[41,3,41,56],[42,3,42,56],[43,1,43,2],[43,3,43,56],[44,1,44,56],[45,1,45,56],[46,1,46,56],[47,1,47,56],[48,1,48,56],[49,1,49,56],[50,1,50,56],[51,1,51,56],[52,1,52,56],[53,1,53,56],[54,1,54,56]]}
[{"$nulls":59},"シートの保護を解除すると編集が可能になります（パスワードなし）"]
[]
[null,"工事監理の状況　C2表（木造枠組構造）"]
[]
[]
[]
[null,"監　理　項　目",{"$nulls":36},"監　理　記　録"]
[]
[{"$nulls":38},"A",null,"：","目視検査",{"$nulls":4},"結果",{"$nulls":3},"備考"]
[{"$nulls":38},"B",null,"：","実測検査"]
[{"$nulls":38},"C",null,"：","施工者報告"]
[null,1,null,"全体形状及び\n部材の配置",{"$nulls":5},"①建築物の形状"]
[{"$nulls":9},"②耐力壁の配置"]
[{"$nulls":9},"③小屋組の形状"]
[{"$nulls":9},"④補強金物の取付設置状況"]
[null,2,null,"使用材料",{"$nulls":5},"①木材、合板の種類"]
[{"$nulls":9},"②緊結金物"]
[null,3,null,"基礎",{"$nulls":5},"①床下換気口等の設置"]
[{"$nulls":9},"②構造体のひび割れの有無"]
["○",4,null,"土台",{"$nulls":5},"①部材の形状、寸法"]
[{"$nulls":9},"②アンカーボルトの据付及び緊結状況"]
["○",5,null,"床構面",{"$nulls":5},"①根太の形状、寸法、配置"]
[{"$nulls":9},"②開口部の補強"]
[{"$nulls":9},"③耐力壁下根太補強"]
[{"$nulls":9},"④転び止め"]
[{"$nulls":9},"⑤床材の釘留め状況（種類、間隔等）"]
[null,6,null,"耐力壁",{"$nulls":5},"①たて枠の配置"]
[{"$nulls":9},"②隅角部、交差部の補強"]
[{"$nulls":9},"③頭つなぎ"]
[{"$nulls":9},"④まぐさ、まぐさ受け"]
["○",{"$nulls":8},"⑤壁材の釘留め状況（種類、間隔等）"]
["○",7,null,"小屋組",{"$nulls":5},"①垂木の形状、寸法"]
[{"$nulls":9},"②垂木つなぎ"]
[{"$nulls":9},"③垂木、トラスの緊結"]
[{"$nulls":9},"④振れ止め"]
["○",8,null,"その他",{"$nulls":5},"①地盤面からの床高さ"]
[{"$nulls":9},"②防腐・防蟻措置"]
[{"$nulls":9},"③"]
[{"$nulls":9},"④"]
[{"$nulls":9},"⑤"]
[]
[null,"※",null,"工事監理者は、監理記録欄に監理状況の結果を記入し、中間検査申請書と同時に提出してください。"]
[{"$nulls":3},"なお、否となった事項についてはそれに対する措置等を下記に記入してください。"]
[null,"※",null,"該当する項目のみ記入してください。"]
{"$rows_empty":14}
[{"$nulls":3},"A ・ B ・ C",{"$nulls":5},"A ・ B ・ C",{"$nulls":6},"適 ・否"]
[]
[{"$nulls":3},"Ⓐ",{"$nulls":5},"Ⓐ ・ Ⓑ",{"$nulls":6},"適"]
[{"$nulls":3},"Ⓐ ・ Ⓑ",{"$nulls":5},"Ⓐ ・ Ⓑ ・ Ⓒ",{"$nulls":6},"否"]
[{"$nulls":3},"Ⓐ ・ Ⓒ",{"$nulls":5},"Ⓑ",{"$nulls":6},"該当なし"]
[{"$nulls":3},"Ⓐ ・ Ⓑ ・ Ⓒ",{"$nulls":5},"Ⓑ ・ Ⓒ",{"$nulls":6},"-"]
[{"$nulls":3},"Ⓑ",{"$nulls":5},"-"]
[{"$nulls":3},"Ⓑ ・ Ⓒ"]
[{"$nulls":3},"Ⓒ"]
[{"$nulls":3},"-"]

{"sheet":"C3表【S・SRC】","index":33,"n_rows":68,"n_cols":60,"rows_kept":68,"merged":[[1,1,1,56],[2,1,3,36],[2,37,3,56],[4,1,4,56],[5,1,5,56],[6,1,10,8],[6,9,10,37],[6,38,7,56],[8,38,8,39],[8,41,8,45],[8,46,10,49],[8,50,10,56],[9,38,9,39],[9,41,9,45],[10,38,10,39],[10,41,10,45],[11,1,15,2],[11,3,15,8],[11,9,11,37],[11,38,11,45],[11,46,11,49],[11,50,11,56],[12,9,12,37],[12,38,12,45],[12,46,12,49],[12,50,12,56],[13,9,13,37],[13,38,13,45],[13,46,13,49],[13,50,13,56],[14,9,14,37],[14,38,14,45],[14,46,14,49],[14,50,14,56],[15,9,15,37],[15,38,15,45],[15,46,15,49],[15,50,15,56],[16,1,17,2],[16,3,17,8],[16,9,16,37],[16,38,16,45],[16,46,16,49],[16,50,16,56],[17,9,17,37],[17,38,17,45],[17,46,17,49],[17,50,17,56],[18,1,22,2],[18,3,22,8],[18,9,18,37],[18,38,18,45],[18,46,18,49],[18,50,18,56],[19,9,19,37],[19,38,19,45],[19,46,19,49],[19,50,19,56],[20,9,20,37],[20,38,20,45],[20,46,20,49],[20,50,20,56],[21,9,21,37],[21,38,21,45],[21,46,21,49],[21,50,21,56],[22,9,22,37],[22,38,22,45],[22,46,22,49],[22,50,22,56],[23,1,25,2],[23,3,25,8],[23,9,23,37],[23,38,23,45],[23,46,23,49],[23,50,23,56],[24,9,24,37],[24,38,24,45],[24,46,24,49],[24,50,24,56],[25,9,25,37],[25,38,25,45],[25,46,25,49],[25,50,25,56],[26,1,28,2],[26,3,28,8],[26,9,26,37],[26,38,26,45],[26,46,26,49],[26,50,26,56],[27,9,27,37],[27,38,27,45],[27,46,27,49],[27,50,27,56],[28,9,28,37],[28,38,28,45],[28,46,28,49],[28,50,28,56],[29,1,29,2],[29,3,29,8],[29,9,29,37],[29,38,29,45],[29,46,29,49],[29,50,29,56],[30,1,31,2],[30,3,31,8],[30,9,30,37],[30,38,30,45],[30,46,30,49],[30,50,30,56],[31,9,31,37],[31,38,31,45],[31,46,31,49],[31,50,31,56],[32,1,33,2],[32,3,33,8],[32,9,32,37],[32,38,32,45],[32,46,32,49],[32,50,32,56],[33,9,33,37],[33,38,33,45],[33,46,33,49],[33,50,33,56],[34,1,37,2],[34,3,37,8],[34,9,34,37],[34,38,34,45],[34,46,34,49],[34,50,34,56],[35,9,35,37],[35,38,35,45],[35,46,35,49],[35,50,35,56],[36,9,36,37],[36,38,36,45],[36,46,36,49],[36,50,36,56],[37,9,37,37],[37,38,37,45],[37,46,37,49],[37,50,37,56],[38,1,38,56],[39,1,39,2],[39,3,39,56],[40,3,40,56],[41,1,41,2],[41,3,41,56],[42,1,42,56],[43,1,43,56],[44,1,44,56],[45,1,45,56],[46,1,46,56],[47,1,47,56],[48,1,48,56],[49,1,49,56],[50,1,50,56],[51,1,51,56],[52,1,52,56],[53,1,53,56]]}
[{"$nulls":59},"シートの保護を解除すると編集が可能になります（パスワードなし）"]
[]
[null,"工事監理の状況　C3表（鉄骨造・鉄骨鉄筋コンクリート造）"]
[]
[]
[]
[null,"監　理　項　目",{"$nulls":36},"監　理　記　録"]
[]
[{"$nulls":38},"A",null,"：","目視検査",{"$nulls":4},"結果",{"$nulls":3},"備考"]
[{"$nulls":38},"B",null,"：","実測検査"]
[{"$nulls":38},"C",null,"：","施工者報告"]
[null,1,null,"全体形状及び\n部材の配置",{"$nulls":5},"①建築物の形状"]
["○",{"$nulls":8},"②建方の精度"]
[{"$nulls":9},"③柱、梁の配置"]
[{"$nulls":9},"④垂直、水平ブレースの配置"]
[{"$nulls":9},"⑤剛性床の配置"]
[null,2,null,"使用材料",{"$nulls":5},"①鋼材の種類"]
[{"$nulls":9},"②高力ボルトの規格"]
["○",3,null,"柱",{"$nulls":5},"①部材の形状、寸法"]
[{"$nulls":9},"②溶接箇所の外観"]
["○",{"$nulls":8},"③ベースプレートの寸法、モルタル充填等"]
["○",{"$nulls":8},"④アンカーボルトの径、本数、締付け状況等"]
[{"$nulls":9},"⑤露出型固定柱脚のメーカーチェックシートによる確認"]
["○",4,null,"大梁",{"$nulls":5},"①部材の形状、寸法"]
["○",{"$nulls":8},"②ボルトの種類、径、本数、締付け状況等"]
[{"$nulls":9},"③溶接箇所の外観"]
["○",5,null,"小梁",{"$nulls":5},"①部材の形状、寸法"]
["○",{"$nulls":8},"②ボルトの種類、径、本数、締付け状況等"]
[{"$nulls":9},"③溶接箇所の外観"]
[null,6,null,"柱、梁の仕口",{"$nulls":5},"①溶接箇所の外観"]
["○",7,null,"床",{"$nulls":5},"①部材の形状、寸法"]
[{"$nulls":9},"②梁との接合方法"]
["○",8,null,"ブレース",{"$nulls":5},"①部材の形状、寸法及び位置"]
[{"$nulls":9},"②取付け方法"]
[null,9,null,"その他",{"$nulls":5},"①防錆処置"]
[{"$nulls":9},"②溶接部分の非破壊試験"]
[{"$nulls":9},"③梁貫通孔の補強"]
[{"$nulls":9},"④"]
[]
[null,"※",null,"工事監理者は、監理記録欄に監理状況の結果を記入し、中間検査申請書と同時に提出してください。"]
[{"$nulls":3},"なお、否となった事項についてはそれに対する措置等を下記に記入してください。"]
[null,"※",null,"該当する項目のみ記入してください。"]
{"$rows_empty":16}
[{"$nulls":4},"A ・ B ・ C",{"$nulls":5},"A ・ B ・ C",{"$nulls":6},"適 ・否"]
[]
[{"$nulls":4},"Ⓐ",{"$nulls":5},"Ⓐ ・ Ⓑ",{"$nulls":6},"適"]
[{"$nulls":4},"Ⓐ ・ Ⓑ",{"$nulls":5},"Ⓐ ・ Ⓑ ・ Ⓒ",{"$nulls":6},"否"]
[{"$nulls":4},"Ⓐ ・ Ⓒ",{"$nulls":5},"Ⓑ",{"$nulls":6},"該当なし"]
[{"$nulls":4},"Ⓐ ・ Ⓑ ・ Ⓒ",{"$nulls":5},"Ⓑ ・ Ⓒ",{"$nulls":6},"-"]
[{"$nulls":4},"Ⓑ",{"$nulls":5},"-"]
[{"$nulls":4},"Ⓑ ・ Ⓒ"]
[{"$nulls":4},"Ⓒ"]
[{"$nulls":4},"-"]

{"sheet":"C4表【RC・SRC】","index":34,"n_rows":68,"n_cols":60,"rows_kept":68,"merged":[[1,1,1,56],[2,1,3,37],[2,38,3,56],[4,1,4,56],[5,1,5,56],[6,1,10,8],[6,9,10,37],[6,38,7,56],[8,38,8,39],[8,41,8,45],[8,46,10,49],[8,50,10,56],[9,38,9,39],[9,41,9,45],[10,38,10,39],[10,41,10,45],[11,1,12,2],[11,3,12,8],[11,9,11,37],[11,38,11,45],[11,46,11,49],[11,50,11,56],[12,9,12,37],[12,38,12,45],[12,46,12,49],[12,50,12,56],[13,1,14,2],[13,3,14,8],[13,9,13,37],[13,38,13,45],[13,46,13,49],[13,50,13,56],[14,9,14,37],[14,38,14,45],[14,46,14,49],[14,50,14,56],[15,1,19,2],[15,3,19,8],[15,9,15,37],[15,38,15,45],[15,46,15,49],[15,50,15,56],[16,9,16,37],[16,38,16,45],[16,46,16,49],[16,50,16,56],[17,9,17,37],[17,38,17,45],[17,46,17,49],[17,50,17,56],[18,9,18,37],[18,38,18,45],[18,46,18,49],[18,50,18,56],[19,9,19,37],[19,38,19,45],[19,46,19,49],[19,50,19,56],[20,1,25,2],[20,3,25,8],[20,9,20,37],[20,38,20,45],[20,46,20,49],[20,50,20,56],[21,9,21,37],[21,38,21,45],[21,46,21,49],[21,50,21,56],[22,9,22,37],[22,38,22,45],[22,46,22,49],[22,50,22,56],[23,9,23,37],[23,38,23,45],[23,46,23,49],[23,50,23,56],[24,9,24,37],[24,38,24,45],[24,46,24,49],[24,50,24,56],[25,9,25,37],[25,38,25,45],[25,46,25,49],[25,50,25,56],[26,1,31,2],[26,3,31,8],[26,9,26,37],[26,38,26,45],[26,46,26,49],[26,50,26,56],[27,9,27,37],[27,38,27,45],[27,46,27,49],[27,50,27,56],[28,9,28,37],[28,38,28,45],[28,46,28,49],[28,50,28,56],[29,9,29,37],[29,38,29,45],[29,46,29,49],[29,50,29,56],[30,9,30,37],[30,38,30,45],[30,46,30,49],[30,50,30,56],[31,9,31,37],[31,38,31,45],[31,46,31,49],[31,50,31,56],[32,1,36,2],[32,3,36,8],[32,9,32,37],[32,38,32,45],[32,46,32,49],[32,50,32,56],[33,9,33,37],[33,38,33,45],[33,46,33,49],[33,50,33,56],[34,9,34,37],[34,38,34,45],[34,46,34,49],[34,50,34,56],[35,9,35,37],[35,38,35,45],[35,46,35,49],[35,50,35,56],[36,9,36,37],[36,38,36,45],[36,46,36,49],[36,50,36,56],[37,1,38,2],[37,3,38,8],[37,9,37,37],[37,38,37,45],[37,46,37,49],[37,50,37,56],[38,9,38,37],[38,38,38,45],[38,46,38,49],[38,50,38,56],[39,1,41,2],[39,3,41,8],[39,9,39,37],[39,38,39,45],[39,46,39,49],[39,50,39,56],[40,9,40,37],[40,38,40,45],[40,46,40,49],[40,50,40,56],[41,9,41,37],[41,38,41,45],[41,46,41,49],[41,50,41,56],[42,1,43,2],[42,3,43,8],[42,9,42,37],[42,38,42,45],[42,46,42,49],[42,50,42,56],[43,9,43,37],[43,38,43,45],[43,46,43,49],[43,50,43,56],[44,1,44,56],[45,1,45,2],[45,3,45,56],[46,3,46,56],[47,1,47,2],[47,3,47,56],[48,1,48,56],[49,1,49,56],[50,1,50,56],[51,1,51,56],[52,1,52,56],[53,1,53,56],[54,1,54,56]]}
[{"$nulls":59},"シートの保護を解除すると編集が可能になります（パスワードなし）"]
[]
[null,"工事監理の状況　C4表（鉄筋コンクリート造・鉄骨鉄筋コンクリート造）"]
[]
[]
[]
[null,"監　理　項　目",{"$nulls":36},"監　理　記　録"]
[]
[{"$nulls":38},"A",null,"：","目視検査",{"$nulls":4},"結果",{"$nulls":3},"備考"]
[{"$nulls":38},"B",null,"：","実測検査"]
[{"$nulls":38},"C",null,"：","施工者報告"]
[null,1,null,"全体形状及び\n部材の配置",{"$nulls":5},"①建築物の平面形状"]
[{"$nulls":9},"②柱、梁の配置"]
[null,2,null,"使用材料",{"$nulls":5},"①鋼材の種類"]
[{"$nulls":9},"②コンクリートの種類、強度"]
["○",3,null,"柱",{"$nulls":5},"①部材の形状、寸法"]
["○",{"$nulls":8},"②主筋の径、本数、配置等"]
["○",{"$nulls":8},"③継手位置、定着長さ、フック"]
["○",{"$nulls":8},"④帯筋の径、配置等"]
["○",{"$nulls":8},"⑤かぶり厚さ"]
["○",4,null,"梁",{"$nulls":5},"①部材の形状、寸法"]
["○",{"$nulls":8},"②主筋の径、本数、配置、中吊り筋（2段筋）の位置"]
["○",{"$nulls":8},"③継手位置、定着長さ、フック"]
["○",{"$nulls":8},"④あばら筋及び幅止め筋の径、配置等"]
[{"$nulls":9},"⑤貫通孔の補強筋"]
["○",{"$nulls":8},"⑥かぶり厚さ"]
["○",5,null,"壁",{"$nulls":5},"①部材の形状、寸法"]
["○",{"$nulls":8},"②縦・横筋の径、配置等"]
["○",{"$nulls":8},"③継手位置、定着長さ、フック"]
["○",{"$nulls":8},"④開口部の補強筋、配置等"]
["○",{"$nulls":8},"⑤幅止め筋の径、配置等"]
["○",{"$nulls":8},"⑥かぶり厚さ"]
["○",6,null,"床、階段",{"$nulls":5},"①部材の形状、寸法"]
["○",{"$nulls":8},"②主筋及び配力筋の径、配置"]
["○",{"$nulls":8},"③継手位置、定着長さ、フック"]
[{"$nulls":9},"④開口部の補強筋"]
["○",{"$nulls":8},"⑤かぶり厚さ"]
["○",7,null,"圧接継手",{"$nulls":5},"①継手位置"]
["○",{"$nulls":8},"②圧接部の外観、ふくらみ"]
["○",8,null,"型枠",{"$nulls":5},"①各部分の寸法"]
[{"$nulls":9},"②せき板、支保工等の設置状況"]
[{"$nulls":9},"③型枠内の清掃、異物の除去"]
[null,9,null,"その他",{"$nulls":5},"①差し筋の設置状況"]
[{"$nulls":9},"②"]
[]
[null,"※",null,"工事監理者は、監理記録欄に監理状況の結果を記入し、中間検査申請書と同時に提出してください。"]
[{"$nulls":3},"なお、否となった事項についてはそれに対する措置等を下記に記入してください。"]
[null,"※",null,"該当する項目のみ記入してください。"]
{"$rows_empty":10}
[{"$nulls":4},"A ・ B ・ C",{"$nulls":5},"A ・ B ・ C",{"$nulls":6},"適 ・否"]
[]
[{"$nulls":4},"Ⓐ",{"$nulls":5},"Ⓐ ・ Ⓑ",{"$nulls":6},"適"]
[{"$nulls":4},"Ⓐ ・ Ⓑ",{"$nulls":5},"Ⓐ ・ Ⓑ ・ Ⓒ",{"$nulls":6},"否"]
[{"$nulls":4},"Ⓐ ・ Ⓒ",{"$nulls":5},"Ⓑ",{"$nulls":6},"該当なし"]
[{"$nulls":4},"Ⓐ ・ Ⓑ ・ Ⓒ",{"$nulls":5},"Ⓑ ・ Ⓒ",{"$nulls":6},"-"]
[{"$nulls":4},"Ⓑ",{"$nulls":5},"-"]
[{"$nulls":4},"Ⓑ ・ Ⓒ"]
[{"$nulls":4},"Ⓒ"]
[{"$nulls":4},"-"]

{"sheet":"C5表【PC】","index":35,"n_rows":68,"n_cols":60,"rows_kept":68,"merged":[[1,1,1,56],[2,1,3,37],[2,38,3,56],[4,1,4,56],[5,1,5,56],[6,1,10,8],[6,9,10,37],[6,38,7,56],[8,38,8,39],[8,41,8,45],[8,46,10,49],[8,50,10,56],[9,38,9,39],[9,41,9,45],[10,38,10,39],[10,41,10,45],[11,1,12,2],[11,3,12,8],[11,9,11,37],[11,38,11,45],[11,46,11,49],[11,50,11,56],[12,9,12,37],[12,38,12,45],[12,46,12,49],[12,50,12,56],[13,1,20,2],[13,3,20,8],[13,9,13,37],[13,38,13,45],[13,46,13,49],[13,50,13,56],[14,9,14,37],[14,38,14,45],[14,46,14,49],[14,50,14,56],[15,9,15,37],[15,38,15,45],[15,46,15,49],[15,50,15,56],[16,9,16,37],[16,38,16,45],[16,46,16,49],[16,50,16,56],[17,9,17,37],[17,38,17,45],[17,46,17,49],[17,50,17,56],[18,9,18,37],[18,38,18,45],[18,46,18,49],[18,50,18,56],[19,9,19,37],[19,38,19,45],[19,46,19,49],[19,50,19,56],[20,9,20,37],[20,38,20,45],[20,46,20,49],[20,50,20,56],[21,1,24,2],[21,3,24,8],[21,9,21,37],[21,38,21,45],[21,46,21,49],[21,50,21,56],[22,9,22,37],[22,38,22,45],[22,46,22,49],[22,50,22,56],[23,9,23,37],[23,38,23,45],[23,46,23,49],[23,50,23,56],[24,9,24,37],[24,38,24,45],[24,46,24,49],[24,50,24,56],[25,1,31,2],[25,3,31,8],[25,9,28,12],[25,13,25,37],[25,38,25,45],[25,46,25,49],[25,50,25,56],[26,13,26,37],[26,38,26,45],[26,46,26,49],[26,50,26,56],[27,13,27,37],[27,38,27,45],[27,46,27,49],[27,50,27,56],[28,13,28,37],[28,38,28,45],[28,46,28,49],[28,50,28,56],[29,9,31,12],[29,13,29,37],[29,38,29,45],[29,46,29,49],[29,50,29,56],[30,13,30,37],[30,38,30,45],[30,46,30,49],[30,50,30,56],[31,13,31,37],[31,38,31,45],[31,46,31,49],[31,50,31,56],[32,1,35,2],[32,3,35,8],[32,9,32,37],[32,38,32,45],[32,46,32,49],[32,50,32,56],[33,9,33,37],[33,38,33,45],[33,46,33,49],[33,50,33,56],[34,9,34,37],[34,38,34,45],[34,46,34,49],[34,50,34,56],[35,9,35,37],[35,38,35,45],[35,46,35,49],[35,50,35,56],[36,1,36,56],[37,1,37,2],[37,3,37,56],[38,3,38,56],[39,1,39,2],[39,3,39,56],[40,1,40,56],[41,1,41,56],[42,1,42,56],[43,1,43,56],[44,1,44,56],[45,1,45,56],[46,1,46,56],[47,1,47,56],[48,1,48,56],[49,1,49,56],[50,1,50,56],[51,1,51,56],[52,1,52,56],[53,1,53,56],[54,1,54,56]]}
[{"$nulls":59},"シートの保護を解除すると編集が可能になります（パスワードなし）"]
[]
[null,"工事監理の状況　C5表（プレキャスト鉄筋コンクリート造）"]
[]
[]
[]
[null,"監　理　項　目",{"$nulls":36},"監　理　記　録"]
[]
[{"$nulls":38},"A",null,"：","目視検査",{"$nulls":4},"結果",{"$nulls":3},"備考"]
[{"$nulls":38},"B",null,"：","実測検査"]
[{"$nulls":38},"C",null,"：","施工者報告"]
[null,1,null,"全体形状及び\n部材の配置",{"$nulls":5},"①建築物の平面形状"]
[{"$nulls":9},"②プレキャスト部材の配置"]
["○",2,null,"プレキャスト\n部材",{"$nulls":5},"①部材の形状、寸法"]
[{"$nulls":9},"②製作材料の品質"]
[{"$nulls":9},"③鉄筋、型枠の加工・組立"]
[{"$nulls":9},"④コンクリート打設状況"]
[{"$nulls":9},"⑤養生、脱型及びひび割れ防止対策等"]
[{"$nulls":9},"⑥コンクリートの所要強度"]
[{"$nulls":9},"⑦プレキャストの導入"]
[{"$nulls":9},"⑧製品出荷時の品質確認検査"]
["○",3,null,"組立・建方",{"$nulls":5},"①組立・建方の精度"]
[{"$nulls":9},"②接合部の仕様、接合状況"]
[{"$nulls":9},"③継手部分の検査"]
[{"$nulls":9},"④ひび割れ、破損の有無"]
["○",4,null,"現場施工部分",{"$nulls":5},"鉄筋",{"$nulls":3},"①部材の形状、寸法"]
["○",{"$nulls":12},"②鉄筋の径、配置等"]
["○",{"$nulls":12},"③継手位置、定着長さ、フック等"]
["○",{"$nulls":12},"④かぶり厚さ"]
["○",{"$nulls":8},"型枠",{"$nulls":3},"①各部の寸法"]
[{"$nulls":13},"②せき板、支保工等の設置状況"]
[{"$nulls":13},"③型枠内の清掃、異物の除去"]
[null,5,null,"その他",{"$nulls":5},"①"]
[{"$nulls":9},"②"]
[{"$nulls":9},"③"]
[{"$nulls":9},"④"]
[]
[null,"※",null,"工事監理者は、監理記録欄に監理状況の結果を記入し、中間検査申請書と同時に提出してください。"]
[{"$nulls":3},"なお、否となった事項についてはそれに対する措置等を下記に記入してください。"]
[null,"※",null,"該当する項目のみ記入してください。"]
{"$rows_empty":18}
[{"$nulls":3},"A ・ B ・ C",{"$nulls":5},"A ・ B ・ C",{"$nulls":6},"適 ・否"]
[]
[{"$nulls":3},"Ⓐ",{"$nulls":5},"Ⓐ ・ Ⓑ",{"$nulls":6},"適"]
[{"$nulls":3},"Ⓐ ・ Ⓑ",{"$nulls":5},"Ⓐ ・ Ⓑ ・ Ⓒ",{"$nulls":6},"否"]
[{"$nulls":3},"Ⓐ ・ Ⓒ",{"$nulls":5},"Ⓑ",{"$nulls":6},"該当なし"]
[{"$nulls":3},"Ⓐ ・ Ⓑ ・ Ⓒ",{"$nulls":5},"Ⓑ ・ Ⓒ",{"$nulls":6},"-"]
[{"$nulls":3},"Ⓑ",{"$nulls":5},"-"]
[{"$nulls":3},"Ⓑ ・ Ⓒ"]
[{"$nulls":3},"Ⓒ"]
[{"$nulls":3},"-"]

{"sheet":"C6表【組積造】","index":36,"n_rows":68,"n_cols":60,"rows_kept":68,"merged":[[1,1,1,56],[2,1,3,37],[2,38,3,56],[4,1,4,56],[5,1,5,56],[6,1,10,8],[6,9,10,37],[6,38,7,56],[8,38,8,39],[8,41,8,45],[8,46,10,49],[8,50,10,56],[9,38,9,39],[9,41,9,45],[10,38,10,39],[10,41,10,45],[11,1,12,2],[11,3,12,8],[11,9,11,37],[11,38,11,45],[11,46,11,49],[11,50,11,56],[12,9,12,37],[12,38,12,45],[12,46,12,49],[12,50,12,56],[13,1,15,2],[13,3,15,8],[13,9,13,37],[13,38,13,45],[13,46,13,49],[13,50,13,56],[14,9,14,37],[14,38,14,45],[14,46,14,49],[14,50,14,56],[15,9,15,37],[15,38,15,45],[15,46,15,49],[15,50,15,56],[16,1,18,2],[16,3,18,8],[16,9,16,37],[16,38,16,45],[16,46,16,49],[16,50,16,56],[17,9,17,37],[17,38,17,45],[17,46,17,49],[17,50,17,56],[18,9,18,37],[18,38,18,45],[18,46,18,49],[18,50,18,56],[19,1,22,2],[19,3,22,8],[19,9,19,37],[19,38,19,45],[19,46,19,49],[19,50,19,56],[20,9,20,37],[20,38,20,45],[20,46,20,49],[20,50,20,56],[21,9,21,37],[21,38,21,45],[21,46,21,49],[21,50,21,56],[22,9,22,37],[22,38,22,45],[22,46,22,49],[22,50,22,56],[23,1,27,2],[23,3,27,8],[23,9,23,37],[23,38,23,45],[23,46,23,49],[23,50,23,56],[24,9,24,37],[24,38,24,45],[24,46,24,49],[24,50,24,56],[25,9,25,37],[25,38,25,45],[25,46,25,49],[25,50,25,56],[26,9,26,37],[26,38,26,45],[26,46,26,49],[26,50,26,56],[27,9,27,37],[27,38,27,45],[27,46,27,49],[27,50,27,56],[28,1,31,2],[28,3,31,8],[28,9,28,37],[28,38,28,45],[28,46,28,49],[28,50,28,56],[29,9,29,37],[29,38,29,45],[29,46,29,49],[29,50,29,56],[30,9,30,37],[30,38,30,45],[30,46,30,49],[30,50,30,56],[31,9,31,37],[31,38,31,45],[31,46,31,49],[31,50,31,56],[32,1,35,2],[32,3,35,8],[32,9,32,37],[32,38,32,45],[32,46,32,49],[32,50,32,56],[33,9,33,37],[33,38,33,45],[33,46,33,49],[33,50,33,56],[34,9,34,37],[34,38,34,45],[34,46,34,49],[34,50,34,56],[35,9,35,37],[35,38,35,45],[35,46,35,49],[35,50,35,56],[36,1,36,56],[37,1,37,2],[37,3,37,56],[38,3,38,56],[39,1,39,2],[39,3,39,56],[40,1,40,56],[41,1,41,56],[42,1,42,56],[43,1,43,56],[44,1,44,56],[45,1,45,56],[46,1,46,56],[47,1,47,56],[48,1,48,56],[49,1,49,56],[50,1,50,56],[51,1,51,56],[52,1,52,56],[53,1,53,56],[54,1,54,56]]}
[{"$nulls":59},"シートの保護を解除すると編集が可能になります（パスワードなし）"]
[]
[null,"工事監理の状況　C6表（組積造）"]
[]
[]
[]
[null,"監　理　項　目",{"$nulls":36},"監　理　記　録"]
[]
[{"$nulls":38},"A",null,"：","目視検査",{"$nulls":4},"結果",{"$nulls":3},"備考"]
[{"$nulls":38},"B",null,"：","実測検査"]
[{"$nulls":38},"C",null,"：","施工者報告"]
[null,1,null,"全体形状及び\n部材の配置",{"$nulls":5},"①建築物の平面形状"]
[{"$nulls":9},"②壁の配置"]
[null,2,null,"施工一般",{"$nulls":5},"①使用材料の水洗い"]
[{"$nulls":9},"②モルタルの配合"]
[{"$nulls":9},"③目地の形状（芋目地としない）"]
["○",3,null,"壁",{"$nulls":5},"①壁の長さ"]
["○",{"$nulls":8},"②外壁の厚さ"]
["○",{"$nulls":8},"③間仕切壁の厚さ"]
["○",4,null,"臥梁・床版",{"$nulls":5},"①臥梁の形状、寸法"]
["○",{"$nulls":8},"②鉄筋の径、本数、配置等"]
["○",{"$nulls":8},"③鉄筋の継手位置、定着長さ"]
["○",{"$nulls":8},"④鉄筋のかぶり厚さ"]
[null,5,null,"開口部",{"$nulls":5},"①開口部幅の総和"]
[{"$nulls":9},"②各階の開口部幅の総和"]
["○",{"$nulls":8},"③上下開口部間の垂直距離"]
[{"$nulls":9},"④開口部相互間又は開口部と対隣壁の垂直距離"]
[{"$nulls":9},"⑤まぐさの位置"]
["○",6,null,"補強等",{"$nulls":5},"①壁に設けるみぞの深さ、長さ"]
[{"$nulls":9},"②鉄骨軸組との緊結"]
[{"$nulls":9},"③手すり壁頂部の臥梁の設置"]
[{"$nulls":9},"④H12建告第1354号による補強"]
[null,7,null,"その他",{"$nulls":5},"①型枠内の清掃状況"]
[{"$nulls":9},"②"]
[{"$nulls":9},"③"]
[{"$nulls":9},"④"]
[]
[null,"※",null,"工事監理者は、監理記録欄に監理状況の結果を記入し、中間検査申請書と同時に提出してください。"]
[{"$nulls":3},"なお、否となった事項についてはそれに対する措置等を下記に記入してください。"]
[null,"※",null,"該当する項目のみ記入してください。"]
{"$rows_empty":18}
[{"$nulls":3},"A ・ B ・ C",{"$nulls":5},"A ・ B ・ C",{"$nulls":6},"適 ・否"]
[]
[{"$nulls":3},"Ⓐ",{"$nulls":5},"Ⓐ ・ Ⓑ",{"$nulls":6},"適"]
[{"$nulls":3},"Ⓐ ・ Ⓑ",{"$nulls":5},"Ⓐ ・ Ⓑ ・ Ⓒ",{"$nulls":6},"否"]
[{"$nulls":3},"Ⓐ ・ Ⓒ",{"$nulls":5},"Ⓑ",{"$nulls":6},"該当なし"]
[{"$nulls":3},"Ⓐ ・ Ⓑ ・ Ⓒ",{"$nulls":5},"Ⓑ ・ Ⓒ",{"$nulls":6},"-"]
[{"$nulls":3},"Ⓑ",{"$nulls":5},"-"]
[{"$nulls":3},"Ⓑ ・ Ⓒ"]
[{"$nulls":3},"Ⓒ"]
[{"$nulls":3},"-"]

{"sheet":"C7表【補強CB造】","index":37,"n_rows":69,"n_cols":60,"rows_kept":69,"merged":[[1,1,1,56],[2,1,3,37],[2,38,3,56],[4,1,4,56],[5,1,5,56],[6,1,10,8],[6,9,10,37],[6,38,7,56],[8,38,8,39],[8,41,8,45],[8,46,10,49],[8,50,10,56],[9,38,9,39],[9,41,9,45],[10,38,10,39],[10,41,10,45],[11,1,12,2],[11,3,12,8],[11,9,11,37],[11,38,11,45],[11,46,11,49],[11,50,11,56],[12,9,12,37],[12,38,12,45],[12,46,12,49],[12,50,12,56],[13,1,13,2],[13,3,13,8],[13,9,13,37],[13,38,13,45],[13,46,13,49],[13,50,13,56],[14,1,18,2],[14,3,18,8],[14,9,14,37],[14,38,14,45],[14,46,14,49],[14,50,14,56],[15,9,15,37],[15,38,15,45],[15,46,15,49],[15,50,15,56],[16,9,16,37],[16,38,16,45],[16,46,16,49],[16,50,16,56],[17,9,17,37],[17,38,17,45],[17,46,17,49],[17,50,17,56],[18,9,18,37],[18,38,18,45],[18,46,18,49],[18,50,18,56],[19,1,22,2],[19,3,22,8],[19,9,19,37],[19,38,19,45],[19,46,19,49],[19,50,19,56],[20,9,20,37],[20,38,20,45],[20,46,20,49],[20,50,20,56],[21,9,21,37],[21,38,21,45],[21,46,21,49],[21,50,21,56],[22,9,22,37],[22,38,22,45],[22,46,22,49],[22,50,22,56],[23,1,24,2],[23,3,24,8],[23,9,23,37],[23,38,23,45],[23,46,23,49],[23,50,23,56],[24,9,24,37],[24,38,24,45],[24,46,24,49],[24,50,24,56],[25,1,29,2],[25,3,29,8],[25,9,25,37],[25,38,25,45],[25,46,25,49],[25,50,25,56],[26,9,26,37],[26,38,26,45],[26,46,26,49],[26,50,26,56],[27,9,27,37],[27,38,27,45],[27,46,27,49],[27,50,27,56],[28,9,28,37],[28,38,28,45],[28,46,28,49],[28,50,28,56],[29,9,29,37],[29,38,29,45],[29,46,29,49],[29,50,29,56],[30,1,30,56],[31,1,31,2],[31,3,31,56],[32,3,32,56],[33,1,33,2],[33,3,33,56],[34,1,34,56],[35,1,35,56],[36,1,36,56],[37,1,37,56],[38,1,38,56],[39,1,39,56],[40,1,40,56],[41,1,41,56],[42,1,42,56],[43,1,43,56],[44,1,44,56],[45,1,45,56],[46,1,46,56],[47,1,47,56],[48,1,48,56],[49,1,49,56],[50,1,50,56],[51,1,51,56],[52,1,52,56],[53,1,53,56],[54,1,54,56],[55,1,55,56]]}
[{"$nulls":59},"シートの保護を解除すると編集が可能になります（パスワードなし）"]
[]
[null,"工事監理の状況　C7表（補強コンクリートブロック造）"]
[]
[]
[]
[null,"監　理　項　目",{"$nulls":36},"監　理　記　録"]
[]
[{"$nulls":38},"A",null,"：","目視検査",{"$nulls":4},"結果",{"$nulls":3},"備考"]
[{"$nulls":38},"B",null,"：","実測検査"]
[{"$nulls":38},"C",null,"：","施工者報告"]
[null,1,null,"全体形状及び\n部材の配置",{"$nulls":5},"①建築物の平面形状"]
[{"$nulls":9},"②耐力壁の配置"]
[null,2,null,"使用材料",{"$nulls":5},"①ブロックの種別、仕様"]
["○",3,null,"耐力壁",{"$nulls":5},"①耐力壁の長さ"]
["○",{"$nulls":8},"②耐力壁の厚さ"]
["○",{"$nulls":8},"③補強鉄筋の径、本数、配置"]
["○",{"$nulls":8},"④補強鉄筋の継手位置、定着長さ、フック"]
["○",{"$nulls":8},"⑤補強鉄筋の基礎及び臥梁等への定着"]
["○",4,null,"臥梁・床版",{"$nulls":5},"①臥梁の形状、寸法"]
["○",{"$nulls":8},"②鉄筋の径、本数、配置等"]
["○",{"$nulls":8},"③鉄筋の継手位置、定着長さ"]
["○",{"$nulls":8},"④鉄筋のかぶり厚さ"]
[null,5,null,"目地・空洞部",{"$nulls":5},"①目地モルタルの状況"]
[{"$nulls":9},"②空洞部の充填"]
[null,6,null,"その他",{"$nulls":5},"①型枠内の清掃状況"]
[{"$nulls":9},"②"]
[{"$nulls":9},"③"]
[{"$nulls":9},"④"]
[{"$nulls":9},"⑤"]
[]
[null,"※",null,"工事監理者は、監理記録欄に監理状況の結果を記入し、中間検査申請書と同時に提出してください。"]
[{"$nulls":3},"なお、否となった事項についてはそれに対する措置等を下記に記入してください。"]
[null,"※",null,"該当する項目のみ記入してください。"]
{"$rows_empty":25}
[{"$nulls":3},"A ・ B ・ C",{"$nulls":5},"A ・ B ・ C",{"$nulls":6},"適 ・否"]
[]
[{"$nulls":3},"Ⓐ",{"$nulls":5},"Ⓐ ・ Ⓑ",{"$nulls":6},"適"]
[{"$nulls":3},"Ⓐ ・ Ⓑ",{"$nulls":5},"Ⓐ ・ Ⓑ ・ Ⓒ",{"$nulls":6},"否"]
[{"$nulls":3},"Ⓐ ・ Ⓒ",{"$nulls":5},"Ⓑ",{"$nulls":6},"該当なし"]
[{"$nulls":3},"Ⓐ ・ Ⓑ ・ Ⓒ",{"$nulls":5},"Ⓑ ・ Ⓒ",{"$nulls":6},"-"]
[{"$nulls":3},"Ⓑ",{"$nulls":5},"-"]
[{"$nulls":3},"Ⓑ ・ Ⓒ"]
[{"$nulls":3},"Ⓒ"]
[{"$nulls":3},"-"]

{"sheet":"C8表【丸太組】","index":38,"n_rows":67,"n_cols":60,"rows_kept":67,"merged":[[1,1,1,56],[2,1,3,36],[2,37,3,56],[4,1,4,56],[5,1,5,56],[6,1,10,8],[6,9,10,37],[6,38,7,56],[8,38,8,39],[8,41,8,45],[8,46,10,49],[8,50,10,56],[9,38,9,39],[9,41,9,45],[10,38,10,39],[10,41,10,45],[11,1,14,2],[11,3,14,8],[11,9,11,37],[11,38,11,45],[11,46,11,49],[11,50,11,56],[12,9,12,37],[12,38,12,45],[12,46,12,49],[12,50,12,56],[13,9,13,37],[13,38,13,45],[13,46,13,49],[13,50,13,56],[14,9,14,37],[14,38,14,45],[14,46,14,49],[14,50,14,56],[15,1,16,2],[15,3,16,8],[15,9,15,37],[15,38,15,45],[15,46,15,49],[15,50,15,56],[16,9,16,37],[16,38,16,45],[16,46,16,49],[16,50,16,56],[17,1,18,2],[17,3,18,8],[17,9,17,37],[17,38,17,45],[17,46,17,49],[17,50,17,56],[18,9,18,37],[18,38,18,45],[18,46,18,49],[18,50,18,56],[19,1,26,2],[19,3,26,8],[19,9,19,37],[19,38,19,45],[19,46,19,49],[19,50,19,56],[20,9,20,37],[20,38,20,45],[20,46,20,49],[20,50,20,56],[21,9,21,37],[21,38,21,45],[21,46,21,49],[21,50,21,56],[22,9,22,37],[22,38,22,45],[22,46,22,49],[22,50,22,56],[23,9,23,37],[23,38,23,45],[23,46,23,49],[23,50,23,56],[24,9,24,37],[24,38,24,45],[24,46,24,49],[24,50,24,56],[25,9,25,37],[25,38,25,45],[25,46,25,49],[25,50,25,56],[26,9,26,37],[26,38,26,45],[26,46,26,49],[26,50,26,56],[27,1,28,2],[27,3,28,8],[27,9,27,37],[27,38,27,45],[27,46,27,49],[27,50,27,56],[28,9,28,37],[28,38,28,45],[28,46,28,49],[28,50,28,56],[29,1,30,2],[29,3,30,8],[29,9,29,37],[29,38,29,45],[29,46,29,49],[29,50,29,56],[30,9,30,37],[30,38,30,45],[30,46,30,49],[30,50,30,56],[31,1,31,2],[31,3,31,8],[31,9,31,37],[31,38,31,45],[31,46,31,49],[31,50,31,56],[32,1,35,2],[32,3,35,8],[32,9,32,37],[32,38,32,45],[32,46,32,49],[32,50,32,56],[33,9,33,37],[33,38,33,45],[33,46,33,49],[33,50,33,56],[34,9,34,37],[34,38,34,45],[34,46,34,49],[34,50,34,56],[35,9,35,37],[35,38,35,45],[35,46,35,49],[35,50,35,56],[36,1,36,56],[37,1,37,2],[37,3,37,56],[38,3,38,56],[39,1,39,2],[39,3,39,56],[40,1,40,56],[41,1,41,56],[42,1,42,56],[43,1,43,56],[44,1,44,56],[45,1,45,56],[46,1,46,56],[47,1,47,56],[48,1,48,56],[49,1,49,56],[50,1,50,56],[51,1,51,56],[52,1,52,56],[53,1,53,56]]}
[{"$nulls":59},"シートの保護を解除すると編集が可能になります（パスワードなし）"]
[]
[null,"工事監理の状況　C8表（丸太組構法）"]
[]
[]
[]
[null,"監　理　項　目",{"$nulls":36},"監　理　記　録"]
[]
[{"$nulls":38},"A",null,"：","目視検査",{"$nulls":4},"結果",{"$nulls":3},"備考"]
[{"$nulls":38},"B",null,"：","実測検査"]
[{"$nulls":38},"C",null,"：","施工者報告"]
[null,1,null,"全体形状及び\n部材の配置",{"$nulls":5},"①建築物の形状"]
[{"$nulls":9},"②間取り（壁、床の位置）"]
[{"$nulls":9},"③耐力壁の配置"]
[{"$nulls":9},"④小屋組の形状"]
[null,2,null,"基礎",{"$nulls":5},"①床下換気口等の設置"]
[{"$nulls":9},"②構造体のひび割れの有無"]
["○",3,null,"土台",{"$nulls":5},"①部材の形状、寸法、品質等"]
[{"$nulls":9},"②アンカーボルトの据付及び緊結状況"]
[null,4,null,"耐力壁",{"$nulls":5},"①丸太材の断面積、相互の上下に接する部分の幅"]
["○",{"$nulls":8},"②耐力壁の高さ、幅"]
[{"$nulls":9},"③耐力壁線相互における交差部の突出"]
[{"$nulls":9},"④外壁の耐力璧線相互における交差部の緊結"]
[{"$nulls":9},"⑤開口部上部の壁補強"]
[{"$nulls":9},"⑥開口部周囲の補強"]
[{"$nulls":9},"⑦丸太材等の継手の禁止"]
["○",{"$nulls":8},"⑧だぼの材料、長さ、位置、本数"]
["○",5,null,"根太などの\n横架材",{"$nulls":5},"①部材の形状、寸法、品質等"]
[{"$nulls":9},"②部材下部中央の欠き込み禁止"]
["○",6,null,"床版",{"$nulls":5},"①床材の形状、寸法、品質等"]
[{"$nulls":9},"②床版の各部材相互との緊結"]
[null,7,null,"小屋組",{"$nulls":5},"①構造上主要な部分との緊結"]
["○",8,null,"その他",{"$nulls":5},"①地盤面からの床高さ"]
[{"$nulls":9},"②防腐・防蟻措置"]
[{"$nulls":9},"③腐食のおそれのある緊結金物の防錆措置"]
[{"$nulls":9},"④"]
[]
[null,"※",null,"工事監理者は、監理記録欄に監理状況の結果を記入し、中間検査申請書と同時に提出してください。"]
[{"$nulls":3},"なお、否となった事項についてはそれに対する措置等を下記に記入してください。"]
[null,"※",null,"該当する項目のみ記入してください。"]
{"$rows_empty":17}
[{"$nulls":4},"A ・ B ・ C",{"$nulls":5},"A ・ B ・ C",{"$nulls":6},"適 ・否"]
[]
[{"$nulls":4},"Ⓐ",{"$nulls":5},"Ⓐ ・ Ⓑ",{"$nulls":6},"適"]
[{"$nulls":4},"Ⓐ ・ Ⓑ",{"$nulls":5},"Ⓐ ・ Ⓑ ・ Ⓒ",{"$nulls":6},"否"]
[{"$nulls":4},"Ⓐ ・ Ⓒ",{"$nulls":5},"Ⓑ",{"$nulls":6},"該当なし"]
[{"$nulls":4},"Ⓐ ・ Ⓑ ・ Ⓒ",{"$nulls":5},"Ⓑ ・ Ⓒ",{"$nulls":6},"-"]
[{"$nulls":4},"Ⓑ",{"$nulls":5},"-"]
[{"$nulls":4},"Ⓑ ・ Ⓒ"]
[{"$nulls":4},"Ⓒ"]
[{"$nulls":4},"-"]

{"sheet":"完了一面","index":39,"n_rows":56,"n_cols":34,"rows_kept":56,"merged":[[2,0,2,2],[15,23,15,24],[15,25,15,26],[17,19,17,30],[18,19,18,28],[23,19,23,28],[41,0,41,2],[41,24,41,26]]}
["第十九号様式（第四条、第四条の四の二関係）（Ａ4）"]
[{"$nulls":33},"シートの保護を解除すると編集が可能になります（パスワードなし）"]
[]
["完了検査申請書"]
[]
["（第一面）"]
[]
[]
["　工事を完了しましたので、建築基準法第７条第１項又は第７条の２第１項（これらの規定を同法"]
["第８７条の２又は第８８条第１項若しくは第２項において準用する場合を含む。）の規定により、"]
["検査を申請します。この申請書及び添付図書に記載の事項は、事実に相違ありません。"]
[]
[]
["指定確認検査機関"]
["株式会社　確認検査機構アネックス  　様"]
[{"$nulls":23},"令和",{"$nulls":3},"年",null,"月",null,"日",null,"建築主等変更届の提出がないか確認してください"]
[]
[]
[{"$nulls":14},"申請者氏名",{"$nulls":15},"印"]
[]
[]
["第四面に記載の事項は、事実に相違ありません。"]
[]
[{"$nulls":14},"工事監理者氏名",{"$nulls":15},"印"]
[]
[]
[null,null,"【検査を申請する建築物等】"]
[null,null,"■","建築物",{"$nulls":7},"□","建築設備（昇降機）",{"$nulls":9},"□","建築設備（昇降機以外）"]
[null,null,"□","工作物（昇降機）",{"$nulls":7},"□","工作物（法第８８条第１項）"]
[]
[]
["※","手数料欄"]
[]
[]
[]
[]
["※受付欄　　　　",{"$nulls":7},"※検査の特例欄",{"$nulls":4},"※検査欄",{"$nulls":5},"※決裁欄",{"$nulls":4},"※検査済証欄"]
[]
[]
[{"$f":"IF(X16=\"\",\"\",X16)","v":"令和"},null,null,"年",null,"月",null,"日",{"$nulls":16},{"$f":"IF(X16=\"\",\"\",X16)","v":"令和"},null,null,"年",null,"月",null,"日"]
["第",{"$nulls":5},"完了建機構ア",{"$f":"IF(受付用!B13=\"\",\"\",受付用!B13)","v":""},{"$nulls":16},"第",{"$nulls":5},"完了建機構ア",{"$f":"IF(受付用!B13=\"\",\"\",受付用!B13)","v":""}]
[{"$f":"IF(受付用!C13=\"\",\"\",受付用!C13)","v":""},{"$nulls":6},"号","有　・　無",{"$nulls":15},{"$f":"IF(受付用!C13=\"\",\"\",受付用!C13)","v":""},{"$nulls":6},"号"]
["係員印",{"$nulls":23},"係員印"]
[]
[]
[]
[]
[]
[]
[null,"（注意）第一面"]
[null,null,"数字は算用数字を、単位はメートル法を用いてください。"]
[null,"①","申請者又は工事監理者の氏名の記載を自署で行う場合においては、押印を省略することができます。"]
[null,"②","「検査を申請する建築物等」の欄は、該当するチェックボックスに「レ」マークを入れてください。"]
[null,null,"建築基準法第88条第１項に規定する工作物のうち同法施行令第138条第２項第１号に掲げるものにあつ"]
[null,null,"ては、「工作物（昇降機）」のチェックボックスに「レ」マークを入れてください。"]
[null,"③","※印のある欄は記入しないでください。"]

{"sheet":"完了二面","index":40,"n_rows":175,"n_cols":35,"rows_kept":175,"merged":[[5,9,5,31],[6,9,6,31],[7,10,7,15],[8,9,8,31],[9,9,9,15],[13,10,13,11],[13,19,13,22],[13,27,13,30],[14,9,14,31],[15,10,15,11],[15,19,15,21],[15,27,15,30],[16,9,16,31],[17,10,17,15],[18,9,18,31],[19,9,19,15],[24,10,24,11],[24,19,24,22],[24,27,24,30],[25,9,25,31],[26,10,26,11],[26,19,26,21],[26,27,26,30],[27,9,27,31],[28,10,28,15],[29,9,29,31],[30,9,30,15],[31,9,31,31],[34,10,34,11],[34,19,34,22],[34,27,34,30],[35,9,35,31],[36,10,36,11],[36,19,36,21],[36,27,36,30],[37,9,37,31],[38,10,38,15],[39,9,39,31],[40,9,40,15],[41,9,41,31],[43,10,43,11],[43,19,43,22],[43,27,43,30],[44,9,44,31],[45,10,45,11],[45,19,45,21],[45,27,45,30],[46,9,46,31],[47,10,47,15],[48,9,48,31],[49,9,49,15],[50,9,50,31],[52,10,52,11],[52,19,52,22],[52,27,52,30],[53,9,53,31],[54,10,54,11],[54,19,54,21],[54,27,54,30],[55,9,55,31],[56,10,56,15],[57,9,57,31],[58,9,58,15],[59,9,59,31],[64,10,64,11],[64,19,64,22],[64,27,64,30],[65,9,65,31],[66,10,66,11],[66,19,66,21],[66,27,66,30],[67,9,67,31],[68,10,68,15],[69,9,69,31],[70,9,70,15],[71,11,71,31],[74,10,74,11],[74,19,74,22],[74,27,74,30],[75,9,75,31],[76,10,76,11],[76,19,76,21],[76,27,76,30],[77,9,77,31],[78,10,78,15],[79,9,79,31],[80,9,80,15],[81,11,81,31],[83,10,83,11],[83,19,83,22],[83,27,83,30],[84,9,84,31],[85,10,85,11],[85,19,85,21],[85,27,85,30],[86,9,86,31],[87,10,87,15],[88,9,88,31],[89,9,89,15],[90,11,90,31],[92,10,92,11],[92,19,92,22],[92,27,92,30],[93,9,93,31],[94,10,94,11],[94,19,94,21],[94,27,94,30],[95,9,95,31],[96,10,96,15],[97,9,97,31],[98,9,98,15],[99,11,99,31],[104,7,104,31],[105,7,105,31],[106,8,106,13],[107,7,107,31],[108,7,108,13],[109,7,109,13],[110,11,110,31],[113,7,113,31],[114,7,114,31],[115,8,115,13],[116,7,116,31],[117,7,117,13],[118,7,118,13],[119,11,119,31],[121,7,121,31],[122,7,122,31],[123,8,123,13],[124,7,124,31],[125,7,125,13],[126,7,126,13],[127,11,127,31],[129,7,129,31],[130,7,130,31],[131,8,131,13],[132,7,132,31],[133,7,133,13],[134,7,134,13],[135,11,135,31],[139,7,139,31],[140,13,140,16],[140,19,140,25],[141,7,141,31],[142,8,142,13],[143,7,143,31],[144,7,144,13],[147,4,147,31],[148,4,148,31],[149,4,149,31],[149,51,149,78],[150,4,150,31]]}
["建築主等変更届、選定届の提出により確認申請書から記載に変更がないか確認してください。"]
["（第二面）"]
[null,"建築主、設置者又は築造主等の概要",{"$nulls":31},"シートの保護を解除すると編集が可能になります（パスワードなし）"]
[]
["【1.建築主】"]
[null,"【イ.氏名のフリガナ】"]
[null,"【ロ.氏名】"]
[null,"【ハ.郵便番号】",{"$nulls":7},"〒"]
[null,"【ニ.住所】"]
[null,"【ホ.電話番号】"]
[]
[]
["【2.代理者】"]
[null,"【イ.資格】",{"$nulls":7},"（",null,null,"）","建築士",{"$nulls":4},"（",{"$nulls":4},"）","登録",null,"第",{"$nulls":4},"号"]
[null,"【ロ.氏名】"]
[null,"【ハ.建築士事務所名】",{"$nulls":7},"（",null,null,"）","建築士事務所",{"$nulls":4},"（",{"$nulls":3},"）","知事登録第",{"$nulls":7},"号"]
[]
[null,"【ニ.郵便番号】",{"$nulls":7},"〒"]
[null,"【ホ.所在地】"]
[null,"【へ.電話番号】"]
[]
[]
["【3.設計者】"]
[null,"(代表となる設計者)"]
[null,"【イ.資格】",{"$nulls":7},"（",null,null,"）","建築士",{"$nulls":4},"（",{"$nulls":4},"）","登録",null,"第",{"$nulls":4},"号"]
[null,"【ロ.氏名】"]
[null,"【ハ.建築士事務所名】",{"$nulls":7},"（",null,null,"）","建築士事務所",{"$nulls":4},"（",{"$nulls":3},"）","知事登録第",{"$nulls":7},"号"]
[]
[null,"【ニ.郵便番号】",{"$nulls":7},"〒"]
[null,"【ホ.所在地】"]
[null,"【へ.電話番号】"]
[null,"【ト.作成した設計図書】"]
[]
[null,"(その他の設計者)"]
[null,"【イ.資格】",{"$nulls":7},"（",null,null,"）","建築士",{"$nulls":4},"（",{"$nulls":4},"）","登録",null,"第",{"$nulls":4},"号"]
[null,"【ロ.氏名】"]
[null,"【ハ.建築士事務所名】",{"$nulls":7},"（",null,null,"）","建築士事務所",{"$nulls":4},"（",{"$nulls":3},"）","知事登録第",{"$nulls":7},"号"]
[]
[null,"【ニ.郵便番号】",{"$nulls":7},{"$f":"IF(K39=\"\",\"\",\"〒\")","v":""}]
[null,"【ホ.所在地】"]
[null,"【へ.電話番号】"]
[null,"【ト.作成した設計図書】"]
[]
[null,"【イ.資格】",{"$nulls":7},"（",null,null,"）","建築士",{"$nulls":4},"（",{"$nulls":4},"）","登録",null,"第",{"$nulls":4},"号"]
[null,"【ロ.氏名】"]
[null,"【ハ.建築士事務所名】",{"$nulls":7},"（",null,null,"）","建築士事務所",{"$nulls":4},"（",{"$nulls":3},"）","知事登録第",{"$nulls":7},"号"]
[]
[null,"【ニ.郵便番号】",{"$nulls":7},{"$f":"IF(K48=\"\",\"\",\"〒\")","v":""}]
[null,"【ホ.所在地】"]
[null,"【へ.電話番号】"]
[null,"【ト.作成した設計図書】"]
[]
[null,"【イ.資格】",{"$nulls":7},"（",null,null,"）","建築士",{"$nulls":4},"（",{"$nulls":4},"）","登録",null,"第",{"$nulls":4},"号"]
[null,"【ロ.氏名】"]
[null,"【ハ.建築士事務所名】",{"$nulls":7},"（",null,null,"）","建築士事務所",{"$nulls":4},"（",{"$nulls":3},"）","知事登録第",{"$nulls":7},"号"]
[]
[null,"【ニ.郵便番号】",{"$nulls":7},{"$f":"IF(K57=\"\",\"\",\"〒\")","v":""}]
[null,"【ホ.所在地】"]
[null,"【へ.電話番号】"]
[null,"【ト.作成した設計図書】"]
[]
[]
["【4.工事監理者】"]
[null,"(代表となる工事監理者)"]
[null,"【イ.資格】",{"$nulls":7},"（",null,null,"）","建築士",{"$nulls":4},"（",{"$nulls":4},"）","登録",null,"第",{"$nulls":4},"号"]
[null,"【ロ.氏名】"]
[null,"【ハ.建築士事務所名】",{"$nulls":7},"（",null,null,"）","建築士事務所",{"$nulls":4},"（",{"$nulls":3},"）","知事登録第",{"$nulls":7},"号"]
[]
[null,"【ニ.郵便番号】",{"$nulls":7},"〒"]
[null,"【ホ.所在地】"]
[null,"【へ.電話番号】"]
[null,"【ト.工事と照合した設計図書】"]
[]
[null,"(その他の工事監理者)"]
[null,"【イ.資格】",{"$nulls":7},"（",null,null,"）","建築士",{"$nulls":4},"（",{"$nulls":4},"）","登録",null,"第",{"$nulls":4},"号"]
[null,"【ロ.氏名】"]
[null,"【ハ.建築士事務所名】",{"$nulls":7},"（",null,null,"）","建築士事務所",{"$nulls":4},"（",{"$nulls":3},"）","知事登録第",{"$nulls":7},"号"]
[]
[null,"【ニ.郵便番号】",{"$nulls":7},{"$f":"IF(K79=\"\",\"\",\"〒\")","v":""}]
[null,"【ホ.所在地】"]
[null,"【へ.電話番号】"]
[null,"【ト.工事と照合した設計図書】"]
[]
[null,"【イ.資格】",{"$nulls":7},"（",null,null,"）","建築士",{"$nulls":4},"（",{"$nulls":4},"）","登録",null,"第",{"$nulls":4},"号"]
[null,"【ロ.氏名】"]
[null,"【ハ.建築士事務所名】",{"$nulls":7},"（",null,null,"）","建築士事務所",{"$nulls":4},"（",{"$nulls":3},"）","知事登録第",{"$nulls":7},"号"]
[]
[null,"【ニ.郵便番号】",{"$nulls":7},{"$f":"IF(K88=\"\",\"\",\"〒\")","v":""}]
[null,"【ホ.所在地】"]
[null,"【へ.電話番号】"]
[null,"【ト.工事と照合した設計図書】"]
[]
[null,"【イ.資格】",{"$nulls":7},"（",null,null,"）","建築士",{"$nulls":4},"（",{"$nulls":4},"）","登録",null,"第",{"$nulls":4},"号"]
[null,"【ロ.氏名】"]
[null,"【ハ.建築士事務所名】",{"$nulls":7},"（",null,null,"）","建築士事務所",{"$nulls":4},"（",{"$nulls":3},"）","知事登録第",{"$nulls":7},"号"]
[]
[null,"【ニ.郵便番号】",{"$nulls":7},{"$f":"IF(K97=\"\",\"\",\"〒\")","v":""}]
[null,"【ホ.所在地】"]
[null,"【へ.電話番号】"]
[null,"【ト.工事と照合した設計図書】"]
[]
[]
["【5.建築設備の設計に関し意見を聴いた者】"]
[null,"(代表となる建築設備の工事監理に関し意見を聴いた者)"]
[null,"【イ.氏名】"]
[null,"【ロ.勤務先】"]
[null,"【ハ.郵便番号】",{"$nulls":5},{"$f":"IF(I107=\"\",\"\",\"〒\")","v":""}]
[null,"【ニ.所在地】"]
[null,"【ホ.電話番号】"]
[null,"【ヘ.登録番号】"]
[null,"【ト.意見を聴いた設計図書】"]
[]
[null,"(その他の建築設備の工事監理に関し意見を聴いた者)"]
[null,"【イ.氏名】"]
[null,"【ロ.勤務先】"]
[null,"【ハ.郵便番号】",{"$nulls":5},{"$f":"IF(I116=\"\",\"\",\"〒\")","v":""}]
[null,"【ニ.所在地】"]
[null,"【ホ.電話番号】"]
[null,"【ヘ.登録番号】"]
[null,"【ト.意見を聴いた設計図書】"]
[]
[null,"【イ.氏名】"]
[null,"【ロ.勤務先】"]
[null,"【ハ.郵便番号】",{"$nulls":5},{"$f":"IF(I124=\"\",\"\",\"〒\")","v":""}]
[null,"【ニ.所在地】"]
[null,"【ホ.電話番号】"]
[null,"【ヘ.登録番号】"]
[null,"【ト.意見を聴いた設計図書】"]
[]
[null,"【イ.氏名】"]
[null,"【ロ.勤務先】"]
[null,"【ハ.郵便番号】",{"$nulls":5},{"$f":"IF(I132=\"\",\"\",\"〒\")","v":""}]
[null,"【ニ.所在地】"]
[null,"【ホ.電話番号】"]
[null,"【ヘ.登録番号】"]
[null,"【ト.意見を聴いた設計図書】"]
[]
[]
["【6.工事施工者】"]
[null,"【イ.氏名】"]
[null,"【ロ.営業所名】",{"$nulls":5},"建設業の許可",{"$nulls":4},"（",{"$nulls":4},"）","第",{"$nulls":7},"号"]
[]
[null,"【ハ.郵便番号】",{"$nulls":5},"〒"]
[null,"【ニ.所在地】"]
[null,"【ホ.電話番号】"]
[]
[]
["【7.備考】"]
[]
[{"$nulls":33},"←","建築物の名称又は工事名(フリガナ）"]
[{"$nulls":33},"←","建築物の名称又は工事名"]
[]
[]
[]
[]
[null,"（注意）第二面"]
[null,null,"数字は算用数字を、単位はメートル法を用いてください。"]
[null,"①","建築主、設置者又は築造主が２以上のときは、１欄は代表となる建築主、設置者又は築造主について"]
[null,null,"記入し、別紙に他の建築主、設置者又は築造主についてそれぞれ必要な事項を記入して添えてください。"]
[null,"②","建築主、設置者又は築造主からの委任を受けて申請を行う者がいる場合においては、２欄に記入して"]
[null,null,"ください。"]
[null,"③","２欄、３欄及び５欄は、代理者、設計者又は工事監理者が建築士事務所に属しているときは、その名"]
[null,null,"称を書き、建築士事務所に属していないときは、所在地はそれぞれ代理者、設計者又は工事監理者の住"]
[null,null,"所を書いてください。"]
[null,"④","３欄、４欄及び５欄は、それぞれ代表となる設計者、工事監理者及び建築設備の工事監理に関し意見"]
[null,null,"を聴いた者並びに申請に係る建築物に係る他のすべての設計者、工事監理者及び建築設備の工事監理に"]
[null,null,"関し意見を聴いた者について記入してください。記入欄が不足する場合には、別紙に必要な事項を記入"]
[null,null,"して添えてください。"]
[null,"⑤","５欄は、建築士法第20条第５項に規定する場合（工事監理に係る場合に限る。）に、同項に定める資"]
[null,null,"格を有する者について記入し、所在地は、その者が勤務しているときは勤務先の所在地を、勤務してい"]
[null,null,"ないときはその者の住所を登録番号は建築士法施行規則（昭和25年建設省令第38号）第17条の35第"]
[null,null,"１項の規定による登録を受けている場合の当該登録番号を書いてください。"]
[null,"⑥","６欄は、工事施工者が２以上のときは、代表となる工事施工者について記入し、別紙に他の工事施工者"]
[null,null,"について棟別にそれぞれ必要な事項を記入して添えてください。"]
[null,"⑦","建築物又は工作物の名称又は工事名が定まつているときは、７欄に記入してください。"]

{"sheet":"完了三面","index":41,"n_rows":64,"n_cols":66,"rows_kept":64,"merged":[[3,7,3,32],[4,7,4,32],[6,22,6,27],[9,22,9,31],[10,12,10,13],[10,14,10,17],[10,19,10,20],[10,21,10,23],[11,12,11,13],[11,14,11,15],[11,17,11,18],[11,20,11,21],[12,10,12,29],[13,12,13,13],[13,14,13,15],[13,17,13,18],[13,20,13,21],[14,12,14,13],[14,14,14,15],[14,17,14,18],[14,20,14,21],[15,12,15,21],[16,14,16,19],[16,24,16,29],[17,13,17,20],[17,23,17,30],[18,13,18,20],[18,23,18,30],[19,13,19,20],[19,23,19,30],[20,13,20,14],[20,23,20,24],[22,11,22,32],[23,6,23,32],[24,1,24,32],[25,1,25,32],[26,1,26,32],[27,1,27,32],[28,1,28,32],[29,1,29,32],[31,1,31,32],[32,1,32,32],[33,1,33,32],[34,1,34,32],[35,1,35,32],[36,1,36,32],[40,37,40,39],[41,37,41,39],[42,37,42,39],[43,37,43,39]]}
["（第三面）"]
[null,"申請する工事の概要",{"$nulls":33},"シートの保護を解除すると編集が可能になります（パスワードなし）",{"$nulls":29},"確認建機構ア"]
["【1.建築場所、設置場所又は築造場所】",{"$nulls":64},"変認建機構ア"]
[null,"【イ.地名地番】",{"$nulls":63},"㈱確認検査機構アネックス"]
[null,"【ロ.住居表示】",{"$nulls":63},"第○○中間建機構ア○○○"]
["【2.工事種別】",{"$nulls":64},1]
[null,"【イ.建築基準法施行令第１０条各号に掲げる建築物の区分】",{"$nulls":19},"第",{"$nulls":6},"号",{"$nulls":36},2]
[null,"【ロ.工事種別】",{"$nulls":5},"□","新築",{"$nulls":5},"□","増築",{"$nulls":5},"□","改築",{"$nulls":5},"□","移転",{"$nulls":35},3]
[{"$nulls":7},"□","大規模の修繕",{"$nulls":5},"□","大規模の模様替",{"$nulls":5},"□","建築設備の設置",{"$nulls":42},4]
[null,"【ハ.建築基準法第68条の20第2項の検査の特例に係る認証番号】"]
["【3.確認済証番号】",{"$nulls":10},"第",{"$nulls":6},{"$f":"IF(受付用!B13=\"\",\"\",受付用!B13)","v":""},{"$f":"IF(受付用!C13=\"\",\"\",受付用!C13)","v":""},{"$nulls":4},"号"]
["【4.確認済証交付年月日】",{"$nulls":11},"令和",{"$nulls":3},"年",null,null,"月",null,null,"日"]
["【5.確認済証交付者】",{"$nulls":9},"株式会社確認検査機構アネックス　代表取締役　稲垣　雄一"]
["【6.工事着手年月日】",{"$nulls":11},"令和",{"$nulls":3},"年",null,null,"月",null,null,"日",{"$nulls":14},"●滋賀県●"]
["【7.工事完了年月日】",{"$nulls":11},"令和",{"$nulls":3},"年",null,null,"月",null,null,"日",{"$nulls":14},"土台、柱、梁及び筋かいを金物により接合する工事の工程"]
["【8.検査対象床面積】",{"$nulls":21},"㎡",{"$nulls":14},"壁を設置する工事の工程"]
["【9.検査経過】",{"$nulls":11},"（第",{"$nulls":7},"回","）","（第",{"$nulls":7},"回","）",{"$nulls":5},"鉄骨の軸組を溶接し、又はボルト等により接合する工事(建て方)の工程"]
[null,"【イ.特定工程】",{"$nulls":10},"（",{"$nulls":8},"）","（",{"$nulls":8},"）",{"$nulls":5},"2階の床版の取付け又は床版の鉄筋を配置する工事の工程"]
[null,"【ロ.中間検査合格証交付者】 ",{"$nulls":10},"（",{"$nulls":8},"）","（",{"$nulls":8},"）",{"$nulls":5},"基礎及び地中梁に鉄筋を配置する工事の工程"]
[null,"【ハ.中間検査合格証番号】",{"$nulls":10},"（",{"$nulls":8},"）","（",{"$nulls":8},"）",{"$nulls":5},"2階の床及びこれを支持する梁に鉄筋を配置する工事の工程"]
[null,"【ニ.交付年月日】　",{"$nulls":10},"（","令和",null,null,"年",null,"月",null,"日","）","（","令和",null,null,"年",null,"月",null,"日","）",{"$nulls":5},"●京都市●"]
["【10.確認以降の軽微な変更の概要】",{"$nulls":36},"土台，柱，はり及び筋かいを金物等により接合する工事の工程"]
[null,"【イ.変更された設計図書の種類】",{"$nulls":35},"木材で組まれた枠組みを設置する工事の過程"]
[null,"【ロ.変更の概要】",{"$nulls":35},"基礎又は地中はりの配筋工事の工程"]
[{"$nulls":37},"最初の床版を取り付ける工事の工程"]
[{"$nulls":37},"2階の床及びこれを支持するはりに鉄筋を配置する工事の工程"]
[{"$nulls":37},"●宇治市●"]
[{"$nulls":37},"木造の軸組を金物等により接合する工事の工程"]
[{"$nulls":37},"木材で組まれた枠組を設置する工事の工程"]
[{"$nulls":37},"2階の床の配筋工事の工程"]
["【11.備考】",{"$nulls":36},"2階のはりおよび床版の取付け工事の工程"]
[{"$nulls":37},"屋根床版の配筋工事または建方工事の工程"]
[{"$nulls":37},"●京都府●"]
[{"$nulls":37},"木造の軸組を金物等により接合する工事の工程"]
[{"$nulls":37},"耐力壁の設置工事の工程"]
[{"$nulls":37},"２階の床及びこれを支持するはりの配筋工事の工程"]
[{"$nulls":37},"２階のはり及び床版の取付け工事の工程"]
[{"$nulls":37},"屋根床版の配筋工事又は建方工事の工程"]
[{"$nulls":37},"●大阪府・奈良県は直接入力してください●"]
[]
[null,"（注意）第一面",{"$nulls":35},"Ｈ28"]
[null,null,"数字は算用数字を、単位はメートル法を用いてください。",{"$nulls":34},2017]
[null,"①","住居表示が定まつているときは、１欄の「ロ」に記入してください。",{"$nulls":34},"2018"]
[null,"②","２欄の「イ」は、建築物が建築基準法施行令第10条各号に掲げる建築物に該当する場合に、当該各号",{"$nulls":34},"2019"]
[null,null,"の数字を記入してください。"]
[null,"③","２欄の「ロ」は、該当するチェックボックスに「レ」マークを入れてください。"]
[null,"④","２欄の「ハ」は、認証型式部材等製造者が製造をした当該認証に係る型式部材等を有する場合に、その"]
[null,null,"認証番号を記載してください。"]
[null,"⑤","３欄、４欄及び５欄は、計画変更の確認を受けている場合は直前の計画変更の確認について記載して"]
[null,null,"ください。"]
[null,"⑥","９欄は、記入欄が不足する場合には、別紙に必要な事項を記入して添えてください。"]
[null,"⑦","10欄は、軽微な設計変更が２以上あるときは、その一について記入し、別紙にその他の軽微な設計変"]
[null,null,"更について、必要な事項を記入して添えてください。"]
[null,"⑧","10欄の「ロ」は、変更の内容、変更の理由等の概要を記入してください。"]
[null,"⑨","10欄は、特定工程に係る建築物にあつては、この申請を直前の中間検査を申請した建築主事に対"]
[null,null,"して行う場合には、確認から直前の中間検査までに生じた軽微な設計変更の概要について記入する"]
[null,null,"必要はありません。また、それ以外の場合で、確認から直前の中間検査までに生じた軽微な設計変"]
[null,null,"更の概要についてこの欄に記載すべき事項を記載した書類を別に添付すれば、その部分について記"]
[null,null,"入する必要はありません。"]
[null,"⑩","10欄は、申請建築物について変更後も建築物の計画が建築基準関係規定に適合することが明らかなこ"]
[null,null,"とが確かめられた旨の図書を添えてください。"]
[null,"⑪","検査後も引き続き建築基準法第３条第２項（同法第86条の９第１項において準用する場合を含"]
[null,null,"む。）の規定の適用を受ける場合は、その根拠となる規定及び不適合の規定を11欄又は別紙に記載"]
[null,null,"して添えてください。"]

{"sheet":"完了四面","index":42,"n_rows":52,"n_cols":9,"rows_kept":52,"merged":[[3,0,4,0],[3,1,4,1],[3,2,4,2],[3,3,4,3],[3,4,4,4],[3,5,4,5],[3,7,4,7],[16,1,16,6]]}
["（第四面）"]
["工事監理の状況",{"$nulls":7},"シートの保護を解除すると編集が可能になります（パスワードなし）"]
[]
[null,"確認を行つた部位、材料の種類等","照合内容","照合を行つた設計図書","設計図書の内容について設計者に確認した事項","照合方法","照合結果"]
[{"$nulls":6},"（不適の場合には建築主に対して行った報告の内容）"]
["敷地の形状、高さ、衛生及び安全"]
["主要構造部及び主要構造部以外の構造耐力上主要な部分に用いる材料（接合材料を含む。）の種類、品質、形状及び寸法"]
["主要構造部及び主要構造部以外の構造耐力上主要な部分に用いる材料の接合状況、接合部分の形状等"]
["建築物の各部分の位置、形状及び大きさ"]
["構造耐力上主要な部分の防錆、防腐及び防蟻措置及び状況"]
["特定天井に用いる材料の種類並びに当該特定天井の構造及び施工状況"]
["居室の内装仕上げに用いる建築材料の種別及び当該材料を用いる部分の面積"]
["天井及び壁の室内に面する部分に係る仕上げの材料の種別及び厚さ"]
["開口部に設ける建具の種類及び大きさ"]
["建築設備に用いる材料の種類並びにその照合した内容、構造及び施工状況（区画貫通部の処理状況を含む。）"]
["備         考\n（住宅用防災機器について記載）"]
["備         考"]
[]
[]
["（注意）第一面"]
[null,"数字は算用数字を、単位はメートル法を用いてください。"]
["①","申請建築物（建築基準法第７条の５及び第68条の20第２項（建築物である認証型式部材等に係"]
[null,"る場合に限る。）の適用を受けず、かつ、建築士法第３条から第３条の３までの規定に含まれない"]
[null,"ものを除く。以下同じ。）に関する工事監理の状況について記載してください。ただし、特定工程"]
[null,"に係る建築物にあつては、この申請を直前の中間検査を申請した建築主事に対して行う場合には、"]
[null,"確認から直前の中間検査までの工事監理の状況について記入する必要はありません。また、それ以"]
[null,"外の場合で、確認から直前の中間検査までの工事監理の状況についてこの書類に記載すべき事項を"]
[null,"記載した書類を別に添付すれば、その部分について記入する必要はありません。"]
["②","申請建築物が複数の構造方法からなる場合には、それぞれの構造の部分ごとに記載してください。"]
["③","接合状況のうち、鋼材等の金属材料の溶接又は圧接部分に係る内部欠陥の検査、強度検査等の確"]
[null,"認については、当該部分に係る検査を行つた者の氏名及び資格並びに当該検査に係るサンプル数及"]
[null,"びその結果を記載してください。"]
["④","材料のうち、コンクリートについては、四週圧縮強度、塩化物量、アルカリ骨材反応等の試験又は検査"]
[null,"（以下「試験等」という。）を行つた者、試験等に係るサンプル数及び試験等の結果について記載してく"]
[null,"ださい。"]
["⑤","「特定天井に用いる材料の種類並びに当該特定天井の構造及び施工状況」は、建築基準法施行令第39"]
[null,"条第３項、第81条第１項第３号、第82条の５第７号又は第137条の２第１号イ(3)の規定の適用を受ける"]
[null,"部分について記載してください。"]
["⑥","「居室の内装の仕上げに用いる建築材料の種別及び当該建築材料を用いる部分の面積」は、建築基準法"]
[null,"施行令第20条の７第１項第１号に規定する内装の仕上げに用いる建築材料の種別並びに当該建築材料を"]
[null,"用いる内装の仕上げの部分及び当該部分の面積について記載してください。"]
["⑦","「天井及び壁の室内に面する部分に係る仕上げ」は、建築基準法第35条の２の規定の適用を受ける部"]
[null,"分について記載してください。"]
["⑧","「開口部」は、防火設備の設置が義務付けられている部分、建築基準法第28条第１項の規定の適用を"]
[null,"受ける部分及び同法第35条の適用を受ける部分について記載してください。"]
["⑨","「照合結果」は、「適」・「不適」のいずれかを記入し、工事施工者が注意に従わなかつた場合には「不"]
[null,"適」を記入してください。また、不適の場合には建築主に対して行つた報告の内容を記載してください。"]
["⑩","消防法（昭和23年法律第186号）第９条の２第１項に規定する住宅用防災機器の位置及び種類"]
[null,"その他ここに書き表せない事項で特に報告すべき事項は、備考欄又は別紙に記載して添えてくださ"]
[null,"い。"]
["⑪","この書類に記載すべき事項を含む報告書を別に添付すれば、この書類を別途提出する必要はありませ"]
[null,"ん。"]

{"sheet":"完了ﾁｪｯｸ（123号）","index":43,"n_rows":259,"n_cols":59,"rows_kept":259,"merged":[[11,1,11,56],[12,1,13,36],[12,37,13,56],[14,1,14,56],[15,1,15,2],[15,3,15,10],[15,11,15,12],[15,13,15,15],[15,16,15,21],[15,22,15,23],[15,24,15,26],[15,27,15,29],[15,30,15,31],[15,32,15,41],[15,42,15,44],[15,45,15,46],[15,47,15,48],[15,49,15,50],[15,51,15,52],[15,53,15,54],[15,55,15,56],[16,1,17,2],[16,3,16,10],[16,11,16,56],[17,3,17,10],[17,11,17,56],[18,1,19,2],[18,3,18,10],[18,11,18,14],[18,15,18,22],[18,23,18,30],[18,31,18,40],[18,41,18,44],[18,45,18,46],[18,47,18,54],[18,55,18,56],[19,3,19,10],[19,11,19,53],[19,54,19,56],[20,1,20,56],[22,1,26,8],[22,9,26,37],[22,38,23,56],[24,38,24,39],[24,41,24,45],[24,46,26,49],[24,50,26,56],[25,38,25,39],[25,41,25,45],[26,38,26,39],[26,41,26,45],[27,1,27,2],[27,3,27,8],[27,9,27,37],[27,38,27,45],[27,46,27,49],[27,50,27,56],[28,1,29,2],[28,3,29,8],[28,9,28,37],[28,38,28,45],[28,46,28,49],[28,50,28,56],[29,9,29,37],[29,38,29,45],[29,46,29,49],[29,50,29,56],[30,1,34,2],[30,3,34,8],[30,9,30,37],[30,38,30,45],[30,46,30,49],[30,50,30,56],[31,9,31,37],[31,38,31,45],[31,46,31,49],[31,50,31,56],[32,9,32,37],[32,38,32,45],[32,46,32,49],[32,50,32,56],[33,9,33,37],[33,38,33,45],[33,46,33,49],[33,50,33,56],[34,9,34,37],[34,38,34,45],[34,46,34,49],[34,50,34,56],[35,1,38,2],[35,3,38,8],[35,9,35,37],[35,38,35,45],[35,46,35,49],[35,50,35,56],[36,9,36,37],[36,38,36,45],[36,46,36,49],[36,50,36,56],[37,9,37,37],[37,38,37,45],[37,46,37,49],[37,50,37,56],[38,9,38,37],[38,38,38,45],[38,46,38,49],[38,50,38,56],[39,1,39,2],[39,3,39,8],[39,15,39,17],[39,18,39,37],[39,38,39,45],[39,46,39,49],[39,50,39,56],[40,1,42,2],[40,3,42,8],[40,9,40,37],[40,38,40,45],[40,46,40,49],[40,50,40,56],[41,9,41,37],[41,38,41,45],[41,46,41,49],[41,50,41,56],[42,9,42,37],[42,38,42,45],[42,46,42,49],[42,50,42,56],[43,1,45,2],[43,3,45,8],[43,9,43,37],[43,38,43,45],[43,46,43,49],[43,50,43,56],[44,9,44,37],[44,38,44,45],[44,46,44,49],[44,50,44,56],[45,9,45,37],[45,38,45,45],[45,46,45,49],[45,50,45,56],[46,1,46,56],[47,1,47,2],[47,3,47,56],[48,3,48,56],[49,1,49,2],[49,3,49,56],[50,1,50,56],[51,1,51,56],[52,1,52,56],[53,1,53,56],[54,1,54,56],[55,1,55,56],[56,1,56,56],[57,1,57,56],[58,1,58,56],[59,1,59,56],[61,1,65,8],[61,9,65,37],[61,38,62,56],[63,38,63,39],[63,41,63,45],[63,46,65,49],[63,50,65,56],[64,38,64,39],[64,41,64,45],[65,38,65,39],[65,41,65,45],[66,1,67,2],[66,3,67,8],[66,9,66,37],[66,38,66,45],[66,46,66,49],[66,50,66,56],[67,9,67,37],[67,38,67,45],[67,46,67,49],[67,50,67,56],[68,1,68,2],[68,3,68,8],[68,9,68,37],[68,38,68,45],[68,46,68,49],[68,50,68,56],[69,1,70,2],[69,3,70,8],[69,9,69,37],[69,38,69,45],[69,46,69,49],[69,50,69,56],[70,9,70,37],[70,38,70,45],[70,46,70,49],[70,50,70,56],[71,1,72,2],[71,3,72,8],[71,9,71,37],[71,38,71,45],[71,46,71,49],[71,50,71,56],[72,9,72,37],[72,38,72,45],[72,46,72,49],[72,50,72,56],[73,1,75,2],[73,3,75,8],[73,9,73,37],[73,38,73,45],[73,46,73,49],[73,50,73,56],[74,9,74,37],[74,38,74,45],[74,46,74,49],[74,50,74,56],[75,9,75,37],[75,38,75,45],[75,46,75,49],[75,50,75,56],[76,1,76,2],[76,3,76,8],[76,9,76,37],[76,38,76,45],[76,46,76,49],[76,50,76,56],[77,1,77,2],[77,3,77,8],[77,9,77,37],[77,38,77,45],[77,46,77,49],[77,50,77,56],[78,1,81,2],[78,3,81,8],[78,9,78,37],[78,38,78,45],[78,46,78,49],[78,50,78,56],[79,9,79,37],[79,38,79,45],[79,46,79,49],[79,50,79,56],[80,9,80,37],[80,38,80,45],[80,46,80,49],[80,50,80,56],[81,9,81,37],[81,38,81,45],[81,46,81,49],[81,50,81,56],[82,1,102,2],[82,3,82,56],[83,4,83,8],[83,9,83,37],[83,38,83,45],[83,46,83,49],[83,50,83,56],[84,5,85,8],[84,9,84,37],[84,38,84,45],[84,46,84,49],[84,50,84,56],[85,9,85,37],[85,38,85,45],[85,46,85,49],[85,50,85,56],[86,5,87,8],[86,9,86,37],[86,38,86,45],[86,46,86,49],[86,50,86,56],[87,9,87,37],[87,38,87,45],[87,46,87,49],[87,50,87,56],[88,5,89,8],[88,9,88,37],[88,38,88,45],[88,46,88,49],[88,50,88,56],[89,9,89,37],[89,38,89,45],[89,46,89,49],[89,50,89,56],[90,4,90,8],[90,9,90,37],[90,38,90,45],[90,46,90,49],[90,50,90,56],[91,5,92,8],[91,9,91,37],[91,38,91,45],[91,46,91,49],[91,50,91,56],[92,9,92,37],[92,38,92,45],[92,46,92,49],[92,50,92,56],[93,5,95,8],[93,9,93,37],[93,38,93,45],[93,46,93,49],[93,50,93,56],[94,9,94,37],[94,38,94,45],[94,46,94,49],[94,50,94,56],[95,9,95,37],[95,38,95,45],[95,46,95,49],[95,50,95,56],[96,5,98,8],[96,9,96,37],[96,38,96,45],[96,46,96,49],[96,50,96,56],[97,9,97,37],[97,38,97,45],[97,46,97,49],[97,50,97,56],[98,9,98,37],[98,38,98,45],[98,46,98,49],[98,50,98,56],[99,4,102,8],[99,9,99,37],[99,38,99,45],[99,46,99,49],[99,50,99,56],[100,9,100,37],[100,38,100,45],[100,46,100,49],[100,50,100,56],[101,9,101,37],[101,38,101,45],[101,46,101,49],[101,50,101,56],[102,9,102,37],[102,38,102,45],[102,46,102,49],[102,50,102,56],[103,1,103,56],[105,1,109,8],[105,9,109,37],[105,38,106,56],[107,38,107,39],[107,41,107,45],[107,46,109,49],[107,50,109,56],[108,38,108,39],[108,41,108,45],[109,38,109,39],[109,41,109,45],[110,1,117,2],[110,4,110,8],[110,9,110,37],[110,38,110,45],[110,46,110,49],[110,50,110,56],[111,5,112,8],[111,9,111,37],[111,38,111,45],[111,46,111,49],[111,50,111,56],[112,9,112,37],[112,38,112,45],[112,46,112,49],[112,50,112,56],[113,4,114,8],[113,9,113,37],[113,38,113,45],[113,46,113,49],[113,50,113,56],[114,9,114,37],[114,38,114,45],[114,46,114,49],[114,50,114,56],[115,4,117,8],[115,9,115,37],[115,38,115,45],[115,46,115,49],[115,50,115,56],[116,9,116,37],[116,38,116,45],[116,46,116,49],[116,50,116,56],[117,9,117,37],[117,38,117,45],[117,46,117,49],[117,50,117,56],[118,1,119,2],[118,3,119,8],[118,9,118,37],[118,38,118,45],[118,46,118,49],[118,50,118,56],[119,9,119,37],[119,38,119,45],[119,46,119,49],[119,50,119,56],[120,1,145,2],[120,3,120,56],[121,4,121,8],[121,9,121,37],[121,38,121,45],[121,46,121,49],[121,50,121,56],[122,4,123,8],[122,9,122,37],[122,38,122,45],[122,46,122,49],[122,50,122,56],[123,9,123,37],[123,38,123,45],[123,46,123,49],[123,50,123,56],[124,4,126,8],[124,9,124,16],[124,17,124,20],[124,21,124,37],[124,38,124,45],[124,46,124,49],[124,50,124,56],[125,9,125,37],[125,38,125,45],[125,46,125,49],[125,50,125,56],[126,9,126,37],[126,38,126,45],[126,46,126,49],[126,50,126,56],[127,4,127,8],[127,9,127,37],[127,38,127,56],[128,5,129,8],[128,9,128,37],[128,38,128,45],[128,46,128,49],[128,50,128,56],[129,9,129,37],[129,38,129,45],[129,46,129,49],[129,50,129,56],[130,5,131,8],[130,9,130,37],[130,38,130,45],[130,46,130,49],[130,50,130,56],[131,9,131,37],[131,38,131,45],[131,46,131,49],[131,50,131,56],[132,5,135,8],[132,9,132,37],[132,38,132,45],[132,46,132,49],[132,50,132,56],[133,9,133,37],[133,38,133,45],[133,46,133,49],[133,50,133,56],[134,9,134,37],[134,38,134,45],[134,46,134,49],[134,50,134,56],[135,9,135,37],[135,38,135,45],[135,46,135,49],[135,50,135,56],[136,5,136,8],[136,9,136,37],[136,38,136,45],[136,46,136,49],[136,50,136,56],[137,4,138,8],[137,9,137,37],[137,38,137,45],[137,46,137,49],[137,50,137,56],[138,9,138,37],[138,38,138,45],[138,46,138,49],[138,50,138,56],[139,4,141,8],[139,9,139,37],[139,38,139,45],[139,46,139,49],[139,50,139,56],[140,9,140,37],[140,38,140,45],[140,46,140,49],[140,50,140,56],[141,9,141,37],[141,38,141,45],[141,46,141,49],[141,50,141,56],[142,4,143,8],[142,9,142,22],[142,23,142,26],[142,27,142,37],[142,38,142,45],[142,46,142,49],[142,50,142,56],[143,9,143,37],[143,38,143,45],[143,46,143,49],[143,50,143,56],[144,4,145,8],[144,9,144,37],[144,38,144,45],[144,46,144,49],[144,50,144,56],[145,9,145,37],[145,38,145,45],[145,46,145,49],[145,50,145,56],[146,1,146,56],[148,1,152,8],[148,9,152,37],[148,38,149,56],[150,38,150,39],[150,41,150,45],[150,46,152,49],[150,50,152,56],[151,38,151,39],[151,41,151,45],[152,38,152,39],[152,41,152,45],[153,1,161,2],[153,3,161,8],[153,9,153,37],[153,38,153,45],[153,46,153,49],[153,50,153,56],[154,9,154,37],[154,38,154,45],[154,46,154,49],[154,50,154,56],[155,10,155,37],[155,38,155,45],[155,46,155,49],[155,50,155,56],[156,10,156,37],[156,38,156,45],[156,46,156,49],[156,50,156,56],[157,10,157,37],[157,38,157,45],[157,46,157,49],[157,50,157,56],[158,10,158,37],[158,38,158,45],[158,46,158,49],[158,50,158,56],[159,9,159,37],[159,38,159,45],[159,46,159,49],[159,50,159,56],[160,9,160,37],[160,38,160,45],[160,46,160,49],[160,50,160,56],[161,9,161,37],[161,38,161,45],[161,46,161,49],[161,50,161,56],[162,1,166,2],[162,3,166,8],[162,9,162,37],[162,38,162,45],[162,46,162,49],[162,50,162,56],[163,9,163,37],[163,38,163,45],[163,46,163,49],[163,50,163,56],[164,9,164,37],[164,38,164,45],[164,46,164,49],[164,50,164,56],[165,9,165,37],[165,38,165,45],[165,46,165,49],[165,50,165,56],[166,9,166,37],[166,38,166,45],[166,46,166,49],[166,50,166,56],[167,1,173,2],[167,3,173,8],[167,9,167,37],[167,38,167,45],[167,46,167,49],[167,50,167,56],[168,9,168,37],[168,38,168,45],[168,46,168,49],[168,50,168,56],[169,9,169,37],[169,38,169,45],[169,46,169,49],[169,50,169,56],[170,9,170,37],[170,38,170,45],[170,46,170,49],[170,50,170,56],[171,9,171,37],[171,38,171,45],[171,46,171,49],[171,50,171,56],[172,10,172,37],[172,38,172,45],[172,46,172,49],[172,50,172,56],[173,10,173,37],[173,38,173,45],[173,46,173,49],[173,50,173,56],[174,1,175,2],[174,3,175,8],[174,9,174,28],[174,29,174,32],[174,33,174,37],[174,38,174,45],[174,46,174,49],[174,50,174,56],[175,9,175,28],[175,29,175,32],[175,33,175,37],[175,38,175,45],[175,46,175,49],[175,50,175,56],[176,1,176,2],[176,3,176,8],[176,9,176,37],[176,38,176,45],[176,46,176,49],[176,50,176,56],[177,1,181,2],[177,3,181,8],[177,9,177,37],[177,38,177,45],[177,46,177,49],[177,50,177,56],[178,9,178,37],[178,38,178,45],[178,46,178,49],[178,50,178,56],[179,9,179,37],[179,38,179,45],[179,46,179,49],[179,50,179,56],[180,9,180,37],[180,38,180,45],[180,46,180,49],[180,50,180,56],[181,9,181,37],[181,38,181,45],[181,46,181,49],[181,50,181,56],[182,1,185,2],[182,3,185,8],[182,9,182,37],[182,38,182,45],[182,46,182,49],[182,50,182,56],[183,9,183,37],[183,38,183,45],[183,46,183,49],[183,50,183,56],[184,9,184,37],[184,38,184,45],[184,46,184,49],[184,50,184,56],[185,9,185,37],[185,38,185,45],[185,46,185,49],[185,50,185,56],[186,1,186,2],[186,3,186,8],[186,9,186,37],[186,38,186,45],[186,46,186,49],[186,50,186,56],[187,1,187,2],[187,3,187,8],[187,9,187,37],[187,38,187,45],[187,46,187,49],[187,50,187,56],[188,1,195,2],[188,3,195,8],[188,9,188,37],[188,38,188,45],[188,46,188,49],[188,50,188,56],[189,9,189,37],[189,38,189,45],[189,46,189,49],[189,50,189,56],[190,9,190,37],[190,38,190,45],[190,46,190,49],[190,50,190,56],[191,9,191,37],[191,38,191,45],[191,46,191,49],[191,50,191,56],[192,9,192,37],[192,38,192,45],[192,46,192,49],[192,50,192,56],[193,9,193,37],[193,38,193,45],[193,46,193,49],[193,50,193,56],[194,9,194,37],[194,38,194,45],[194,46,194,49],[194,50,194,56],[195,9,195,37],[195,38,195,45],[195,46,195,49],[195,50,195,56],[198,1,198,56],[199,1,203,8],[199,9,203,37],[199,38,200,56],[201,38,201,39],[201,41,201,45],[201,46,203,49],[201,50,203,56],[202,38,202,39],[202,41,202,45],[203,38,203,39],[203,41,203,45],[204,1,210,2],[204,3,210,8],[204,9,204,37],[204,38,204,45],[204,46,204,49],[204,50,204,56],[205,9,205,37],[205,38,205,45],[205,46,205,49],[205,50,205,56],[206,9,206,37],[206,38,206,45],[206,46,206,49],[206,50,206,56],[207,9,207,37],[207,38,207,45],[207,46,207,49],[207,50,207,56],[208,9,208,37],[208,38,208,45],[208,46,208,49],[208,50,208,56],[209,9,209,37],[209,38,209,45],[209,46,209,49],[209,50,209,56],[210,9,210,37],[210,38,210,45],[210,46,210,49],[210,50,210,56],[211,1,216,2],[211,3,216,8],[211,9,211,37],[211,38,211,45],[211,46,211,49],[211,50,211,56],[212,9,212,37],[212,38,212,45],[212,46,212,49],[212,50,212,56],[213,9,213,37],[213,38,213,45],[213,46,213,49],[213,50,213,56],[214,9,214,37],[214,38,214,45],[214,46,214,49],[214,50,214,56],[215,9,215,37],[215,38,215,45],[215,46,215,49],[215,50,215,56],[216,9,216,37],[216,38,216,45],[216,46,216,49],[216,50,216,56],[217,1,220,2],[217,3,220,8],[217,9,217,37],[217,38,217,45],[217,46,217,49],[217,50,217,56],[218,9,218,37],[218,38,218,45],[218,46,218,49],[218,50,218,56],[219,9,219,37],[219,38,219,45],[219,46,219,49],[219,50,219,56],[220,9,220,37],[220,38,220,45],[220,46,220,49],[220,50,220,56],[221,1,223,2],[221,3,223,8],[221,9,221,37],[221,38,221,45],[221,46,221,49],[221,50,221,56],[222,9,222,37],[222,38,222,45],[222,46,222,49],[222,50,222,56],[223,9,223,37],[223,38,223,45],[223,46,223,49],[223,50,223,56],[224,1,224,53],[225,1,225,2],[225,3,225,56],[226,3,226,56],[227,1,227,2],[227,3,227,56],[228,1,228,56],[229,1,229,56],[230,1,230,56],[231,1,231,56],[232,1,232,56],[233,1,233,56],[234,1,234,56],[235,1,235,56],[236,1,236,56],[237,1,237,56],[238,1,238,56],[239,1,239,56],[240,1,240,56],[241,1,241,56],[242,1,242,56],[243,1,243,56],[244,1,244,56],[245,1,245,56],[246,1,246,56]]}
[null,"工事監理の状況（完了検査時チェックシート）の取扱いについて（概要）"]
[null,"1・2・3号建築物用",{"$nulls":56},"シートの保護を解除すると編集が可能になります（パスワードなし）"]
[null,null,"◆","設備に関しては項目のないものもありますので、各申請物件に合った設備項目をその他欄に追加記入して下さい。"]
[null,null,"◆","防火区画、界壁等の検査時見え隠れ部分の施工状況が確認できる資料(施工写真等)を提出してください。"]
[null,null,"◆","内装仕上げの完了した写真を提出してください。"]
[null,null,"◆","上記確認資料(写真)については、黒板等で物件名、撮影年月日が確認できるように撮影してください。"]
[null,null,"◆","中間検査が対象外の建築物に関しては、工事監理の状況（中間検査時チェックシート）も併せて添付してください。"]
[null,null,"◆","中間検査以降に行われる構造耐力上主要な部分の施工についての工事監理の状況（中間検査時チェックシート）"]
[{"$nulls":3},"も併せて添付してください。"]
[]
[]
[]
[null,"工事監理の状況　"]
[]
[]
[null,1,null,"確認済証番号",{"$nulls":7},"第",null,{"$f":"IF(完了三面!M11=\"\",\"\",完了三面!M11)","v":""},null,null,{"$f":"IF(完了三面!O11=\"\",\"\",完了三面!O11)","v":""},{"$nulls":5},{"$f":"IF(完了三面!S11=\"\",\"\",完了三面!S11)","v":""},null,{"$f":"IF(完了三面!T11=\"\",\"\",完了三面!T11)","v":""},null,null,{"$f":"IF(完了三面!V11=\"\",\"\",完了三面!V11)","v":""},null,null,"号",null,"確認済証交付日",{"$nulls":9},{"$f":"IF(完了三面!M12=\"\",\"\",完了三面!M12)","v":"令和"},null,null,{"$f":"IF(完了三面!O12=\"\",\"\",完了三面!O12)","v":""},null,"年",null,{"$f":"IF(完了三面!R12=\"\",\"\",完了三面!R12)","v":""},null,"月",null,{"$f":"IF(完了三面!U12=\"\",\"\",完了三面!U12)","v":""},null,"日"]
[null,2,null,"建築場所",{"$nulls":7},{"$f":"IF(完了三面!H4=\"\",\"\",完了三面!H4)","v":""}]
[{"$nulls":3},"建築主氏名",{"$nulls":7},{"$f":"IF(完了二面!J7=\"\",\"\",IF(別紙追加様式!J6=\"\",完了二面!J7,完了二面!J7&\"　・　\"&別紙追加様式!J6))","v":""}]
[null,3,null,"工事監理者",{"$nulls":7},"資格",{"$nulls":3},{"$f":"IF(完了二面!K65=\"\",\"\",完了二面!K65&\"建築士\")","v":""},{"$nulls":7},"建築士番号",{"$nulls":7},{"$f":"IF(完了二面!T65=\"\",\"\",完了二面!T65)","v":""},{"$nulls":9},"登録",{"$nulls":3},"第",null,{"$f":"IF(完了二面!AB65=\"\",\"\",完了二面!AB65)","v":""},{"$nulls":7},"号"]
[{"$nulls":3},"監理者氏名",{"$nulls":7},{"$f":"IF(完了二面!J66=\"\",\"\",完了二面!J66)","v":""},{"$nulls":42},"印"]
[]
[null," 集団規定　（中間検査対象物件については再確認）                                                                                        "]
[null,"監　理　項　目",{"$nulls":36},"監　理　記　録"]
[]
[{"$nulls":38},"A",null,"：","目視検査",{"$nulls":4},"結果",{"$nulls":3},"備考"]
[{"$nulls":38},"B",null,"：","実測検査"]
[{"$nulls":38},"C",null,"：","施工者報告"]
[null,1,null,"確認の表示\n(法89条)",{"$nulls":5},"①確認表示板の設置及び記載内容の確認"]
[null,2,null,"敷地の安全性\n(法19条)",{"$nulls":5},"①がけ、又は擁壁の安全性について"]
[{"$nulls":9},"②切り土、盛り土の状況"]
["○",3,null,"敷地と道路\nの関係\n(法42条､43条)",{"$nulls":5},"①道路の幅員"]
["○",{"$nulls":8},"②接道長さの確認"]
["○",{"$nulls":8},"③路地状通路の幅、距離"]
["○",{"$nulls":8},"④法42条2項道路の後退"]
[{"$nulls":9},"⑤法43条許可条件との整合"]
["○",4,null,"敷地形状及び\n建物配置等\n(法52条～\n53条の2)",{"$nulls":5},"①敷地形状等（敷地の形、境界明示及び高低差等）"]
["○",{"$nulls":8},"②建物配置（道路・隣地境界からの寸法距離）"]
[{"$nulls":9},"③確認申請の平面図との照合（平面プランの確認）"]
[{"$nulls":9},"④既存建物の有無（建ぺい率、容積率等）"]
["○",5,null,"壁面後退等\n(法54条)",{"$nulls":5},"①外壁後退【",{"$nulls":8},"m】の確認（検査項目4にも関連）"]
[null,6,null,"道路斜線等\n(法56条､\n56条の2)",{"$nulls":5},"①建築確認図面の立面図、断面図との照合"]
["○",{"$nulls":8},"②最高高さ、軒高さ、庇・軒出寸法の確認"]
["○",{"$nulls":8},"③"]
[null,7,null,"その他",{"$nulls":5},"①"]
[{"$nulls":9},"②"]
[{"$nulls":9},"③"]
[]
[null,"※",null,"工事監理者は、監理記録欄に監理状況の結果を記入し、完了検査申請書と同時に提出してください。"]
[{"$nulls":3},"なお、否となった事項についてはそれに対する措置等を下記に記入してください。"]
[null,"※",null,"該当する項目のみ記入してください。"]
{"$rows_empty":10}
[null," 防火・避難関係(1/3)                                                                                         "]
[null,"監　理　項　目",{"$nulls":36},"監　理　記　録"]
[]
[{"$nulls":38},"A",null,"：","目視検査",{"$nulls":4},"結果",{"$nulls":3},"備考"]
[{"$nulls":38},"B",null,"：","実測検査"]
[{"$nulls":38},"C",null,"：","施工者報告"]
[null,1,null,"耐火建築物等の\n要求\n(法21条､27条､\n61条､62条1項)",{"$nulls":5},"①主要構造部の仕様"]
[{"$nulls":9},"②延焼のおそれのある部分の外壁の開口部の仕様"]
[null,2,null,"屋根\n(法22条､63条)",{"$nulls":5},"①屋根の構造"]
[null,3,null,"外壁\n(法23条、\n法62条2項)",{"$nulls":5},"①延焼のおそれのある部分の外壁の構造"]
[{"$nulls":9},"②延焼のおそれのある部分の軒裏の構造"]
[null,4,null,"大規模の木造\n建築物の外壁等\n(法25条)",{"$nulls":5},"①延焼のおそれのある部分の外壁及び軒裏の構造"]
[{"$nulls":9},"②屋根の構造"]
[null,5,null,"防火壁\n(法26条、\n令113条)",{"$nulls":5},"①防火壁の位置、構造､形状等"]
[{"$nulls":9},"②防火壁に設ける開口部の形状､防火戸の構造"]
[{"$nulls":9},"③防火壁を貫通する給水管等の配管、換気等の風道の構造"]
[null,6,null,"開口部の防火戸\n(法64条)",{"$nulls":5},"①延焼のおそれのある部分の外壁の開口部の仕様"]
[null,7,null,"看板等の\n防火措置\n(法66条)",{"$nulls":5},"①看板、広告塔等の工作物の主要な部分の仕様"]
["○",8,null,"階段\n(令23条\n～26条)",{"$nulls":5},"①階段及び踊場の幅、けあげ、踏面"]
[{"$nulls":9},"②踊場の位置、踏幅"]
[{"$nulls":9},"③側壁、手すり､中間手すりの設置"]
[{"$nulls":9},"④傾斜路の構造"]
[null,9,null,"防火区画(令112条)"]
[{"$nulls":4},"1)面積区画",{"$nulls":4},"①区画の位置（スプリンクラー等の設置）"]
[{"$nulls":5},"ｱ)1,500㎡区画\n［耐火］",{"$nulls":3},"②床､壁の仕様"]
[{"$nulls":9},"③防火戸の仕様・作動"]
[{"$nulls":5},"ｲ)500㎡区画\n[準耐ｲ-2]\n[準耐ﾛ-1]",{"$nulls":3},"②床､壁の仕様"]
[{"$nulls":9},"③防火戸の仕様・作動"]
[{"$nulls":5},"ｳ)1,000㎡区画\n[準耐ｲ-1]\n[準耐ﾛ-2]",{"$nulls":3},"②床､壁の仕様"]
[{"$nulls":9},"③防火戸の仕様・作動"]
[{"$nulls":4},"2)高層区画\n[11階以上］",{"$nulls":4},"①区画の位置（スプリンクラー等の設置）"]
[{"$nulls":5},"ｱ)100㎡区画",{"$nulls":3},"②床､壁の仕様"]
[{"$nulls":9},"③防火戸の仕様・作動"]
[{"$nulls":5},"ｲ)200㎡区画",{"$nulls":3},"②床､壁の仕様"]
[{"$nulls":9},"③防火戸の仕様・作動"]
[{"$nulls":9},"④内装"]
[{"$nulls":5},"ｳ)500㎡区画",{"$nulls":3},"②床､壁の仕様"]
[{"$nulls":9},"③防火戸の仕様・作動"]
[{"$nulls":9},"④内装"]
[{"$nulls":4},"3)竪穴区画",{"$nulls":4},"①区画の位置"]
[{"$nulls":9},"②床､壁の仕様"]
[{"$nulls":9},"③防火戸の仕様・作動"]
[{"$nulls":9},"④内装（ただし書適用）"]
[]
[null," 防火・避難関係(2/3)                                                                             "]
[null,"監　理　項　目",{"$nulls":36},"監　理　記　録"]
[]
[{"$nulls":38},"A",null,"：","目視検査",{"$nulls":4},"結果",{"$nulls":3},"備考"]
[{"$nulls":38},"B",null,"：","実測検査"]
[{"$nulls":38},"C",null,"：","施工者報告"]
[null,9,null,null,"4)異種用途\n区画",{"$nulls":4},"①区画の位置"]
[{"$nulls":5},"ｲ)第12項区画\n(法27条関係)",{"$nulls":3},"②床､壁の仕様"]
[{"$nulls":9},"③防火戸の仕様・作動"]
[{"$nulls":4},"5)スパンドレル",{"$nulls":4},"①スパンドレル（構造､幅等）"]
[{"$nulls":9},"②防火戸の仕様"]
[{"$nulls":4},"6)区画の\n貫通分",{"$nulls":4},"①給水管等（すき間の処理）"]
[{"$nulls":9},"②給水管等（貫通部分等の仕様）"]
[{"$nulls":9},"③ダクト等（すき間の処理、ﾀﾞﾝﾊﾟｰ）"]
[null,10,null,"建築物の界壁、\n間仕切壁及び\n隔壁\n(令114条)",{"$nulls":5},"①構造防火措置"]
[{"$nulls":9},"②界壁等貫通部分の措置"]
[null,11,null,"廊下、避難階段及び出入口(令117条)"]
["○",{"$nulls":3},"1)廊下\n(令119条)",{"$nulls":4},"①幅員、形態（避難経路）"]
[{"$nulls":4},"2)直通階段\n(令120条)",{"$nulls":4},"①直通性"]
[{"$nulls":9},"②歩行距離（最長　　ｍ）・内装"]
["○",{"$nulls":3},"3)2以上の\n直通階段\n(令121条)",{"$nulls":4},"①重複距離（最長",{"$nulls":11},"ｍ）"]
[{"$nulls":9},"②重複距離のただし書適用"]
[{"$nulls":9},"③2以上の直通階段の設置免除"]
[{"$nulls":4},"4)避難階段\nの設置\n(令122条)"]
[{"$nulls":5},"ｱ)屋内避難階段",{"$nulls":3},"①構造（耐火壁・内装・非常用の照明装置等）"]
[{"$nulls":9},"②防火戸の仕様・作動"]
["○",{"$nulls":4},"ｲ)屋外避難階段",{"$nulls":3},"①2ｍ以内の開口部"]
[{"$nulls":9},"②防火戸の仕様・作動"]
[{"$nulls":5},"ｳ)特別避難階段",{"$nulls":3},"①階段室構造（耐火壁・内装・非常用の照明装置等）"]
[{"$nulls":9},"②附室等構造（耐火壁・内装・排煙設備・非常用の照明設備等）"]
[{"$nulls":9},"③階段室・附室等の規模"]
[{"$nulls":9},"④防火戸の仕様・作動"]
[{"$nulls":5},"ｴ)ただし書適用",{"$nulls":3},"①設置免除の要件"]
[{"$nulls":4},"5)ﾒｿﾞﾈｯﾄ住戸緩和\n(令120条､\n123条の2)",{"$nulls":4},"①階数・出入口"]
[{"$nulls":9},"②歩行距離"]
[{"$nulls":4},"6)大規模物品売店舗\n(令124条)",{"$nulls":4},"①避難階段、特別避難階段の構造"]
["○",{"$nulls":8},"②各階の階段幅・出入口幅"]
["○",{"$nulls":8},"③屋外への出入口の幅"]
[{"$nulls":4},"7)屋外への\n出口等\n(令125条､\n125の2)",{"$nulls":4},"①階段及び居室からの距離（最長",{"$nulls":17},"ｍ）"]
[{"$nulls":9},"②施錠装置の構造"]
[{"$nulls":4},"8)屋上広場等\n(令126条)",{"$nulls":4},"①屋上広場の設置"]
["○",{"$nulls":8},"②手すりの設置"]
[]
[null," 防火・避難関係(3/3)                                                                              "]
[null,"監　理　項　目",{"$nulls":36},"監　理　記　録"]
[]
[{"$nulls":38},"A",null,"：","目視検査",{"$nulls":4},"結果",{"$nulls":3},"備考"]
[{"$nulls":38},"B",null,"：","実測検査"]
[{"$nulls":38},"C",null,"：","施工者報告"]
[null,12,null,"排煙設備\n(令126条の2､\n   126条の3)",{"$nulls":5},"①自然排煙（排煙窓の位置､大きさ）"]
[{"$nulls":9},"②機械排煙"]
[{"$nulls":10},"a)排煙機の能力"]
[{"$nulls":10},"b)排煙口の位置、風量"]
[{"$nulls":10},"c)ダクトの構造"]
[{"$nulls":10},"d)予備電源"]
[{"$nulls":9},"③防煙区画"]
[{"$nulls":9},"④手動開放装置の位置"]
[{"$nulls":9},"⑤設置免除部分の確認"]
[null,13,null,"非常用の照明装置\n(令126条の4､\n  126条の5)",{"$nulls":5},"①居室部分における設置位置"]
[{"$nulls":9},"②避難経路における設置位置"]
[{"$nulls":9},"③器具の作動"]
[{"$nulls":9},"④床面での照度"]
[{"$nulls":9},"⑤告示1411号の特例（歩行距離の確認）"]
[null,14,null,"非常用の進入口\n(令126条の6､\n   126条の7)",{"$nulls":5},"①設置位置・間隔"]
["○",{"$nulls":8},"②幅、高さ及び下端の床面からの高さ"]
["○",{"$nulls":8},"③バルコニーの奥行き及び長さ"]
[{"$nulls":9},"④赤色灯及び赤色の進入口表示"]
[{"$nulls":9},"⑤ただし書適用"]
["○",{"$nulls":9},"a)代替進入口の設置、仕様"]
[{"$nulls":10},"b)非常用の昇降機の設置"]
[null,15,null,"敷地内の通路\n(令128条)",{"$nulls":5},"①屋外避難階段から道等に通ずる通路（最小幅",{"$nulls":23},"ｍ）"]
[{"$nulls":9},"②屋外への出口から道等に通じる通路（最小幅",{"$nulls":23},"ｍ）"]
[null,16,null,"大規模な木造等の建築物の敷地内における通路\n(令128条の2)",{"$nulls":5},"①建築物の周囲に設ける通路"]
[null,17,null,"特殊建築物等の内装\n(令128条の3の2､\n  128条の4､\n  129条)",{"$nulls":5},"①居室（不燃、準不燃、難燃材料）"]
[{"$nulls":9},"②避難経路（不燃、準不燃材料）"]
[{"$nulls":9},"③火気使用室（不燃、準不燃材料）"]
[{"$nulls":9},"④車庫、無窓居室、地階にある特殊建築物の居室"]
[{"$nulls":9},"⑤内装制限の免除"]
[null,18,null,"非常用の昇降機\n(令129条の13の2､\n   129条の13の3)",{"$nulls":5},"①非常用の昇降機の位置、台数"]
[{"$nulls":9},"②乗降ロビーの構造、規模"]
[{"$nulls":9},"③非常用エレベーターの構造等"]
[{"$nulls":9},"④設置免除の要件"]
["○",19,null,"天井高(令21条)",{"$nulls":5},"①居室の天井高"]
[null,20,null,"住宅用火災\n警報器",{"$nulls":5},"①位置、種類、性能及び作動"]
[null,21,null,"その他",{"$nulls":5},"①"]
[{"$nulls":9},"②"]
[{"$nulls":9},"③"]
[{"$nulls":9},"④"]
[{"$nulls":9},"⑤"]
[{"$nulls":9},"⑥"]
[{"$nulls":9},"⑦"]
[{"$nulls":9},"⑧"]
[]
[null," シックハウス関係"]
[null,"【法68条の11第1項の認証に係る型式の建築物については、各項目の確認図書を型式適合認定仕様書に読み替えます。】"]
[null,"監　理　項　目",{"$nulls":36},"監　理　記　録"]
[]
[{"$nulls":38},"A",null,"：","目視検査",{"$nulls":4},"結果",{"$nulls":3},"備考"]
[{"$nulls":38},"B",null,"：","実測検査"]
[{"$nulls":38},"C",null,"：","施工者報告"]
[null,1,null,"居室等の\n使用建築材料\n（令20条の7）",{"$nulls":5},"①各居室等の下地材(種別及び使用面積)確認図書との整合"]
[{"$nulls":9},"②各居室等の接着剤(種別及び使用面積)確認図書との整合"]
[{"$nulls":9},"③各居室等の仕上げ材(種別及び使用面積)確認図書との整合"]
[{"$nulls":9},"④各居室等の建具等(種別及び使用面積)確認図書との整合"]
[{"$nulls":9},"⑤各居室等の塗料(種類及び使用面積)確認図書との整合"]
[{"$nulls":9},"⑥各居室等の造付家具等(種別及び使用面積)確認図書との整合"]
[{"$nulls":9},"⑦その他"]
[null,2,null,"居室等の\n換気設備\n（令20条の8）",{"$nulls":5},"①各居室等の換気計画の確認図書との整合\n（換気種別、換気経路、換気エリア、気積等）"]
[{"$nulls":9},"②各居室等の建具の形状・位置の確認図書(換気計画)との整合"]
[{"$nulls":9},"③各居室の換気設備の確認図書との整合\n　　　　（形状、規格、性能等）"]
[{"$nulls":9},"④各居室等の換気スイッチの措置"]
[{"$nulls":9},"⑤各居室等のダクトの配置の確認図書との整合"]
[{"$nulls":9},"⑥その他"]
[null,3,null,"天井裏等の\n使用建築材料\n（令20条の8）",{"$nulls":5},"①天井裏等の使用材料(種別)確認図書との整合"]
[{"$nulls":9},"②天井裏等の気密層又は通気止めの確認図書との整合"]
[{"$nulls":9},"③天井裏等の換気設備の確認図書との整合\n　　　　（形状、規格、性能、ダクトの配置等）"]
[{"$nulls":9},"④その他"]
[null,4,null,"その他",{"$nulls":5},"①"]
[{"$nulls":9},"②"]
[{"$nulls":9},"③"]
[]
[null,"※",null,"工事監理者は、監理記録欄に監理状況の結果を記入し、完了検査申請書と同時に提出してください。"]
[{"$nulls":3},"なお、否となった事項についてはそれに対する措置等を下記に記入してください。"]
[null,"※",null,"該当する項目のみ記入してください。"]
{"$rows_empty":19}
["中間二面建築主",{"$nulls":3},"中間二面建築主",{"$nulls":8},{"$f":"IF(完了二面!J7=\"\",\"\",完了二面!J7)","v":""}]
[]
[{"$nulls":4},"A ・ B ・ C",{"$nulls":5},"A ・ B ・ C",{"$nulls":6},"適 ・否"]
[]
[{"$nulls":4},"Ⓐ",{"$nulls":5},"Ⓐ ・ Ⓑ",{"$nulls":6},"適"]
[{"$nulls":4},"Ⓐ ・ Ⓑ",{"$nulls":5},"Ⓐ ・ Ⓑ ・ Ⓒ",{"$nulls":6},"否"]
[{"$nulls":4},"Ⓐ ・ Ⓒ",{"$nulls":5},"Ⓑ",{"$nulls":6},"該当なし"]
[{"$nulls":4},"Ⓐ ・ Ⓑ ・ Ⓒ",{"$nulls":5},"Ⓑ ・ Ⓒ",{"$nulls":6},"-"]
[{"$nulls":4},"Ⓑ",{"$nulls":5},"-"]
[{"$nulls":4},"Ⓑ ・ Ⓒ"]
[{"$nulls":4},"Ⓒ"]
[{"$nulls":4},"-"]

{"sheet":"完了ﾁｪｯｸ（4号）","index":44,"n_rows":166,"n_cols":59,"rows_kept":166,"merged":[[7,1,7,56],[8,1,9,36],[8,37,9,56],[8,58,8,67],[10,1,10,56],[11,1,11,2],[11,3,11,10],[11,11,11,12],[11,13,11,15],[11,16,11,21],[11,22,11,23],[11,24,11,26],[11,27,11,29],[11,30,11,31],[11,32,11,41],[11,42,11,44],[11,45,11,46],[11,47,11,48],[11,49,11,50],[11,51,11,52],[11,53,11,54],[11,55,11,56],[11,59,11,67],[12,1,13,2],[12,3,12,10],[12,11,12,56],[12,59,12,67],[13,3,13,10],[13,11,13,56],[13,59,13,67],[14,1,15,2],[14,3,14,10],[14,11,14,14],[14,15,14,22],[14,23,14,30],[14,31,14,40],[14,41,14,44],[14,45,14,46],[14,47,14,54],[14,55,14,56],[15,3,15,10],[15,11,15,53],[15,54,15,56],[16,1,16,56],[18,1,22,8],[18,9,22,37],[18,38,19,56],[20,38,20,39],[20,41,20,45],[20,46,22,49],[20,50,22,56],[21,38,21,39],[21,41,21,45],[22,38,22,39],[22,41,22,45],[23,1,23,2],[23,3,23,8],[23,9,23,37],[23,38,23,45],[23,46,23,49],[23,50,23,56],[24,1,25,2],[24,3,25,8],[24,9,24,37],[24,38,24,45],[24,46,24,49],[24,50,24,56],[25,9,25,37],[25,38,25,45],[25,46,25,49],[25,50,25,56],[26,1,30,2],[26,3,30,8],[26,9,26,37],[26,38,26,45],[26,46,26,49],[26,50,26,56],[27,9,27,37],[27,38,27,45],[27,46,27,49],[27,50,27,56],[28,9,28,37],[28,38,28,45],[28,46,28,49],[28,50,28,56],[29,9,29,37],[29,38,29,45],[29,46,29,49],[29,50,29,56],[30,9,30,37],[30,38,30,45],[30,46,30,49],[30,50,30,56],[31,1,34,2],[31,3,34,8],[31,9,31,37],[31,38,31,45],[31,46,31,49],[31,50,31,56],[32,9,32,37],[32,38,32,45],[32,46,32,49],[32,50,32,56],[33,9,33,37],[33,38,33,45],[33,46,33,49],[33,50,33,56],[34,9,34,37],[34,38,34,45],[34,46,34,49],[34,50,34,56],[35,1,35,2],[35,3,35,8],[35,15,35,17],[35,18,35,37],[35,38,35,45],[35,46,35,49],[35,50,35,56],[36,1,38,2],[36,3,38,8],[36,9,36,37],[36,38,36,45],[36,46,36,49],[36,50,36,56],[37,9,37,37],[37,38,37,45],[37,46,37,49],[37,50,37,56],[38,9,38,37],[38,38,38,45],[38,46,38,49],[38,50,38,56],[39,1,41,2],[39,3,41,8],[39,9,39,37],[39,38,39,45],[39,46,39,49],[39,50,39,56],[40,9,40,37],[40,38,40,45],[40,46,40,49],[40,50,40,56],[41,9,41,37],[41,38,41,45],[41,46,41,49],[41,50,41,56],[42,1,42,56],[43,1,43,2],[43,3,43,56],[44,3,44,56],[45,1,45,2],[45,3,45,56],[46,1,46,56],[47,1,47,56],[48,1,48,56],[49,1,49,56],[50,1,50,56],[52,1,52,56],[53,1,53,56],[54,1,54,56],[55,1,55,56],[56,1,56,56],[58,1,62,8],[58,9,62,37],[58,38,59,56],[60,38,60,39],[60,41,60,45],[60,46,62,49],[60,50,62,56],[61,38,61,39],[61,41,61,45],[62,38,62,39],[62,41,62,45],[63,1,64,2],[63,3,64,8],[63,9,63,37],[63,38,63,45],[63,46,63,49],[63,50,63,56],[64,9,64,37],[64,38,64,45],[64,46,64,49],[64,50,64,56],[65,1,65,2],[65,3,65,8],[65,9,65,37],[65,38,65,45],[65,46,65,49],[65,50,65,56],[66,1,67,2],[66,3,67,8],[66,9,66,37],[66,38,66,45],[66,46,66,49],[66,50,66,56],[67,9,67,37],[67,38,67,45],[67,46,67,49],[67,50,67,56],[68,1,70,2],[68,3,70,8],[68,9,68,37],[68,38,68,45],[68,46,68,49],[68,50,68,56],[69,9,69,37],[69,38,69,45],[69,46,69,49],[69,50,69,56],[70,9,70,37],[70,38,70,45],[70,46,70,49],[70,50,70,56],[71,1,71,2],[71,3,71,8],[71,9,71,37],[71,38,71,45],[71,46,71,49],[71,50,71,56],[72,1,75,2],[72,3,75,8],[72,9,72,37],[72,38,72,45],[72,46,72,49],[72,50,72,56],[73,9,73,37],[73,38,73,45],[73,46,73,49],[73,50,73,56],[74,9,74,37],[74,38,74,45],[74,46,74,49],[74,50,74,56],[75,9,75,37],[75,38,75,45],[75,46,75,49],[75,50,75,56],[76,1,77,2],[76,3,77,8],[76,9,76,37],[76,38,76,45],[76,46,76,49],[76,50,76,56],[77,9,77,37],[77,38,77,45],[77,46,77,49],[77,50,77,56],[78,1,86,2],[78,3,86,8],[78,9,78,37],[78,38,78,45],[78,46,78,49],[78,50,78,56],[79,9,79,37],[79,38,79,45],[79,46,79,49],[79,50,79,56],[80,10,80,37],[80,38,80,45],[80,46,80,49],[80,50,80,56],[81,10,81,37],[81,38,81,45],[81,46,81,49],[81,50,81,56],[82,10,82,37],[82,38,82,45],[82,46,82,49],[82,50,82,56],[83,10,83,37],[83,38,83,45],[83,46,83,49],[83,50,83,56],[84,9,84,37],[84,38,84,45],[84,46,84,49],[84,50,84,56],[85,9,85,37],[85,38,85,45],[85,46,85,49],[85,50,85,56],[86,9,86,37],[86,38,86,45],[86,46,86,49],[86,50,86,56],[87,1,91,2],[87,3,91,8],[87,9,87,37],[87,38,87,45],[87,46,87,49],[87,50,87,56],[88,9,88,37],[88,38,88,45],[88,46,88,49],[88,50,88,56],[89,9,89,37],[89,38,89,45],[89,46,89,49],[89,50,89,56],[90,9,90,37],[90,38,90,45],[90,46,90,49],[90,50,90,56],[91,9,91,37],[91,38,91,45],[91,46,91,49],[91,50,91,56],[92,1,93,2],[92,3,93,8],[92,9,92,28],[92,29,92,32],[92,33,92,37],[92,38,92,45],[92,46,92,49],[92,50,92,56],[93,9,93,28],[93,29,93,32],[93,33,93,37],[93,38,93,45],[93,46,93,49],[93,50,93,56],[94,1,98,2],[94,3,98,8],[94,9,94,37],[94,38,94,45],[94,46,94,49],[94,50,94,56],[95,9,95,37],[95,38,95,45],[95,46,95,49],[95,50,95,56],[96,9,96,37],[96,38,96,45],[96,46,96,49],[96,50,96,56],[97,9,97,37],[97,38,97,45],[97,46,97,49],[97,50,97,56],[98,9,98,37],[98,38,98,45],[98,46,98,49],[98,50,98,56],[99,1,99,2],[99,3,99,8],[99,9,99,37],[99,38,99,45],[99,46,99,49],[99,50,99,56],[100,1,100,2],[100,3,100,8],[100,9,100,37],[100,38,100,45],[100,46,100,49],[100,50,100,56],[101,1,103,2],[101,3,103,8],[101,9,101,37],[101,38,101,45],[101,46,101,49],[101,50,101,56],[102,9,102,37],[102,38,102,45],[102,46,102,49],[102,50,102,56],[103,9,103,37],[103,38,103,45],[103,46,103,49],[103,50,103,56],[106,1,106,56],[107,1,111,8],[107,9,111,37],[107,38,108,56],[109,38,109,39],[109,41,109,45],[109,46,111,49],[109,50,111,56],[110,38,110,39],[110,41,110,45],[111,38,111,39],[111,41,111,45],[112,1,118,2],[112,3,118,8],[112,9,112,37],[112,38,112,45],[112,46,112,49],[112,50,112,56],[113,9,113,37],[113,38,113,45],[113,46,113,49],[113,50,113,56],[114,9,114,37],[114,38,114,45],[114,46,114,49],[114,50,114,56],[115,9,115,37],[115,38,115,45],[115,46,115,49],[115,50,115,56],[116,9,116,37],[116,38,116,45],[116,46,116,49],[116,50,116,56],[117,9,117,37],[117,38,117,45],[117,46,117,49],[117,50,117,56],[118,9,118,37],[118,38,118,45],[118,46,118,49],[118,50,118,56],[119,1,124,2],[119,3,124,8],[119,9,119,37],[119,38,119,45],[119,46,119,49],[119,50,119,56],[120,9,120,37],[120,38,120,45],[120,46,120,49],[120,50,120,56],[121,9,121,37],[121,38,121,45],[121,46,121,49],[121,50,121,56],[122,9,122,37],[122,38,122,45],[122,46,122,49],[122,50,122,56],[123,9,123,37],[123,38,123,45],[123,46,123,49],[123,50,123,56],[124,9,124,37],[124,38,124,45],[124,46,124,49],[124,50,124,56],[125,1,128,2],[125,3,128,8],[125,9,125,37],[125,38,125,45],[125,46,125,49],[125,50,125,56],[126,9,126,37],[126,38,126,45],[126,46,126,49],[126,50,126,56],[127,9,127,37],[127,38,127,45],[127,46,127,49],[127,50,127,56],[128,9,128,37],[128,38,128,45],[128,46,128,49],[128,50,128,56],[129,1,131,2],[129,3,131,8],[129,9,129,37],[129,38,129,45],[129,46,129,49],[129,50,129,56],[130,9,130,37],[130,38,130,45],[130,46,130,49],[130,50,130,56],[131,9,131,37],[131,38,131,45],[131,46,131,49],[131,50,131,56],[132,1,132,53],[133,1,133,2],[133,3,133,56],[134,3,134,56],[135,1,135,2],[135,3,135,56],[136,1,136,56],[137,1,137,56],[138,1,138,56],[139,1,139,56],[140,1,140,56],[141,1,141,56],[142,1,142,56],[143,1,143,56],[144,1,144,56],[145,1,145,56],[146,1,146,56],[147,1,147,56],[148,1,148,56],[149,1,149,56],[150,1,150,56],[151,1,151,56],[155,2,155,6],[155,8,155,13],[155,15,155,19]]}
[null,"工事監理の状況（完了検査時チェックシート）の取扱いについて（概要）"]
[null,"4号建築物用",{"$nulls":56},"シートの保護を解除すると編集が可能になります（パスワードなし）"]
[null,null,"◆","設備に関しては項目のないものもありますので、各申請物件に合った設備項目をその他欄に追加記入して下さい。"]
[null,null,"◆","界壁等の検査時見え隠れ部分の施工状況が確認できる資料(施工写真等)を提出してください。"]
[null,null,"◆","中間検査が対象外の建築物に関しては、工事監理の状況（中間検査時チェックシート）も併せて添付してください。"]
[]
[]
[]
[null,"工事監理の状況　"]
[]
[]
[null,1,null,"確認済証番号",{"$nulls":7},"第",null,{"$f":"IF(完了三面!M11=\"\",\"\",完了三面!M11)","v":""},null,null,{"$f":"IF(完了三面!O11=\"\",\"\",完了三面!O11)","v":""},{"$nulls":5},{"$f":"IF(完了三面!S11=\"\",\"\",完了三面!S11)","v":""},null,{"$f":"IF(完了三面!T11=\"\",\"\",完了三面!T11)","v":""},null,null,{"$f":"IF(完了三面!V11=\"\",\"\",完了三面!V11)","v":""},null,null,"号",null,"確認済証交付日",{"$nulls":9},{"$f":"IF(完了三面!M12=\"\",\"\",完了三面!M12)","v":"令和"},null,null,{"$f":"IF(完了三面!O12=\"\",\"\",完了三面!O12)","v":""},null,"年",null,{"$f":"IF(完了三面!R12=\"\",\"\",完了三面!R12)","v":""},null,"月",null,{"$f":"IF(完了三面!U12=\"\",\"\",完了三面!U12)","v":""},null,"日"]
[null,2,null,"建築場所",{"$nulls":7},{"$f":"IF(完了三面!H4=\"\",\"\",完了三面!H4)","v":""}]
[{"$nulls":3},"建築主氏名",{"$nulls":7},{"$f":"IF(完了二面!J7=\"\",\"\",IF(別紙追加様式!J6=\"\",完了二面!J7,完了二面!J7&\"　・　\"&別紙追加様式!J6))","v":""}]
[null,3,null,"工事監理者",{"$nulls":7},"資格",{"$nulls":3},{"$f":"IF(完了二面!K65=\"\",\"\",完了二面!K65&\"建築士\")","v":""},{"$nulls":7},"建築士番号",{"$nulls":7},{"$f":"IF(完了二面!T65=\"\",\"\",完了二面!T65)","v":""},{"$nulls":9},"登録",{"$nulls":3},"第",null,{"$f":"IF(完了二面!AB65=\"\",\"\",完了二面!AB65)","v":""},{"$nulls":7},"号"]
[{"$nulls":3},"監理者氏名",{"$nulls":7},{"$f":"IF(完了二面!J66=\"\",\"\",完了二面!J66)","v":""},{"$nulls":42},"印"]
[]
[null," 集団規定　（中間検査対象物件については再確認）                                                                                        "]
[null,"監　理　項　目",{"$nulls":36},"監　理　記　録"]
[]
[{"$nulls":38},"A",null,"：","目視検査",{"$nulls":4},"結果",{"$nulls":3},"備考"]
[{"$nulls":38},"B",null,"：","実測検査"]
[{"$nulls":38},"C",null,"：","施工者報告"]
[null,1,null,"確認の表示\n(法89条)",{"$nulls":5},"①確認表示板の設置及び記載内容の確認"]
[null,2,null,"敷地の安全性\n(法19条)",{"$nulls":5},"①がけ、又は擁壁の安全性について"]
[{"$nulls":9},"②切り土、盛り土の状況"]
["○",3,null,"敷地と道路\nの関係\n(法42条､43条)",{"$nulls":5},"①道路の幅員"]
["○",{"$nulls":8},"②接道長さの確認"]
["○",{"$nulls":8},"③路地状通路の幅、距離"]
["○",{"$nulls":8},"④法42条2項道路の後退"]
[{"$nulls":9},"⑤法43条許可条件との整合"]
["○",4,null,"敷地形状及び\n建物配置等\n(法52条～\n53条の2)",{"$nulls":5},"①敷地形状等（敷地の形、境界明示及び高低差等）"]
["○",{"$nulls":8},"②建物配置（道路・隣地境界からの寸法距離）"]
[{"$nulls":9},"③確認申請の平面図との照合（平面プランの確認）"]
[{"$nulls":9},"④既存建物の有無（建ぺい率、容積率等）"]
["○",5,null,"壁面後退等\n(法54条)",{"$nulls":5},"①外壁後退【",{"$nulls":8},"m】の確認（検査項目4にも関連）"]
[null,6,null,"道路斜線等\n(法56条､\n56条の2)",{"$nulls":5},"①建築確認図面の立面図、断面図との照合"]
["○",{"$nulls":8},"②最高高さ、軒高さ、庇・軒出寸法の確認"]
["○",{"$nulls":8},"③"]
[null,7,null,"その他",{"$nulls":5},"①"]
[{"$nulls":9},"②"]
[{"$nulls":9},"③"]
[]
[null,"※",null,"工事監理者は、監理記録欄に監理状況の結果を記入し、完了検査申請書と同時に提出してください。"]
[{"$nulls":3},"なお、否となった事項についてはそれに対する措置等を下記に記入してください。"]
[null,"※",null,"該当する項目のみ記入してください。"]
{"$rows_empty":11}
[null," 防火・避難関係(4号建築物用 )"]
[null,"監　理　項　目",{"$nulls":36},"監　理　記　録"]
[]
[{"$nulls":38},"A",null,"：","目視検査",{"$nulls":4},"結果",{"$nulls":3},"備考"]
[{"$nulls":38},"B",null,"：","実測検査"]
[{"$nulls":38},"C",null,"：","施工者報告"]
[null,1,null,"耐火建築物等の\n要求\n(法21条､27条､\n61条､62条1項)",{"$nulls":5},"①主要構造部の仕様"]
[{"$nulls":9},"②延焼のおそれのある部分の外壁の開口部の仕様"]
[null,2,null,"屋根\n(法22条､63条)",{"$nulls":5},"①屋根の構造"]
[null,3,null,"外壁\n(法23条、\n法62条2項)",{"$nulls":5},"①延焼のおそれのある部分の外壁の構造"]
[{"$nulls":9},"②延焼のおそれのある部分の軒裏の構造"]
[null,4,null,"防火壁\n(法26条、\n令113条)",{"$nulls":5},"①防火壁の位置、構造､形状等"]
[{"$nulls":9},"②防火壁に設ける開口部の形状､防火戸の構造"]
[{"$nulls":9},"③防火壁を貫通する給水管等の配管、換気等の風道の構造"]
[null,5,null,"開口部の防火戸\n(法64条)",{"$nulls":5},"①延焼のおそれのある部分の外壁の開口部の仕様"]
["○",6,null,"階段\n(令23条\n～26条)",{"$nulls":5},"①階段及び踊場の幅、けあげ、踏面"]
[{"$nulls":9},"②踊場の位置、踏幅"]
[{"$nulls":9},"③側壁、手すり､中間手すりの設置"]
[{"$nulls":9},"④傾斜路の構造"]
[null,7,null,"建築物の界壁、\n間仕切壁及び\n隔壁\n(令114条)",{"$nulls":5},"①構造防火措置"]
[{"$nulls":9},"②界壁等貫通部分の措置"]
[null,8,null,"排煙設備\n(令126条の2､\n   126条の3)",{"$nulls":5},"①自然排煙（排煙窓の位置､大きさ）"]
[{"$nulls":9},"②機械排煙"]
[{"$nulls":10},"a)排煙機の能力"]
[{"$nulls":10},"b)排煙口の位置、風量"]
[{"$nulls":10},"c)ダクトの構造"]
[{"$nulls":10},"d)予備電源"]
[{"$nulls":9},"③防煙区画"]
[{"$nulls":9},"④手動開放装置の位置"]
[{"$nulls":9},"⑤設置免除部分の確認"]
[null,9,null,"非常用の照明装置\n(令126条の4､\n  126条の5)",{"$nulls":5},"①居室部分における設置位置"]
[{"$nulls":9},"②避難経路における設置位置"]
[{"$nulls":9},"③器具の作動"]
[{"$nulls":9},"④床面での照度"]
[{"$nulls":9},"⑤告示1411号の特例（歩行距離の確認）"]
[null,10,null,"敷地内の通路\n(令128条)",{"$nulls":5},"①屋外避難階段から道等に通ずる通路（最小幅",{"$nulls":23},"ｍ）"]
[{"$nulls":9},"②屋外への出口から道等に通じる通路（最小幅",{"$nulls":23},"ｍ）"]
[null,11,null,"特殊建築物等の内装\n(令128条の3の2､\n  128条の4､\n  129条)",{"$nulls":5},"①居室（不燃、準不燃、難燃材料）"]
[{"$nulls":9},"②避難経路（不燃、準不燃材料）"]
[{"$nulls":9},"③火気使用室（不燃、準不燃材料）"]
[{"$nulls":9},"④車庫、無窓居室、地階にある特殊建築物の居室"]
[{"$nulls":9},"⑤内装制限の免除"]
["○",12,null,"天井高(令21条)",{"$nulls":5},"①居室の天井高"]
[null,13,null,"住宅用火災\n警報器",{"$nulls":5},"①位置、種類、性能及び作動"]
[null,14,null,"その他",{"$nulls":5},"①"]
[{"$nulls":9},"②"]
[{"$nulls":9},"③  "]
[]
[null," シックハウス関係"]
[null,"【法68条の11第1項の認証に係る型式の建築物については、各項目の確認図書を型式適合認定仕様書に読み替えます。】"]
[null,"監　理　項　目",{"$nulls":36},"監　理　記　録"]
[]
[{"$nulls":38},"A",null,"：","目視検査",{"$nulls":4},"結果",{"$nulls":3},"備考"]
[{"$nulls":38},"B",null,"：","実測検査"]
[{"$nulls":38},"C",null,"：","施工者報告"]
[null,1,null,"居室等の\n使用建築材料\n（令20条の7）",{"$nulls":5},"①各居室等の下地材(種別及び使用面積)確認図書との整合"]
[{"$nulls":9},"②各居室等の接着剤(種別及び使用面積)確認図書との整合"]
[{"$nulls":9},"③各居室等の仕上げ材(種別及び使用面積)確認図書との整合"]
[{"$nulls":9},"④各居室等の建具等(種別及び使用面積)確認図書との整合"]
[{"$nulls":9},"⑤各居室等の塗料(種類及び使用面積)確認図書との整合"]
[{"$nulls":9},"⑥各居室等の造付家具等(種別及び使用面積)確認図書との整合"]
[{"$nulls":9},"⑦その他"]
[null,2,null,"居室等の\n換気設備\n（令20条の8）",{"$nulls":5},"①各居室等の換気計画の確認図書との整合\n（換気種別、換気経路、換気エリア、気積等）"]
[{"$nulls":9},"②各居室等の建具の形状・位置の確認図書(換気計画)との整合"]
[{"$nulls":9},"③各居室の換気設備の確認図書との整合\n　　　　（形状、規格、性能等）"]
[{"$nulls":9},"④各居室等の換気スイッチの措置"]
[{"$nulls":9},"⑤各居室等のダクトの配置の確認図書との整合"]
[{"$nulls":9},"⑥その他"]
[null,3,null,"天井裏等の\n使用建築材料\n（令20条の8）",{"$nulls":5},"①天井裏等の使用材料(種別)確認図書との整合"]
[{"$nulls":9},"②天井裏等の気密層又は通気止めの確認図書との整合"]
[{"$nulls":9},"③天井裏等の換気設備の確認図書との整合\n　　　　（形状、規格、性能、ダクトの配置等）"]
[{"$nulls":9},"④その他"]
[null,4,null,"その他",{"$nulls":5},"①"]
[{"$nulls":9},"②"]
[{"$nulls":9},"③"]
[]
[null,"※",null,"工事監理者は、監理記録欄に監理状況の結果を記入し、完了検査申請書と同時に提出してください。"]
[{"$nulls":3},"なお、否となった事項についてはそれに対する措置等を下記に記入してください。"]
[null,"※",null,"該当する項目のみ記入してください。"]
{"$rows_empty":18}
[null,null,"中間二面建築主",{"$nulls":8},{"$f":"IF(完了二面!J7=\"\",\"\",完了二面!J7)","v":""}]
[]
[null,null,"A ・ B ・ C",{"$nulls":5},"A ・ B ・ C",{"$nulls":6},"適 ・否"]
[]
[null,null,"Ⓐ",{"$nulls":5},"Ⓐ ・ Ⓑ",{"$nulls":6},"適"]
[null,null,"Ⓐ ・ Ⓑ",{"$nulls":5},"Ⓐ ・ Ⓑ ・ Ⓒ",{"$nulls":6},"否"]
[null,null,"Ⓐ ・ Ⓒ",{"$nulls":5},"Ⓑ",{"$nulls":6},"該当なし"]
[null,null,"Ⓐ ・ Ⓑ ・ Ⓒ",{"$nulls":5},"Ⓑ ・ Ⓒ",{"$nulls":6},"-"]
[null,null,"Ⓑ",{"$nulls":5},"-"]
[null,null,"Ⓑ ・ Ⓒ"]
[null,null,"Ⓒ"]
[null,null,"-"]

{"sheet":"受付用","index":45,"n_rows":207,"n_cols":94,"rows_kept":207,"merged":[[4,21,4,25],[5,19,5,22],[6,19,6,26]]}
["申請者氏名","代理者事務所名","担当者","代理者TEL","代理者FAX","主要用途","申請地（地名地番）","建築主1","建築主2","代理者事務所（申請上）","代理者\n（申請上）","建築物名称","敷地\n面積","建築\n面積","延べ\n面積","階数\n（地上）","階数\n（地下）"]
[{"$f":"受付表!J5","v":""},{"$f":"受付表!AA5","v":""},{"$f":"受付表!AW5","v":0},{"$f":"受付表!AA8","v":0},{"$f":"受付表!AP8","v":0},{"$f":"受付表!A8","v":""},{"$f":"受付表!J8","v":""},{"$f":"申二面!J7","v":0},{"$f":"別紙追加様式!J6","v":0},{"$f":"申二面!J17","v":0},{"$f":"申二面!J15","v":0},{"$f":"申二面!E186","v":0},{"$f":"申三面!M22","v":""},{"$f":"申三面!AA31","v":""},{"$f":"申三面!AA34","v":""},{"$f":"申三面!L58","v":0},{"$f":"申三面!L59","v":0}]
[]
["※このシートはアネックス処理用です。さわらないで下さい。(anex20180401)",{"$nulls":86},"新築","増築","改築","移転","用途変更","大規模の修繕","大規模の模様替"]
[]
[]
[]
[{"$f":"IF(申三面!G3=\"\",\"\",申三面!G3)","v":""},"確認時"]
[{"$f":"LEFT(A8,MIN(FIND({\"市\",\"町\",\"村\"},A8&\"市町村\")))","v":""},{"$f":"IF(A9=\"\",\"\",IFERROR(VLOOKUP(A9,A15:C207,2,FALSE),\"\"))","v":""},{"$f":"IF(A9=\"\",\"\",IFERROR(VLOOKUP(A9,A15:C207,3,FALSE),\"\"))","v":""}]
[{"$f":"IF(中間三面!H4=\"\",\"\",中間三面!H4)","v":""},"中間検査時"]
[{"$f":"LEFT(A10,MIN(FIND({\"市\",\"町\",\"村\"},A10&\"市町村\")))","v":""},{"$f":"IF(A11=\"\",\"\",IFERROR(VLOOKUP(A11,A15:C207,2,FALSE),\"\"))","v":""},{"$f":"IF(A11=\"\",\"\",IFERROR(VLOOKUP(A11,A15:C207,3,FALSE),\"\"))","v":""}]
[{"$f":"IF(完了三面!H4=\"\",\"\",完了三面!H4)","v":""},"完了検査時"]
[{"$f":"LEFT(A12,MIN(FIND({\"市\",\"町\",\"村\"},A12&\"市町村\")))","v":""},{"$f":"IF(A13=\"\",\"\",IFERROR(VLOOKUP(A13,A15:C207,2,FALSE),\"\"))","v":""},{"$f":"IF(A13=\"\",\"\",IFERROR(VLOOKUP(A13,A15:C207,3,FALSE),\"\"))","v":""}]
[]
["滋賀県大津市","滋","大津"]
["大津市","滋","大津"]
["滋賀県草津市","滋","草津"]
["草津市","滋","草津"]
["滋賀県守山市","滋","守山"]
["守山市","滋","守山"]
["滋賀県近江八幡市","滋","近江"]
["近江八幡市","滋","近江"]
["滋賀県東近江市","滋","八日"]
["東近江市","滋","八日"]
["滋賀県彦根市","滋","彦根"]
["彦根市","滋","彦根"]
["滋賀県長浜市","滋","長浜"]
["長浜市","滋","長浜"]
["滋賀県湖南市","滋","甲賀"]
["湖南市","滋","甲賀"]
["滋賀県甲賀市","滋","甲賀"]
["甲賀市","滋","甲賀"]
["滋賀県蒲生郡竜王町","滋","東近"]
["蒲生郡竜王町","滋","東近"]
["竜王町","滋","東近"]
["滋賀県蒲生郡日野町","滋","東近"]
["蒲生郡日野町","滋","東近"]
["日野町","滋","東近"]
["滋賀県栗東市","滋","湖南"]
["栗東市","滋","湖南"]
["滋賀県野洲市","滋","湖南"]
["野洲市","滋","湖南"]
["滋賀県高島市","滋","湖西"]
["高島市","滋","湖西"]
["滋賀県愛知郡愛荘町","滋","湖東"]
["愛知郡愛荘町","滋","湖東"]
["愛荘町","滋","湖東"]
["滋賀県犬上郡多賀町","滋","湖東"]
["犬上郡多賀町","滋","湖東"]
["多賀町","滋","湖東"]
["滋賀県犬上郡豊郷町","滋","湖東"]
["犬上郡豊郷町","滋","湖東"]
["豊郷町","滋","湖東"]
["滋賀県犬上郡甲良町","滋","湖東"]
["犬上郡甲良町","滋","湖東"]
["甲良町","滋","湖東"]
["滋賀県米原市","滋","湖北"]
["米原市","滋","湖北"]
["京都府京都市","京","市"]
["京都市","京","市"]
["京都府宇治市","京","府"]
["宇治市","京","府"]
["京都府城陽市","京","宇"]
["城陽市","京","宇"]
["京都府久世郡久御山町","京","宇"]
["久世郡久御山町","京","宇"]
["久御山町","京","宇"]
["京都府向日市","京","乙"]
["向日市","京","乙"]
["京都府長岡京市","京","乙"]
["長岡京市","京","乙"]
["京都府乙訓郡大山崎町","京","乙"]
["乙訓郡大山崎町","京","乙"]
["大山崎町","京","乙"]
["京都府京田辺市","京","田"]
["京田辺市","京","田"]
["京都府綴喜郡井手町","京","田"]
["綴喜郡井手町","京","田"]
["井手町","京","田"]
["京都府綴喜郡宇治田原町","京","田"]
["綴喜郡宇治田原町","京","田"]
["宇治田原町","京","田"]
["京都府八幡市","京","田"]
["八幡市","京","田"]
["京都府相楽郡精華町","京","木"]
["相楽郡精華町","京","木"]
["精華町","京","木"]
["京都府木津川市","京","木"]
["木津川市","京","木"]
["京都府相楽郡笠置町","京","木"]
["相楽郡笠置町","京","木"]
["笠置町","京","木"]
["京都府相楽郡和束町","京","木"]
["相楽郡和束町","京","木"]
["和束町","京","木"]
["京都府相楽郡南山城村","京","木"]
["相楽郡南山城村","京","木"]
["南山城村","京","木"]
["京都府亀岡市","京","亀"]
["亀岡市","京","亀"]
["京都府南丹市","京","園"]
["南丹市","京","園"]
["京都府船井郡京丹波町","京","園"]
["船井郡京丹波町","京","園"]
["京丹波町","京","園"]
["大阪府大阪市","大","大阪"]
["大阪市","大","大阪"]
["大阪府箕面市","大","箕面"]
["箕面市","大","箕面"]
["大阪府池田市","大","池田"]
["池田市","大","池田"]
["大阪府豊中市","大","豊中"]
["豊中市","大","豊中"]
["大阪府吹田市","大","吹田"]
["吹田市","大","吹田"]
["大阪府茨木市","大","茨木"]
["茨木市","大","茨木"]
["大阪府高槻市","大","高槻"]
["高槻市","大","高槻"]
["大阪府守口市","大","守口"]
["守口市","大","守口"]
["大阪府門真市","大","門真"]
["門真市","大","門真"]
["大阪府寝屋川市","大","寝屋"]
["寝屋川市","大","寝屋"]
["大阪府枚方市","大","枚方"]
["枚方市","大","枚方"]
["大阪府東大阪市","大","東大"]
["東大阪市","大","東大"]
["大阪府八尾市","大","八尾"]
["八尾市","大","八尾"]
["大阪府豊能郡能勢町","大","府"]
["豊能郡能勢町","大","府"]
["能勢町","大","府"]
["大阪府豊能郡豊能町","大","府"]
["豊能郡豊能町","大","府"]
["豊能町","大","府"]
["大阪府摂津市","大","府"]
["摂津市","大","府"]
["大阪府三島郡島本町","大","府"]
["三島郡島本町","大","府"]
["島本町","大","府"]
["大阪府交野市","大","府"]
["交野市","大","府"]
["大阪府四条畷市","大","府"]
["四条畷市","大","府"]
["大阪府大東市","大","府"]
["大東市","大","府"]
["奈良県奈良市","奈","奈良"]
["奈良市","奈","奈良"]
["奈良県生駒市","奈","生駒"]
["生駒市","奈","生駒"]
["奈良県橿原市","奈","橿原"]
["橿原市","奈","橿原"]
["奈良県天理市","奈","奈土"]
["天理市","奈","奈土"]
["奈良県大和郡山市","奈","郡山"]
["大和郡山市","奈","郡山"]
["奈良県生駒郡安堵町","奈","郡山"]
["生駒郡安堵町","奈","郡山"]
["安堵町","奈","郡山"]
["奈良県生駒郡平群町","奈","郡山"]
["生駒郡平群町","奈","郡山"]
["平群町","奈","郡山"]
["奈良県生駒郡三郷町","奈","郡山"]
["生駒郡三郷町","奈","郡山"]
["三郷町","奈","郡山"]
["奈良県生駒郡斑鳩町","奈","郡山"]
["生駒郡斑鳩町","奈","郡山"]
["斑鳩町","奈","郡山"]
["奈良県北葛城郡上牧町","奈","高田"]
["北葛城郡上牧町","奈","高田"]
["上牧町","奈","高田"]
["奈良県北葛城郡河合町","奈","高田"]
["北葛城郡河合町","奈","高田"]
["河合町","奈","高田"]
["奈良県北葛城郡王寺町","奈","高田"]
["北葛城郡王寺町","奈","高田"]
["王寺町","奈","高田"]
["奈良県大和高田市","奈","高田"]
["大和高田市","奈","高田"]
["奈良県香芝市","奈","高田"]
["香芝市","奈","高田"]
["奈良県北葛城郡広陵町","奈","高田"]
["北葛城郡広陵町","奈","高田"]
["広陵町","奈","高田"]
["奈良県御所市","奈","高田"]
["御所市","奈","高田"]
["奈良県葛城市","奈","高田"]
["葛城市","奈","高田"]
["奈良県桜井市","奈","桜井"]
["桜井市","奈","桜井"]
["奈良県磯城郡川西町","奈","桜井"]
["磯城郡川西町","奈","桜井"]
["川西町","奈","桜井"]
["奈良県磯城郡三宅町","奈","桜井"]
["磯城郡三宅町","奈","桜井"]
["三宅町","奈","桜井"]
["奈良県磯城郡田原本町","奈","桜井"]
["磯城郡田原本町","奈","桜井"]
["田原本町","奈","桜井"]
["奈良県高市郡高取町","奈","桜井"]
["高市郡高取町","奈","桜井"]
["高取町","奈","桜井"]
["奈良県高市郡明日香村","奈","桜井"]
["高市郡明日香村","奈","桜井"]
["明日香村","奈","桜井"]

{"sheet":"確認台帳一覧(データ取込用)","index":46,"n_rows":55,"n_cols":219,"rows_kept":55}
["受付番号","受付年月日","確認番号","確認日付","確認機関","ﾌﾘｶﾞﾅ","建築主","郵便番号","建築主住所","建築主電話番号","代理者資格","代理者登録機関","代理者建築士番号","代理者氏名","代理者事務所資格","代理者事務所登録機関","代理者事務所番号","代理者事務所名","代理者郵便番号","代理者所在地","代理者電話番号","設計者資格","設計者登録機関","設計者建築士番号","設計者氏名","設計者事務所資格","設計者事務所登録機関","設計者事務所番号","設計者事務所名","設計者郵便番号","設計者所在地","設計者電話番号","建築設備氏名","建築設備勤務先","建築設備郵便番号","建築設備所在地","建築設備電話番号","監理者資格","監理者登録機関","監理者建築士番号","監理者氏名","監理者事務所資格","監理者事務所登録機関","監理者事務所番号","監理者事務所名","監理者郵便番号","監理者所在地","監理者電話番号","施工者氏名","施工者許可機関","施工者番号","施工者営業所","施工者郵便番号","施工者所在地","施工者電話番号","備考1面","建築物名フリガナ","建築物名","申請者フリガナ","申請者名","地名地番","住居表示","都市計画","市街化","調整区域","未設定","防火地域","準防火地域","指定なし","その他区域","道路幅員","接道長さ","敷地面積A1","敷地面積A2","用途地域A","用途地域ACode","指定容積率A","指定建ぺい率Ａ","敷地面積B1","敷地面積B2","用途地域B","用途地域BCode","指定容積率Ｂ","指定建ぺい率B","敷地面積合計1","敷地面積合計2","容積率上限","建ぺい率上限","敷地面積備考","主要用途Code","主要用途","工事種別1","工事種別2","建築面積申請","建築面積申請外","建築面積合計","実質建ぺい率","建築物全体申請","建築物全体申請外","建築物全体合計","地階申請","地階申請外","地階合計","共用廊下申請","共用廊下申請外","共用廊下合計","車庫申請","車庫申請外","車庫合計","住宅申請","住宅申請外","住宅合計","延べ面積","実質容積率","申請建築物の数","申請外建築物の数","申請高さ","申請地上階数","申請地下階数","申請外高さ","申請外地上階数","申請外地下階数","構造Code1","構造1","構造Code2","構造2","許可認定等","工事着手","工事完了","指定工程回数1","指定工程日程1","特定工程1","指定工程回数2","指定工程日程2","特定工程2","指定工程回数3","指定工程日程3","特定工程3","その他","備考2面","建築主フリガナ2","建築主氏名2","建築主郵便番号2","建築主住所2","建築主電話番号2","建築主フリガナ3","建築主氏名3","建築主郵便番号3","建築主住所3","建築主電話番号3","消防提出日","確認済み届出日付","確認検査員","種別","用途","積載重量","最大定員","定格速度","高さ","長さ","個数","号","木３","工業化","特建","公庫","旧確認番号","新確認番号","パト結果","受付場所","通し番号","更新日付","メモ","法第3条第2項規定関係","浄化槽","確認申請手数料","工事届報告日","浄化槽報告日","行政仮受番号","行政仮受日","56条の7特例有無","56条の7特例区分","適用除外規定","既存不適格適用日","既存不適格適用理由","既存不適格備考","確認契約日","備蓄倉庫申請","備蓄倉庫申請外","備蓄倉庫合計","自家発電設備申請","自家発電設備申請外","自家発電設備合計","蓄電池申請","蓄電池申請外","蓄電池合計","貯水槽申請","貯水槽申請外","貯水槽合計","EV昇降路申請","EV昇降路申請外","EV昇降路合計","適判申請済チェック","適判申請済判定機関名","適判未申請チェック","適判未申請判定機関名","適判申請不要チェック","老人ホーム申請","老人ホーム申請外","老人ホーム合計","省エネ適判申請済チェック","省エネ適判申請済判定機関名","省エネ適判未申請チェック","省エネ適判未申請判定機関名","省エネ適判申請不要チェック","省エネ適判申請不要理由","宅配ボックス申請","宅配ボックス申請外","宅配ボックス合計"]
[{"$nulls":5},{"$f":"申二面!J6","v":0},{"$f":"申二面!J7","v":0},{"$f":"REPLACE(申二面!K8,4,1,\"\")","v":""},{"$f":"申二面!J9","v":0},{"$f":"申二面!J10","v":0},{"$f":"申二面!K14","v":0},{"$f":"申二面!T14","v":0},{"$f":"申二面!AB14","v":0},{"$f":"申二面!J15","v":0},{"$f":"申二面!K16","v":0},{"$f":"申二面!T16","v":0},{"$f":"申二面!AB16","v":0},{"$f":"申二面!J17","v":0},{"$f":"申二面!K18","v":0},{"$f":"申二面!J19","v":0},{"$f":"申二面!J20","v":0},"","","","","","","","","","","","","","","","","","","","","","","","","","","",{"$f":"申二面!H164","v":0},{"$f":"申二面!N165","v":0},{"$f":"申二面!T165","v":0},{"$f":"申二面!H166","v":0},{"$f":"申二面!I167","v":0},{"$f":"申二面!H168","v":0},{"$f":"申二面!H169","v":0},{"$f":"申二面!E184","v":0},{"$f":"申二面!E185","v":0},{"$f":"申二面!E186","v":0},"","",{"$f":"申三面!G3","v":0},{"$f":"申二面!G4","v":0},{"$f":"IF(申三面!B6=\"■\",\"都市計画区域内\",IF(申三面!B7=\"■\",\"準都市計画区域内\",IF(申三面!J7=\"■\",\"都市計画区域及び準都市計画区域外\",\"\")))","v":""},{"$f":"申三面!J6","v":"□"},{"$f":"申三面!P6","v":"□"},{"$f":"申三面!X6","v":"□"},{"$f":"申三面!H8","v":"□"},{"$f":"申三面!M8","v":"□"},{"$f":"申三面!S8","v":"□"},{"$f":"IF(申三面!X8=\"■\",申三面!O9&申三面!B10&\"法22条区域\",申三面!O9&申三面!B10)","v":""},{"$f":"申三面!P12","v":0},{"$f":"申三面!P13","v":0},{"$f":"申三面!J15","v":0},{"$f":"申三面!J16","v":0},{"$f":"申三面!J17","v":0},"",{"$f":"申三面!J19","v":0},{"$f":"申三面!J21","v":0},{"$f":"申三面!P15","v":0},{"$f":"申三面!P16","v":0},{"$f":"申三面!P17","v":0},"",{"$f":"申三面!P19","v":0},{"$f":"申三面!P21","v":0},{"$f":"申三面!M22","v":""},{"$f":"申三面!M23","v":""},{"$f":"申三面!X24","v":0},{"$f":"申三面!X25","v":0},{"$f":"申三面!F26","v":0},{"$f":"申三面!J27","v":0},{"$f":"申三面!N27","v":0},{"$f":"CJ7&CK7&CL7&CM7","v":""},{"$f":"CN7&CO7&CP7","v":""},{"$f":"申三面!M31","v":0},{"$f":"申三面!T31","v":0},{"$f":"申三面!AA31","v":""},{"$f":"申三面!Q32","v":""},{"$f":"申三面!M34","v":0},{"$f":"申三面!T34","v":0},{"$f":"申三面!AA34","v":""},{"$f":"申三面!M36","v":0},{"$f":"申三面!T36","v":0},{"$f":"申三面!AA36","v":""},{"$f":"申三面!M40","v":0},{"$f":"申三面!T40","v":0},{"$f":"申三面!AA40","v":""},{"$f":"申三面!M41","v":0},{"$f":"申三面!T41","v":0},{"$f":"申三面!AA41","v":""},{"$f":"申三面!M48","v":0},{"$f":"申三面!T48","v":0},{"$f":"申三面!AA48","v":""},{"$f":"申三面!R51","v":0},{"$f":"申三面!R52","v":""},{"$f":"申三面!P54","v":0},{"$f":"申三面!P55","v":0},{"$f":"申三面!L57","v":0},{"$f":"申三面!L58","v":0},{"$f":"申三面!L59","v":0},{"$f":"申三面!S57","v":0},{"$f":"申三面!S58","v":0},{"$f":"申三面!S59","v":0},{"$f":"申三面!I60","v":0},"",{"$f":"申三面!U60","v":0},"",{"$f":"申三面!C65&申三面!C66&申三面!C67&申三面!C68","v":""},{"$f":"IF(申三面!N69=\"\",\"\",TEXT(\"H\"&申三面!N69&\"/\"&申三面!Q69&\"/\"&申三面!T69,\"yyyy/mm/dd\"))","v":""},{"$f":"IF(申三面!N70=\"\",\"\",TEXT(\"H\"&申三面!N70&\"/\"&申三面!Q70&\"/\"&申三面!T70,\"yyyy/mm/dd\"))","v":""},{"$f":"申三面!E72","v":0},{"$f":"IF(申三面!J72=\"\",\"\",TEXT(\"H\"&申三面!J72&\"/\"&申三面!L72&\"/\"&申三面!N72,\"yyyy/mm/dd\"))","v":""},{"$f":"申三面!Q72","v":0},{"$f":"申三面!E73","v":0},{"$f":"IF(申三面!J73=\"\",\"\",TEXT(\"H\"&申三面!J73&\"/\"&申三面!L73&\"/\"&申三面!N73,\"yyyy/mm/dd\"))","v":""},{"$f":"申三面!Q73","v":0},{"$f":"申三面!E74","v":0},{"$f":"IF(申三面!J74=\"\",\"\",TEXT(\"H\"&申三面!J74&\"/\"&申三面!L74&\"/\"&申三面!N74,\"yyyy/mm/dd\"))","v":""},{"$f":"申三面!Q74","v":0},{"$f":"申三面!C76&申三面!C77&申三面!C78","v":""},{"$f":"申三面!C80&申三面!C81&申三面!C82&申三面!C83","v":""},{"$f":"別紙追加様式!J5","v":0},{"$f":"別紙追加様式!J6","v":0},{"$f":"別紙追加様式!K7","v":0},{"$f":"別紙追加様式!J8","v":0},{"$f":"別紙追加様式!J9","v":0},{"$f":"別紙追加様式!J66","v":""},{"$f":"別紙追加様式!J67","v":""},{"$f":"別紙追加様式!K68","v":""},{"$f":"別紙追加様式!J69","v":""},"","",null,null,"","","","","","","",null,null,"","","","","","",{"$f":"IF(ISERROR(FIND(\"滋\",A3)),IF(ISERROR(FIND(\"京\",A3)),IF(ISERROR(FIND(\"大\",A3)),29,27),26),25)","v":29},"大津",{"$f":"IF(FM2=25,RIGHT(A6,3)&\"1\"&B55,IF(FM2=26,RIGHT(A6,3)&\"2\"&B55,IF(FM2=27,RIGHT(A6,3)&\"3\"&B55,RIGHT(A6,3)&\"4\"&B55)))","v":{"$error":"#N/A"}},null,null,"","",{"$nulls":3},"",null,{"$f":"申三面!W61","v":"□"},{"$f":"GA8","v":""},"","","","",null,{"$f":"申三面!M42","v":0},{"$f":"申三面!T42","v":0},{"$f":"申三面!AA42","v":""},{"$f":"申三面!M45","v":0},{"$f":"申三面!T45","v":0},{"$f":"申三面!AA45","v":""},{"$f":"申三面!M43","v":0},{"$f":"申三面!T43","v":0},{"$f":"申三面!AA43","v":""},{"$f":"申三面!M46","v":0},{"$f":"申三面!T46","v":0},{"$f":"申三面!AA46","v":""},{"$f":"申三面!M38","v":0},{"$f":"申三面!T38","v":0},{"$f":"申三面!AA38","v":""},{"$f":"申二面!D173","v":"□"},{"$f":"申二面!I173","v":0},{"$f":"申二面!D174","v":"□"},{"$f":"申二面!I174","v":0},{"$f":"申二面!D175","v":"□"},{"$f":"申三面!M50","v":0},{"$f":"申三面!T50","v":0},{"$f":"申三面!AA50","v":""},{"$f":"申二面!D179","v":"□"},{"$f":"申二面!I179","v":0},{"$f":"申二面!D180","v":"□"},{"$f":"申二面!I180","v":0},{"$f":"申二面!D181","v":"□"},{"$f":"申二面!I181","v":0},{"$f":"申三面!M47","v":0},{"$f":"申三面!T47","v":0},{"$f":"申三面!AA47","v":""}]
[{"$f":"A55&B55","v":{"$error":"#N/A"}},{"$f":"TODAY()","v":"2019-06-03"},{"$f":"REPLACE(A3,6,1,\"認\")","v":{"$error":"#N/A"}},null,"株式会社　確認検査機構アネックス　代表取締役　稲垣雄一",{"$f":"IF(ISERROR(F2),\"\",IF(OR(F2=0,F2=\"\"),\"\",IF(ISNUMBER(F2),F2,ASC(TRIM(F2)))))","v":""},{"$f":"IF(ISERROR(G2),\"\",IF(OR(G2=0,G2=\"\"),\"\",IF(ISNUMBER(G2),G2,ASC(TRIM(G2)))))","v":""},{"$f":"IF(ISERROR(H2),\"\",IF(OR(H2=0,H2=\"\"),\"\",IF(ISNUMBER(H2),H2,ASC(TRIM(H2)))))","v":""},"","","","","","","","","","","","","","","","","","","","","","","","","","","","","","","","","","","","","","","","","","","","","","","","","","","","","","","",{"$f":"IF(ISERROR(BL2),\"\",IF(OR(BL2=0,BL2=\"\"),\"\",IF(BL2=\"■\",-1,0)))","v":0},0,0,0,0,0,{"$f":"IF(ISERROR(BR2),\"\",IF(OR(BR2=0,BR2=\"\"),\"\",IF(ISNUMBER(BR2),BR2,ASC(TRIM(BR2)))))","v":""},{"$f":"IF(ISERROR(BS2),\"\",IF(OR(BS2=0,BS2=\"\"),\"\",IF(ISNUMBER(BS2),BS2,ASC(TRIM(BS2)))))","v":""},{"$f":"IF(ISERROR(BT2),\"\",IF(OR(BT2=0,BT2=\"\"),\"\",IF(ISNUMBER(BT2),BT2,ASC(TRIM(BT2)))))","v":""},"","","","","","","","","","","","","","","","","","","","","","","","","","","","","","","","","","","","","","","","","","","","","","","","","","","","","","","","","","","","","","",{"$f":"IF(ISERROR(EE2),\"\",IF(OR(EE2=0,EE2=\"\"),\"\",IF(ISNUMBER(EE2),EE2,ASC(TRIM(EE2)))))","v":""},{"$f":"IF(ISERROR(EF2),\"\",IF(OR(EF2=0,EF2=\"\"),\"\",IF(ISNUMBER(EF2),EF2,ASC(TRIM(EF2)))))","v":""},"","","","","","","","","","","","","","","","","","","","","","","","","","","","","","","","",29,"大津",{"$f":"C6","v":""},"","","","","","","","","",{"$f":"IF(ISERROR(FY2),\"\",IF(OR(FY2=0,FY2=\"\"),\"\",IF(FY2=\"■\",-1,0)))","v":0},{"$f":"IF(ISERROR(FZ2),\"\",IF(OR(FZ2=0,FZ2=\"\"),\"\",IF(ISNUMBER(FZ2),FZ2,ASC(TRIM(FZ2)))))","v":""},{"$f":"IF(ISERROR(GA2),\"\",IF(OR(GA2=0,GA2=\"\"),\"\",IF(ISNUMBER(GA2),GA2,ASC(TRIM(GA2)))))","v":""},"","","","","","","","","","","","","","","",{"$f":"IF(ISERROR(GQ2),\"\",IF(OR(GQ2=0,GQ2=\"\"),\"\",IF(ISNUMBER(GQ2),GQ2,ASC(TRIM(GQ2)))))","v":""},{"$f":"IF(ISERROR(GR2),\"\",IF(OR(GR2=0,GR2=\"\"),\"\",IF(ISNUMBER(GR2),GR2,ASC(TRIM(GR2)))))","v":""},{"$f":"IF(ISERROR(GS2),\"\",IF(OR(GS2=0,GS2=\"\"),\"\",IF(ISNUMBER(GS2),GS2,ASC(TRIM(GS2)))))","v":""},{"$f":"IF(ISERROR(GT2),\"\",IF(OR(GT2=0,GT2=\"\"),\"\",IF(ISNUMBER(GT2),GT2,ASC(TRIM(GT2)))))","v":""},{"$f":"IF(ISERROR(GU2),\"\",IF(OR(GU2=0,GU2=\"\"),\"\",IF(GU2=\"■\",-1,0)))","v":0},{"$f":"IF(ISERROR(GV2),\"\",IF(OR(GV2=0,GV2=\"\"),\"\",IF(ISNUMBER(GV2),GV2,ASC(TRIM(GV2)))))","v":""},{"$f":"IF(ISERROR(GW2),\"\",IF(OR(GW2=0,GW2=\"\"),\"\",IF(GW2=\"■\",-1,0)))","v":0},{"$f":"IF(ISERROR(GX2),\"\",IF(OR(GX2=0,GX2=\"\"),\"\",IF(ISNUMBER(GX2),GX2,ASC(TRIM(GX2)))))","v":""},{"$f":"IF(ISERROR(GY2),\"\",IF(OR(GY2=0,GY2=\"\"),\"\",IF(GY2=\"■\",-1,0)))","v":0},{"$f":"IF(ISERROR(GZ2),\"\",IF(OR(GZ2=0,GZ2=\"\"),\"\",IF(ISNUMBER(GZ2),GZ2,ASC(TRIM(GZ2)))))","v":""},{"$f":"IF(ISERROR(HA2),\"\",IF(OR(HA2=0,HA2=\"\"),\"\",IF(ISNUMBER(HA2),HA2,ASC(TRIM(HA2)))))","v":""},{"$f":"IF(ISERROR(HB2),\"\",IF(OR(HB2=0,HB2=\"\"),\"\",IF(ISNUMBER(HB2),HB2,ASC(TRIM(HB2)))))","v":""},{"$f":"IF(ISERROR(HC2),\"\",IF(OR(HC2=0,HC2=\"\"),\"\",IF(HC2=\"■\",-1,0)))","v":0},{"$f":"IF(ISERROR(HD2),\"\",IF(OR(HD2=0,HD2=\"\"),\"\",IF(ISNUMBER(HD2),HD2,ASC(TRIM(HD2)))))","v":""},{"$f":"IF(ISERROR(HE2),\"\",IF(OR(HE2=0,HE2=\"\"),\"\",IF(HE2=\"■\",-1,0)))","v":0},{"$f":"IF(ISERROR(HF2),\"\",IF(OR(HF2=0,HF2=\"\"),\"\",IF(ISNUMBER(HF2),HF2,ASC(TRIM(HF2)))))","v":""},{"$f":"IF(ISERROR(HG2),\"\",IF(OR(HG2=0,HG2=\"\"),\"\",IF(HG2=\"■\",-1,0)))","v":0},{"$f":"IF(ISERROR(HH2),\"\",IF(OR(HH2=0,HH2=\"\"),\"\",IF(ISNUMBER(HH2),HH2,ASC(TRIM(HH2)))))","v":""},{"$f":"IF(ISERROR(HI2),\"\",IF(OR(HI2=0,HI2=\"\"),\"\",IF(ISNUMBER(HI2),HI2,ASC(TRIM(HI2)))))","v":""},{"$f":"IF(ISERROR(HJ2),\"\",IF(OR(HJ2=0,HJ2=\"\"),\"\",IF(ISNUMBER(HJ2),HJ2,ASC(TRIM(HJ2)))))","v":""},{"$f":"IF(ISERROR(HK2),\"\",IF(OR(HK2=0,HK2=\"\"),\"\",IF(ISNUMBER(HK2),HK2,ASC(TRIM(HK2)))))","v":""}]
[{"$nulls":127},{"$f":"IF(申三面!L69=\"平成\",\"H\",\"R\")","v":"R"},{"$f":"IF(申三面!L70=\"平成\",\"H\",\"R\")","v":"R"},null,{"$f":"IF(申三面!H72=\"平成\",\"H\",\"R\")","v":"R"},null,null,{"$f":"IF(申三面!H73=\"平成\",\"H\",\"R\")","v":"R"},null,null,{"$f":"IF(申三面!H74=\"平成\",\"H\",\"R\")","v":"R"}]
["※このシートはアネックス処理用です。さわらないで下さい。(anex20181001)",{"$nulls":86},"新築","増築","改築","移転","用途変更","大規模の修繕","大規模の模様替",{"$nulls":33},{"$f":"IF(ISERROR(SEARCH(\"元\",申三面!N69))=TRUE,申三面!N69,1)","v":0},{"$f":"IF(ISERROR(SEARCH(\"元\",申三面!N70))=TRUE,申三面!N70,1)","v":0},null,{"$f":"IF(ISERROR(SEARCH(\"元\",申三面!J72))=TRUE,申三面!J72,1)","v":0},null,null,{"$f":"IF(ISERROR(SEARCH(\"元\",申三面!J73))=TRUE,申三面!J73,1)","v":0},null,null,{"$f":"IF(ISERROR(SEARCH(\"元\",申三面!J74))=TRUE,申三面!J74,1)","v":0}]
["2019",null,{"$f":"IF(ISERROR(FO2),\"\",IF(OR(FO2=0,FO2=\"\"),\"\",IF(ISNUMBER(FO2),FO2,VALUE(ASC(TRIM(FO2))))))","v":""},{"$nulls":84},{"$f":"申三面!B29","v":"□"},{"$f":"申三面!E29","v":"□"},{"$f":"申三面!H29","v":"□"},{"$f":"申三面!K29","v":"□"},{"$f":"申三面!N29","v":"□"},{"$f":"申三面!S29","v":"□"},{"$f":"申三面!Y29","v":"□"},{"$nulls":85},"道路高さ制限不適用","隣地高さ制限不適用","北側高さ制限不適用"]
[{"$f":"$A$6&\"確申建機構ア滋大津\"","v":"2019確申建機構ア滋大津"},{"$nulls":86},{"$f":"IF(CJ6=\"■\",\"新築\",\"\")","v":""},{"$f":"IF(CK6=\"■\",\"増築\",\"\")","v":""},{"$f":"IF(CL6=\"■\",\"改築\",\"\")","v":""},{"$f":"IF(CM6=\"■\",\"移転\",\"\")","v":""},{"$f":"IF(CN6=\"■\",\"用途変更\",\"\")","v":""},{"$f":"IF(CO6=\"■\",\"大規模の修繕\",\"\")","v":""},{"$f":"IF(CP6=\"■\",\"大規模の模様替\",\"\")","v":""},{"$nulls":85},{"$f":"申三面!D63","v":"□"},{"$f":"申三面!M63","v":"□"},{"$f":"申三面!V63","v":"□"}]
[{"$f":"$A$6&\"確申建機構ア滋草津\"","v":"2019確申建機構ア滋草津"},{"$nulls":178},{"$f":"IF(FX7=\"■\",FX6,\"\")","v":""},{"$f":"IF(FY7=\"■\",FY6,\"\")","v":""},{"$f":"IF(FZ7=\"■\",FZ6,\"\")","v":""},{"$f":"FX8&FY8&FZ8","v":""}]
[{"$f":"$A$6&\"確申建機構ア滋守山\"","v":"2019確申建機構ア滋守山"}]
[{"$f":"$A$6&\"確申建機構ア滋近江\"","v":"2019確申建機構ア滋近江"}]
[{"$f":"$A$6&\"確申建機構ア滋彦根\"","v":"2019確申建機構ア滋彦根"}]
[{"$f":"$A$6&\"確申建機構ア滋八日\"","v":"2019確申建機構ア滋八日"}]
[{"$f":"$A$6&\"確申建機構ア滋長浜\"","v":"2019確申建機構ア滋長浜"}]
[{"$f":"$A$6&\"確申建機構ア滋湖南\"","v":"2019確申建機構ア滋湖南"}]
[{"$f":"$A$6&\"確申建機構ア滋湖西\"","v":"2019確申建機構ア滋湖西"}]
[{"$f":"$A$6&\"確申建機構ア滋東近\"","v":"2019確申建機構ア滋東近"}]
[{"$f":"$A$6&\"確申建機構ア滋湖東\"","v":"2019確申建機構ア滋湖東"}]
[{"$f":"$A$6&\"確申建機構ア滋甲賀\"","v":"2019確申建機構ア滋甲賀"}]
[{"$f":"$A$6&\"確申建機構ア滋湖北\"","v":"2019確申建機構ア滋湖北"}]
[]
[{"$f":"$A$6&\"確申建機構ア京市\"","v":"2019確申建機構ア京市"}]
[{"$f":"$A$6&\"確申建機構ア京府\"","v":"2019確申建機構ア京府"}]
[{"$f":"$A$6&\"確申建機構ア京宇\"","v":"2019確申建機構ア京宇"}]
[{"$f":"$A$6&\"確申建機構ア京乙\"","v":"2019確申建機構ア京乙"}]
[{"$f":"$A$6&\"確申建機構ア京田\"","v":"2019確申建機構ア京田"}]
[{"$f":"$A$6&\"確申建機構ア京木\"","v":"2019確申建機構ア京木"}]
[{"$f":"$A$6&\"確申建機構ア京園\"","v":"2019確申建機構ア京園"}]
[{"$f":"$A$6&\"確申建機構ア京亀\"","v":"2019確申建機構ア京亀"}]
[]
[{"$f":"$A$6&\"確申建機構ア大大阪\"","v":"2019確申建機構ア大大阪"}]
[{"$f":"$A$6&\"確申建機構ア大枚方\"","v":"2019確申建機構ア大枚方"}]
[{"$f":"$A$6&\"確申建機構ア大茨木\"","v":"2019確申建機構ア大茨木"}]
[{"$f":"$A$6&\"確申建機構ア大高槻\"","v":"2019確申建機構ア大高槻"}]
[{"$f":"$A$6&\"確申建機構ア大門真\"","v":"2019確申建機構ア大門真"}]
[{"$f":"$A$6&\"確申建機構ア大箕面\"","v":"2019確申建機構ア大箕面"}]
[{"$f":"$A$6&\"確申建機構ア大八尾\"","v":"2019確申建機構ア大八尾"}]
[{"$f":"$A$6&\"確申建機構ア大東大\"","v":"2019確申建機構ア大東大"}]
[{"$f":"$A$6&\"確申建機構ア大池田\"","v":"2019確申建機構ア大池田"}]
[{"$f":"$A$6&\"確申建機構ア大寝屋\"","v":"2019確申建機構ア大寝屋"}]
[{"$f":"$A$6&\"確申建機構ア大守口\"","v":"2019確申建機構ア大守口"}]
[{"$f":"$A$6&\"確申建機構ア大豊中\"","v":"2019確申建機構ア大豊中"}]
[{"$f":"$A$6&\"確申建機構ア大吹田\"","v":"2019確申建機構ア大吹田"}]
[{"$f":"$A$6&\"確申建機構ア大府\"","v":"2019確申建機構ア大府"}]
[]
[{"$f":"$A$6&\"確申建機構ア奈奈良\"","v":"2019確申建機構ア奈奈良"}]
[{"$f":"$A$6&\"確申建機構ア奈奈土\"","v":"2019確申建機構ア奈奈土"}]
[{"$f":"$A$6&\"確申建機構ア奈桜井\"","v":"2019確申建機構ア奈桜井"}]
[{"$f":"$A$6&\"確申建機構ア奈橿原\"","v":"2019確申建機構ア奈橿原"}]
[{"$f":"$A$6&\"確申建機構ア奈高田\"","v":"2019確申建機構ア奈高田"}]
[{"$f":"$A$6&\"確申建機構ア奈郡山\"","v":"2019確申建機構ア奈郡山"}]
[{"$f":"$A$6&\"確申建機構ア奈生駒\"","v":"2019確申建機構ア奈生駒"}]
[]
[]
[]
[{"$f":"INDEX(A7:A54,MATCH(\"?*\",B7:B54,0),1)","v":{"$error":"#N/A"}},{"$f":"DBCS(INDEX(B7:B54,MATCH(\"?*\",B7:B54,0),1))","v":{"$error":"#N/A"}}]

{"sheet":"Sheet1","index":47,"n_rows":23,"n_cols":2,"rows_kept":23}
["変更点"]
[1,"法22条区域の位置修正"]
[2,"受付用シートのTEL部分不具合修正"]
[3,"工事監理者　その他の工事監理者　設計図書欄の入力規則　不具合修正"]
[4,"申プロ用の表紙作成"]
[5,"京都市事前調査報告書"]
[6,"非線引きの長浜市対象面積変更"]
[7,"工事監理者チェックシート　敷地内通路記載変更"]
[8,"平成と次期元号の入力切替"]
[9,"田園住居地域追加"]
[10,"概要書にアネックス印添付"]
[11]
[12]
[13]
[14]
[null,"以下予定"]
[15]
[16]
[17]
[18]
[19]
[20]
[21]

{"sheet":"Sheet2","index":48,"n_rows":0,"n_cols":0,"rows_kept":0}