{"text_format":"3","workbook":"xlsx","n_sheets":49,"sheets":["目次","受理審査表","申一面","申二面","申三面","申四面","申五面","申六面","委任状","別紙追加様式","概一面","概二面","概三面","工事届","注意欄再掲（参照用）","追加記入欄","市町村コード","滋賀敷調表1・2","滋賀敷調表3","京市敷調1・2","京都基礎","軽微変更","計画変更一面","選定届","建築主等変更","中間一面","中間二面","中間三面","中間四面","中間ﾁｪｯｸA表","B表【基礎】","C1表【木造軸組】","C2表【2×4】","C3表【S・SRC】","C4表【RC・SRC】","C5表【PC】","C6表【組積造】","C7表【補強CB造】","C8表【丸太組】","完了一面","完了二面","完了三面","完了四面","完了ﾁｪｯｸ（12号）","完了ﾁｪｯｸ（3号）","受付用","確認台帳一覧(データ取込用)","Sheet1","Sheet2"],"not_rendered":{"macros":1,"defined_names":69,"comments":6},"read":"whole","date_system":"1900"}

{"sheet":"目次","index":0,"n_rows":37,"n_cols":16,"rows_kept":37,"merged":[[2,3,3,5],[2,14,2,16]]}
[{"$nulls":6},"目次",null,"入力したいシートのボタンを押してください"]
[]
[{"$nulls":3},"受理審査表も内容記載の上\n合わせて提出してください"]
[]
[{"$nulls":15},"令和"]
[]
[]
[]
[]
[]
[{"$nulls":7},"↓新書式"]
{"$rows_empty":24}
[{"$nulls":9},"株式会社確認検査機構アネックス　2025.04.01"]
[{"$nulls":9},"アネックス用"]

{"sheet":"受理審査表","index":1,"n_rows":127,"n_cols":61,"rows_kept":127,"merged":[[2,1,2,19],[2,20,2,24],[2,25,2,28],[2,29,2,30],[2,32,2,37],[2,38,2,42],[4,1,4,19],[4,20,4,24],[4,25,4,26],[4,27,4,33],[4,34,4,35],[4,36,4,42],[4,43,4,47],[4,48,4,54],[4,57,6,104],[5,1,5,6],[5,7,5,35],[5,36,5,38],[5,39,5,42],[5,43,5,45],[5,46,5,54],[6,1,6,6],[6,7,6,42],[6,43,6,45],[6,46,6,54],[7,1,7,6],[7,7,7,21],[7,22,7,24],[7,25,7,28],[7,29,7,30],[7,31,7,33],[7,34,7,42],[7,43,7,45],[7,46,7,54],[8,1,8,6],[8,7,8,21],[8,22,8,24],[8,25,8,28],[8,29,8,30],[8,31,8,33],[8,34,8,42],[8,43,8,45],[8,46,8,54],[9,1,9,6],[9,7,9,12],[9,13,9,15],[9,16,9,19],[9,20,9,22],[9,23,9,26],[9,27,9,29],[9,30,9,33],[9,34,9,36],[9,37,9,40],[9,41,9,43],[9,44,9,47],[9,48,9,50],[9,51,9,54],[11,1,11,54],[12,1,12,54],[14,1,14,3],[14,4,14,6],[14,7,14,18],[14,19,14,21],[14,22,14,24],[14,25,14,36],[14,37,14,39],[14,40,14,42],[14,43,14,54],[15,1,15,3],[15,4,15,6],[15,7,15,13],[15,14,15,15],[15,16,15,18],[15,19,15,21],[15,22,15,24],[15,25,15,36],[15,37,15,39],[15,40,15,42],[15,43,15,54],[15,57,17,104],[16,1,16,3],[16,4,16,6],[16,7,16,13],[16,14,16,15],[16,16,16,18],[16,19,16,21],[16,22,16,24],[16,25,16,36],[16,37,16,39],[16,40,16,42],[16,43,16,54],[17,1,17,3],[17,4,17,6],[17,7,17,18],[17,19,17,21],[17,22,17,24],[17,25,17,36],[17,37,17,39],[17,40,17,42],[17,43,17,54],[18,1,18,3],[18,4,18,6],[18,7,18,18],[18,19,18,21],[18,22,18,24],[18,25,18,36],[18,37,18,39],[18,40,18,42],[18,43,18,54],[19,1,19,3],[19,4,19,6],[19,7,19,18],[19,19,19,21],[19,22,19,24],[19,25,19,36],[19,37,19,39],[19,40,19,42],[19,43,19,54],[20,1,20,3],[20,4,20,6],[20,7,20,18],[20,19,20,21],[20,22,20,24],[20,25,20,36],[20,37,20,39],[20,40,20,42],[20,43,20,54],[21,1,21,3],[21,4,21,6],[21,7,21,18],[21,19,21,21],[21,22,21,24],[21,25,21,36],[21,37,21,39],[21,40,21,42],[21,43,21,54],[22,1,22,3],[22,4,22,6],[22,7,22,18],[22,19,22,21],[22,22,22,24],[22,25,22,36],[22,37,22,39],[22,40,22,42],[22,43,22,54],[23,1,23,3],[23,4,23,6],[23,7,23,18],[23,19,23,21],[23,22,23,24],[23,25,23,36],[23,37,23,39],[23,40,23,42],[23,43,23,54],[24,1,24,3],[24,4,24,6],[24,7,24,18],[24,19,24,21],[24,22,24,24],[24,25,24,36],[24,37,24,39],[24,40,24,42],[24,43,24,54],[25,1,25,3],[25,4,25,6],[25,7,25,18],[25,19,25,21],[25,22,25,24],[25,25,25,36],[25,37,25,39],[25,40,25,42],[25,43,25,54],[26,1,26,3],[26,4,26,6],[26,7,26,18],[26,19,26,21],[26,22,26,24],[26,25,26,36],[26,37,26,39],[26,40,26,42],[26,43,26,54],[27,1,27,3],[27,4,27,6],[27,7,27,18],[27,19,27,21],[27,22,27,24],[27,25,27,36],[27,37,27,39],[27,40,27,42],[27,43,27,54],[28,1,28,3],[28,4,28,6],[28,7,28,18],[28,19,28,21],[28,22,28,24],[28,25,28,36],[28,37,28,39],[28,40,28,42],[28,43,28,54],[29,1,29,3],[29,4,29,6],[29,7,29,18],[29,19,29,21],[29,22,29,24],[29,25,29,36],[29,37,29,39],[29,40,29,42],[29,43,29,54],[30,1,30,3],[30,4,30,6],[30,7,30,18],[30,19,30,21],[30,22,30,24],[30,25,30,36],[30,37,30,39],[30,40,30,42],[30,43,30,54],[31,1,31,3],[31,4,31,6],[31,7,31,18],[31,19,31,21],[31,22,31,24],[31,25,31,36],[31,37,31,39],[31,40,31,42],[31,43,31,54],[32,1,32,3],[32,4,32,6],[32,7,32,18],[32,19,32,21],[32,22,32,24],[32,25,32,36],[32,37,32,39],[32,40,32,42],[32,43,32,54],[33,1,33,3],[33,4,33,6],[33,7,33,18],[33,19,33,21],[33,22,33,24],[33,25,33,36],[33,37,33,39],[33,40,33,42],[33,43,33,54],[34,1,34,3],[34,4,34,6],[34,7,34,18],[34,19,34,21],[34,22,34,24],[34,25,34,36],[34,37,34,39],[34,40,34,42],[34,43,34,54],[35,1,35,3],[35,4,35,6],[35,7,35,18],[35,19,35,21],[35,22,35,24],[35,25,35,36],[35,37,35,39],[35,40,35,42],[35,43,35,54],[36,1,36,3],[36,4,36,6],[36,7,36,18],[36,19,36,21],[36,22,36,24],[36,25,36,36],[36,37,36,39],[36,40,36,42],[36,43,36,54],[37,1,37,3],[37,4,37,6],[37,7,37,18],[37,19,37,21],[37,22,37,24],[37,25,37,36],[37,37,37,39],[37,40,37,42],[37,43,37,54],[38,1,38,3],[38,4,38,6],[38,7,38,18],[38,19,38,21],[38,22,38,24],[38,25,38,36],[38,37,38,39],[38,40,38,42],[38,43,38,54],[38,61,38,71],[39,1,39,3],[39,4,39,6],[39,7,39,18],[39,19,39,21],[39,22,39,24],[39,25,39,36],[39,37,39,39],[39,40,39,42],[39,43,39,54],[39,57,41,104],[40,1,40,3],[40,4,40,6],[40,7,40,18],[40,19,40,21],[40,22,40,24],[40,25,40,36],[40,37,40,39],[40,40,40,42],[40,43,40,54],[41,1,41,3],[41,4,41,6],[41,7,41,18],[41,19,41,21],[41,22,41,24],[41,25,41,36],[41,37,41,39],[41,40,41,42],[41,43,41,54],[42,1,42,3],[49,2,49,4],[49,30,49,32],[50,2,50,4],[54,2,54,4],[58,2,58,4],[58,20,58,22],[62,2,62,4],[62,20,62,22],[66,2,66,4],[67,2,67,4],[68,2,68,4],[68,30,68,32],[72,2,72,4],[72,17,72,19],[72,34,72,36],[73,2,73,4],[73,17,73,19],[73,34,73,36],[77,2,77,4],[81,2,81,4],[85,2,85,4],[85,31,85,33],[88,38,89,42],[88,43,89,54],[89,2,89,4],[93,2,93,4],[93,20,93,22],[93,37,93,39],[97,2,97,4],[97,30,97,32],[100,38,101,42],[100,43,101,54],[101,2,101,4],[105,2,105,4],[106,2,106,4],[110,2,110,4],[110,30,110,32],[111,2,111,4],[112,2,112,4],[114,1,114,26],[114,27,114,40],[114,41,114,54],[115,1,116,26],[115,27,116,40],[115,41,116,54]]}
[{"$nulls":59},"シートの保護を解除すると編集が可能になります（パスワードなし）"]
[]
[null,"受　　理　　審　　査　　表　",{"$nulls":18},"管理番号",{"$nulls":8},"S",null,"-",{"$nulls":6},"受付日",{"$nulls":4},"R          .          .        "]
[]
[null,"回　答　ご　連　絡　先",{"$nulls":18},"回答方法",{"$nulls":4},"□",null,"FAX",{"$nulls":6},"□",null,"MAIL",{"$nulls":6},"受付\n担当者",{"$nulls":13},"※　赤線で囲まれた青色着色部分にチェック および 提出図書をご記入ください。\n（図書名に記載のないものについて添付される際は、青色着色空欄部分をご利用ください。）\n※　申請書にご連絡が表示されない場合は、（申請書記載以外の場合）欄にご記入ください。\n"]
[null,"申請者",{"$nulls":5},{"$f":"IF(申二面!J7=\"\",\"\",申二面!J7)","v":""},{"$nulls":28},"工事\n種別",null,null,{"$f":"IF(申三面!B31=\"■\",\"新築\",IF(申三面!E31=\"■\",\"増築\",IF(申三面!H31=\"■\",\"改築\",IF(申三面!K31=\"■\",\"移転\",IF(申三面!N31=\"■\",\"用途変更\",IF(申三面!S31=\"■\",\"大規模の修繕\",IF(申三面!Y31=\"■\",\"大規模の模様替\",\"\")))))))","v":""},{"$nulls":3},"主要\n用途",null,null,{"$f":"IF(申三面!N29=\"\",\"\",申三面!N29)","v":""}]
[null,"申請地",{"$nulls":5},{"$f":"IF(申三面!G3=\"\",\"\",申三面!G3)","v":""},{"$nulls":35},"主たる\n構造",null,null,{"$f":"IF(申三面!I64=\"\",\"\",申三面!I64)","v":""}]
[null,"代理者\n事務所名",{"$nulls":5},{"$f":"IF(申二面!J17=\"\",\"\",申二面!J17)","v":""},{"$nulls":14},"担当",null,null,"",{"$nulls":3},"様",null,"TEL\nHP",{"$nulls":11},"FAX\nMAIL"]
[null,"申請書記載\n以外の連絡先",{"$nulls":20},"担当",{"$nulls":6},"様",null,"TEL\nHP",{"$nulls":11},"FAX\nMAIL",{"$nulls":14},"←",null,"代理者以外の連絡先が必要な場合（必要ない場合は空欄）"]
[null,"備考",{"$nulls":11},"法6条\n第１項",{"$nulls":6},"特例\n令10条",null,null,{"$f":"IF(申四面!W56=\"\",\"-\",申四面!W56)","v":"-"},{"$nulls":3},"木造\n構造",{"$nulls":6},"構造\n適判",{"$nulls":6},"省エネ\n適判",{"$nulls":6},"住宅\n省エネ\n基準"]
[]
[null,"● 提出図書（アンダーラインは全てに必要な書類）     "]
[null,"※ 提出図書について　事前欄にチェックしてご提出ください。本申請チェック欄は本申請提出時のチェック用としてもご利用ください。"]
[]
[null,"事前",null,null,"本申請",null,null,"図　書　名",{"$nulls":11},"事前",null,null,"本申請",null,null,"図　書　名",{"$nulls":11},"事前",null,null,"本申請",null,null,"図　書　名"]
[null,"□",{"$nulls":5},"事前申請用　（",{"$nulls":8},"部）",null,null,"□",null,null,"□",null,null,"委任状",{"$nulls":11},"□",null,null,"□",null,null,"（京都府）\n基礎の構造関係チェックシート"]
[null,"□",{"$nulls":5},"構造計算書　（",{"$nulls":8},"部）",{"$nulls":5},"□",null,null,"制限業種確認書",{"$nulls":11},"□",null,null,"□",null,null,"（京都市）\n狭あい道路整備要綱　届出書"]
[null,"□",null,null,"□",null,null,"正本（確認申請書）",{"$nulls":11},"□",null,null,"□",null,null,"（滋賀）敷地調査報告書",{"$nulls":11},"□",null,null,"□",null,null,"（滋賀県）大津、近江八幡除く\n盛土規制法許可要否確認書"]
[null,"□",null,null,"□",null,null,"副本",{"$nulls":11},"□",null,null,"□",null,null,"（京都市）事前調査報告書",{"$nulls":11},"□",null,null,"□",null,null,"（大津市）盛土規制チェックシート\n（近江八幡市）許可不要確認書"]
[null,"□",null,null,"□",null,null,"消防用\n（大津市・京都市は不要）",{"$nulls":11},"□",null,null,"□",null,null,"（京都府）意見書、協議書",{"$nulls":11},"□",null,null,"□",null,null,"（大阪府）工事監理者届"]
[null,"□",null,null,"□",null,null,"建築計画概要書",{"$nulls":11},"□",null,null,"□",null,null,"（大阪）\n　調査報告書、経由印",{"$nulls":11},"□",null,null,"□",null,null,"（枚方・東大阪）申請カード"]
[null,"□",null,null,"□",null,null,"建築工事届",{"$nulls":11},"□",null,null,"□",null,null,"浄化槽設置調書",{"$nulls":11},"□",null,null,"□",null,null,"（奈良県）敷地断面図"]
[null,"□",null,null,"□",null,null,"構造適合判定通知書の写し",{"$nulls":11},"□",null,null,"□",null,null,"消防用設備設置計画書",{"$nulls":11},"□",null,null,"□"]
[null,"□",null,null,"□",null,null,"構造判定申請書・図書（副本）",{"$nulls":11},"□",null,null,"□",null,null,"構造計算安全証明書",{"$nulls":11},"□",null,null,"□"]
[null,"□",null,null,"□",null,null,"他機関\n省エネ判定通知書の写し",{"$nulls":11},"□",null,null,"□",{"$nulls":14},"□",null,null,"□"]
[null,"□",null,null,"□",null,null,"他機関\n省エネ判定申請書・図書（副本）",{"$nulls":11},"□",null,null,"□",null,null,"基準法関係規定証明等の写し",{"$nulls":11},"□",null,null,"□"]
[null,"□",null,null,"□",null,null,"付近見取図（記名必要）",{"$nulls":11},"□",null,null,"□",null,null,"構造特記仕様書・標準図",{"$nulls":11},"□",null,null,"□",null,null,"都計法の適合性が確認できる資料（許可・証明）"]
[null,"□",null,null,"□",null,null,"配置図",{"$nulls":11},"□",null,null,"□",null,null,"地盤調査報告書",{"$nulls":11},"□",null,null,"□",null,null,"盛土規制法に適合していることを証する書面"]
[null,"□",null,null,"□",null,null,"敷地面積・床面積求積図",{"$nulls":11},"□",null,null,"□",null,null,"基礎地盤説明書",{"$nulls":11},"□",null,null,"□",null,null,"既存不適格調書\n現況調査書"]
[null,"□",null,null,"□",null,null,"仕様表 （仕様規定で構造安全性を確認できる建築物に限る）",{"$nulls":11},"□",null,null,"□",null,null,"基礎伏図",{"$nulls":11},"□",null,null,"□",null,null,"工場・危険物調書"]
[null,"□",null,null,"□",null,null,"内/外部仕上表",{"$nulls":11},"□",null,null,"□",null,null,"各階伏図",{"$nulls":11},"□",null,null,"□",null,null,"天空率検討図書"]
[null,"□",null,null,"□",null,null,"耐火/準耐火リスト",{"$nulls":11},"□",null,null,"□",null,null,"小屋伏図",{"$nulls":11},"□",null,null,"□",null,null,"日影図・算定表"]
[null,"□",null,null,"□",null,null,"各階平面図",{"$nulls":11},"□",null,null,"□",null,null,"2面以上の軸組図",{"$nulls":11},"□",null,null,"□",null,null,"バリアフリー法適合建築物に係る確認図書"]
[null,"□",null,null,"□",null,null,"2面以上の立面図",{"$nulls":11},"□",null,null,"□",null,null,"構造詳細図",{"$nulls":11},"□",null,null,"□",null,null,"型式認定・認証写し"]
[null,"□",null,null,"□",null,null,"2面以上の断面図",{"$nulls":11},"□",null,null,"□",null,null,"使用構造材料一覧表",{"$nulls":11},"□",null,null,"□",null,null,"景観・狭あい等各種届出の写し"]
[null,"□",null,null,"□",null,null,"建具表",{"$nulls":11},"□",null,null,"□",null,null,"構造計算書",{"$nulls":11},"□",null,null,"□",null,null,"法53条の2第3項に係る報告書"]
[null,"□",null,null,"□",null,null,"構造詳細図（矩計図）",{"$nulls":11},"□",null,null,"□",null,null,"壁量計算・金物図",{"$nulls":11},"□",null,null,"□",null,null,"（京都府）がけ地調書"]
[null,"□",null,null,"□",null,null,"ALVS検討書",{"$nulls":11},"□",null,null,"□",{"$nulls":14},"□",null,null,"□",null,null,"連絡書（昇降機）"]
[null,"□",null,null,"□",null,null,"ｼｯｸﾊｳｽ 換気回数検討",{"$nulls":11},"□",null,null,"□",null,null,"省エネ仕様基準確認図書",{"$nulls":11},"□",null,null,"□",null,null,"屋外広告物許可写し（工作物）"]
[null,"□",null,null,"□",null,null,"ｼｯｸﾊｳｽ 居室の使用材料・天井裏等の措置",{"$nulls":11},"□",null,null,"□",null,null,"省エネ性能仕様表\n省エネ基準適否チェックリスト",{"$nulls":11},"□",null,null,"□",{"$nulls":16},"※　赤線で囲まれた青色着色部分にチェック および 提出図書をご記入ください。\n（図書名に記載のないものについて添付される際は、青色着色空欄部分をご利用ください。）\n※　申請書にご連絡が表示されない場合は、（申請書記載以外の場合）欄にご記入ください。\n"]
[null,"□",null,null,"□",null,null,"電気設備図",{"$nulls":11},"□",null,null,"□",null,null,"機器表（設備・省エネ）",{"$nulls":11},"□",null,null,"□"]
[null,"□",null,null,"□",null,null,"給排水衛生設備図",{"$nulls":11},"□",null,null,"□",null,null,"各種認定書写し",{"$nulls":11},"□",null,null,"□"]
[]
[null,"※　必要な図書の提出が無い場合、審査を中断することがありますのでご注意ください。"]
[]
[]
[null,"（本）受付時確認表",{"$nulls":55},"※　下記はチェック不要です（機関チェック欄）"]
[]
[null,null,"● 相互の整合性を確認"]
[null,null,"□",null,null,"正本及び副本の添付書類の整合性",{"$nulls":24},"□",null,null,"申請書第2面の記載と委任状との確認"]
[null,null,"□",null,null,"施行規則第1条の3、表1に掲げる図書の添付の有無"]
[]
[]
[null,null,"● 設計者及び監理者の業務範囲を確認"]
[null,null,"□",null,null,"設計者及び監理者の資格に応じた業務範囲の確認"]
[]
[]
[null,null,"● 設計者の業務範囲を確認　（構造設計一級建築士）"]
[null,null,"□",null,null,"自ら設計を行ったもの",{"$nulls":14},"□",null,null,"法適合確認を行ったもの"]
[]
[]
[null,null,"● 設計者の業務範囲を確認　（設備設計一級建築士）"]
[null,null,"□",null,null,"自ら設計を行ったもの",{"$nulls":14},"□",null,null,"法適合確認を行ったもの"]
[]
[]
[null,null,"● 設計者及び監理者の資格を確認　"]
[null,null,"□",null,null,"設計者の建築士免許証のデータベースでの確認 （申請書に記載されている全ての設計者）"]
[null,null,"□",null,null,"監理者の建築士免許証のデータベースでの確認 （申請書に記載されている全ての監理者）"]
[null,null,"□",null,null,"構造設計一級建築士免許証のデータベースでの確認",{"$nulls":24},"□",null,null,"設備設計一級建築士免許証のデータベースでの確認"]
[]
[]
[null,null,"● 設計者氏名の記入を確認"]
[null,null,"□",null,null,"申請書第1面",{"$nulls":11},"□",null,null,"計算書の表紙",{"$nulls":13},"□",{"$nulls":3},"構造関係規定　（構造設計一級建築士）"]
[null,null,"□",null,null,"設計図書",{"$nulls":28},"□",{"$nulls":3},"設備関係規定　（設備設計一級建築士）"]
[]
[]
[null,null,"● 認定型式・認証型式部材・法38条認定等を有する建築物"]
[null,null,"□",null,null,"認定型式、認証型式部材、構造認定、法38条の規定に係る認定書等の写しの添付の確認"]
[]
[]
[null,null,"● 構造計算によって建築物の安全性を確かめた旨の証明書　（構造設計一級建築士が関与しない物件のみ）"]
[null,null,"□",null,null,"証明書の写し"]
[]
[]
[null,null,"● 構造計算適合判定及び構造計算ルート２の有無を確認"]
[null,null,"□",null,null,"「証明書の写し」により確認（構造一級が関与しない物件）",{"$nulls":25},"□",null,null,"構造計算書により確認（構造一級が関与する物件）"]
[]
[]
[null,null,"● 構造適合判定通知書等との整合性を確認",{"$nulls":35},"構造適判\nﾁｪｯｸ終了日",{"$nulls":4},"　　　年　　　月　　　日"]
[null,null,"□",null,null,"確認申請書・図書と適合判定通知書・判定申請書・図書の記載事項の整合性確認"]
[]
[]
[null,null,"● 省エネ適合判定の義務対象の有無を確認（住宅）"]
[null,null,"□",null,null,"住宅仕様基準により適合を確認",{"$nulls":14},"□",null,null,"性能評価書等により適合を確認",{"$nulls":13},"□",null,null,"性能基準（省エネ適合性判定対象）"]
[]
[]
[null,null,"● 省エネ適合判定の義務対象の有無を確認（非住宅）"]
[null,null,"□",null,null,"設計図書により確認　（用途及び面積）",{"$nulls":24},"□",null,null," 施工日に係る適用の対象であることの確認"]
[]
[]
[null,null,"● 省エネ適合判定を受けた建築物の計画との整合性を確認",{"$nulls":35},"省エネ適判ﾁｪｯｸ終了日",{"$nulls":4},"　　　年　　　月　　　日"]
[null,null,"□",null,null,"確認申請書・図書と適合判定通知書・判定申請書・図書等の記載事項の整合性確認"]
[]
[]
[null,null,"● 施行規則第1条の3第10項の適用を受ける場合（既存建築物（現行法適合）にEXP.Jを介して増築する場合）"]
[null,null,"□",null,null,"EXP.J等で接する計画のうち増築又は改築に係る部分以外の検査済証の写し"]
[null,null,"□",null,null,"直前の確認に要した図書及び書類並びに申請書等"]
[]
[]
[null,null,"● 建築基準関係規定の証明書等の写し"]
[null,null,"□",null,null,"都市計画法の規定に基づく許可証の写し・・・①",{"$nulls":24},"□",null,null,"都市計画法以外の関係規定の証明書の写し"]
[null,null,"□",null,null,"都市計画法の規定に基づくの検査済証の写し（接道要件に係るもの）・・・②"]
[null,null,"□",null,null,"都市計画法施行規則第60条の規定に基づく証明書（①②以外のもの）"]
[]
[null,"MEMO",{"$nulls":25},"チェック終了日",{"$nulls":13},"担　当　者"]
[]
[]
[{"$nulls":3},{"$f":"IF(申三面!B31=\"■\",\"新築\",IF(申三面!E31=\"■\",\"増築\",IF(申三面!H31=\"■\",\"改築\",IF(申三面!K31=\"■\",\"移転\",IF(申三面!N31=\"■\",\"用途変更\",IF(申三面!S31=\"■\",\"大規模の修繕\",IF(申三面!Y31=\"■\",\"大規模の模様替\")))))))","v":false}]
[null,"□",null,"新築",{"$nulls":8},"木造",{"$nulls":10},"1号・2号",{"$nulls":3},"無",null,null,"対象",{"$nulls":3},"対象",{"$nulls":4},"-",{"$nulls":3},{"$f":"IF(申二面!J15=\"\",\"\",申二面!J15)","v":""}]
[null,"■",null,"増築",{"$nulls":8},"木造（枠組壁工法）",{"$nulls":10},"2号",{"$nulls":3},4,null,null,"対象外",{"$nulls":3},"対象外",{"$nulls":4},"仕様\n基準",{"$nulls":3},{"$f":"IF(申二面!J20=\"\",\"\",申二面!J20)","v":""}]
[{"$nulls":3},"改築",{"$nulls":8},"鉄骨造",{"$nulls":10},"3号",{"$nulls":3},3,null,null,"ﾙｰﾄ2",{"$nulls":3},"対象設備無",{"$nulls":4},"性能\n基準"]
[{"$nulls":3},"移転",{"$nulls":8},"鉄筋コンクリート造",{"$nulls":14},2]
[{"$nulls":3},"用途変更",{"$nulls":8},"壁式鉄筋コンクリート造",{"$nulls":14},1]
[{"$nulls":3},"大規模の修繕"]
[{"$nulls":3},"大規模の模様替",{"$nulls":8},"壁量計算"]
[{"$nulls":12},"許容\n応力度"]
[{"$nulls":12},"-"]

{"sheet":"申一面","index":2,"n_rows":39,"n_cols":55,"rows_kept":39,"merged":[[16,23,16,24],[16,25,16,26],[16,34,16,35],[16,36,16,42],[19,18,19,29],[20,18,20,29],[23,18,23,29],[24,18,24,29],[35,0,35,1],[35,24,35,25],[37,0,37,2],[37,24,37,26]]}
["第二号様式（第一条の三､第三条､第三条の三関係）（A4）"]
[{"$nulls":33},"シートの保護を解除すると編集が可能になります（パスワードなし）",{"$nulls":20},"（注意）"]
[{"$nulls":54},"申請時に記載内容の確認をお願いします。セル内のリンクや計算式の不具合による記載間違いに"]
["確認申請書（建築物）",{"$nulls":53},"ついて当社は責任は負いません。"]
[{"$nulls":54},"共通：　数字は算用数字を、単位はメートル法を用いてください。"]
["（第一面）",{"$nulls":53},"※印のある欄は記入しないでください。"]
[]
[]
[]
["　建築基準法第６条第1項又は第６条の２第1項の規定による確認を申請します。　この申請書及び添付図書に"]
["記載の事項は、事実に相違ありません。"]
[]
[]
["指定確認検査機関"]
["株式会社　確認検査機構アネックス  　様"]
[]
[{"$nulls":23},"令和",{"$nulls":3},"年",null,"月",null,"日",null,null,"本日",null,{"$f":"TODAY()","v":"2025-04-09"}]
[]
[]
[]
[{"$nulls":13},"申請者氏名"]
[]
[]
[]
[{"$nulls":13},"設計者氏名"]
[]
[]
["※","手数料欄"]
[]
[]
[]
[]
["※受付欄",{"$nulls":7},"※消防関係同意欄",{"$nulls":7},"※決裁欄",{"$nulls":7},"※確認番号欄"]
[]
[]
[{"$f":"IF(X17=\"\",\"\",X17)","v":"令和"},null,null,"年",null,"月",null,"日",{"$nulls":16},{"$f":"IF(X17=\"\",\"\",X17)","v":"令和"},null,null,"年",null,"月",null,"日"]
["第",{"$nulls":5},"確申建機構ア",{"$f":"IF(受付用!B9=\"\",\"\",受付用!B9)","v":""},{"$nulls":16},"第",{"$nulls":5},"確認建機構ア",{"$f":"IF(受付用!B9=\"\",\"\",受付用!B9)","v":""}]
[{"$f":"IF(受付用!C9=\"\",\"\",受付用!C9)","v":""},{"$nulls":6},"号",{"$nulls":16},{"$f":"IF(受付用!C9=\"\",\"\",受付用!C9)","v":""},{"$nulls":6},"号"]
["係員氏名",{"$nulls":23},"係員氏名"]

{"sheet":"申二面","index":3,"n_rows":207,"n_cols":69,"rows_kept":207,"merged":[[5,9,5,31],[5,33,5,48],[6,9,6,31],[6,33,6,48],[7,10,7,15],[8,9,8,31],[9,9,9,15],[13,10,13,11],[13,19,13,22],[13,27,13,30],[14,9,14,31],[15,10,15,11],[15,19,15,21],[15,27,15,30],[16,9,16,31],[17,10,17,15],[18,9,18,31],[19,9,19,15],[24,10,24,11],[24,19,24,22],[24,27,24,30],[25,9,25,31],[26,10,26,11],[26,19,26,21],[26,27,26,30],[27,9,27,31],[28,10,28,15],[29,9,29,31],[30,9,30,15],[31,12,31,31],[34,10,34,11],[34,19,34,22],[34,27,34,30],[35,9,35,31],[36,10,36,11],[36,19,36,21],[36,27,36,30],[37,9,37,31],[38,10,38,15],[39,9,39,31],[40,9,40,15],[41,12,41,31],[43,10,43,11],[43,19,43,22],[43,27,43,30],[44,9,44,31],[45,10,45,11],[45,19,45,21],[45,27,45,30],[46,9,46,31],[47,10,47,15],[48,9,48,31],[49,9,49,15],[50,12,50,31],[52,10,52,11],[52,19,52,22],[52,27,52,30],[53,9,53,31],[54,10,54,11],[54,19,54,21],[54,27,54,30],[55,9,55,31],[56,10,56,15],[57,9,57,31],[58,9,58,15],[59,12,59,31],[65,7,65,22],[66,17,66,21],[68,7,68,22],[69,17,69,21],[71,7,71,22],[72,17,72,21],[73,7,73,22],[74,17,74,21],[75,7,75,22],[76,17,76,21],[78,7,78,22],[79,17,79,21],[80,7,80,22],[81,17,81,21],[82,7,82,22],[83,17,83,21],[88,7,88,31],[89,7,89,31],[90,8,90,13],[91,7,91,31],[92,7,92,13],[93,7,93,13],[94,11,94,31],[97,7,97,31],[98,7,98,31],[99,8,99,13],[100,7,100,31],[101,7,101,13],[102,7,102,13],[103,11,103,31],[105,7,105,31],[106,7,106,31],[107,8,107,13],[108,7,108,31],[109,7,109,13],[110,7,110,13],[111,11,111,31],[113,7,113,31],[114,7,114,31],[115,8,115,13],[116,7,116,31],[117,7,117,13],[118,7,118,13],[119,11,119,31],[124,10,124,11],[124,19,124,22],[124,27,124,30],[125,9,125,31],[126,10,126,11],[126,19,126,21],[126,27,126,30],[127,9,127,31],[128,10,128,15],[129,9,129,31],[130,9,130,15],[131,11,131,31],[134,10,134,11],[134,19,134,22],[134,27,134,30],[135,9,135,31],[136,10,136,11],[136,19,136,21],[136,27,136,30],[137,9,137,31],[138,10,138,15],[139,9,139,31],[140,9,140,15],[141,11,141,31],[143,10,143,11],[143,19,143,22],[143,27,143,30],[144,9,144,31],[145,10,145,11],[145,19,145,21],[145,27,145,30],[146,9,146,31],[147,10,147,15],[148,9,148,31],[149,9,149,15],[150,11,150,31],[152,10,152,11],[152,19,152,22],[152,27,152,30],[153,9,153,31],[154,10,154,11],[154,19,154,21],[154,27,154,30],[155,9,155,31],[156,10,156,15],[157,9,157,31],[158,9,158,15],[159,11,159,31],[163,7,163,31],[164,13,164,16],[164,19,164,25],[165,7,165,31],[166,8,166,13],[167,7,167,31],[168,7,168,13],[172,8,172,30],[173,8,173,30],[178,8,178,30],[179,8,179,30],[180,8,180,30],[183,4,183,31],[184,4,184,31],[184,48,184,67],[185,4,185,31],[185,48,185,67],[186,48,186,67],[187,4,187,21],[187,48,187,67],[188,48,188,67]]}
[]
["（第二面）",{"$nulls":50},"シートの保護を解除すると編集が可能になります（パスワードなし）"]
[null,"建築主等の概要"]
[]
["【1.建築主】",{"$nulls":50},"（注意）第二面"]
[null,"【イ.氏名のフリガナ】",{"$nulls":31},"氏名のフリガナ",{"$nulls":17},"①　建築主が２以上のときは、１欄は代表となる建築主について記入し、"]
[null,"【ロ.氏名】",{"$nulls":31},{"$f":"IF(J7=\"\",\"\",ASC(PHONETIC(J7)))","v":""},{"$nulls":18},"別紙に他の建築主についてそれぞれ必要な事項を記入して添えてください。"]
[null,"【ハ.郵便番号】",{"$nulls":7},"〒",{"$nulls":41},"②　建築主からの委任を受けて申請を行う者がいる場合においては、２欄に記入してください。"]
[null,"【ニ.住所】",{"$nulls":49},"③　２欄、３欄及び５欄は、代理者、設計者又は工事監理者が建築士事務所に属しているときは、"]
[null,"【ホ.電話番号】",{"$nulls":50},"その名称を書き、建築士事務所に属していないときは、所在地はそれぞれ代理者、設計者又"]
[{"$nulls":52},"は工事監理者の住所を書いてください。"]
[]
["【2.代理者】",{"$nulls":50},"④　３欄の｢ト｣は、作成した又は建築士法第20条の２第３項若しくは第20条の３第３項の表示をし"]
[null,"【イ.資格】",{"$nulls":7},"（",null,null,"）","建築士",{"$nulls":4},"（",{"$nulls":4},"）","登録",null,"第",{"$nulls":4},"号",{"$nulls":20},"た図書について記入してください。"]
[null,"【ロ.氏名】",{"$nulls":49},"⑤　３欄、４欄及び５欄は、それぞれ代表となる設計者、建築設備の設計に関し意見を聴いた者及"]
[null,"【ハ.建築士事務所名】",{"$nulls":7},"（",null,null,"）","建築士事務所",{"$nulls":4},"（",{"$nulls":3},"）","知事登録第",{"$nulls":7},"号",{"$nulls":20},"び工事監理者並びに申請に係る建築物に係る他のすべての設計者、建築設備の設計に関し"]
[{"$nulls":52},"意見を聴いた者及び工事監理者について記入してください。３欄の設計者のうち、構造設計一"]
[null,"【ニ.郵便番号】",{"$nulls":7},"〒",{"$nulls":42},"級建築士又は設備設計一級建築士である旨の表示をした者がいる場合は、該当するチェックボッ"]
[null,"【ホ.所在地】",{"$nulls":50},"クスに｢レ｣マークを入れてください。記入欄が不足する場合には、別紙に必要な事項を記入して"]
[null,"【へ.電話番号】",{"$nulls":50},"添えてください。"]
[]
[]
["【3.設計者】",{"$nulls":50},"⑥　４欄は、建築士法第20条第５項に規定する場合（設計に係る場合に限る。）に、同項に定める"]
[null,"(代表となる設計者)",{"$nulls":50},"資格を有する者について記入し、所在地は、その者が勤務しているときは勤務先の所在地を、"]
[null,"【イ.資格】",{"$nulls":7},"（",null,null,"）","建築士",{"$nulls":4},"（",{"$nulls":4},"）","登録",null,"第",{"$nulls":4},"号",null,"←","3年ごとの建築士定期講習について確認してください。",{"$nulls":17},"勤務していないときはその者の住所を、登録番号は建築士法施行規則　第17条の35第1項の"]
[null,"【ロ.氏名】",{"$nulls":50},"規定による登録を受けている場合の当該登録番号を書いてください。"]
[null,"【ハ.建築士事務所名】",{"$nulls":7},"（",null,null,"）","建築士事務所",{"$nulls":4},"（",{"$nulls":3},"）","知事登録第",{"$nulls":7},"号",{"$nulls":19},"⑦　５欄及び６欄は、それぞれ工事監理者又は工事施工者が未定のときは、後で定まってから工"]
[{"$nulls":52},"事着手前に届け出てください。"]
[null,"【ニ.郵便番号】",{"$nulls":7},"〒",{"$nulls":41},"⑧　６欄は、工事施工者が２以上のときは、代表となる工事施工者について記入し、別紙に他の工"]
[null,"【ホ.所在地】",{"$nulls":50},"事施工者について棟別にそれぞれ必要な事項を記入して添えてください。"]
[null,"【へ.電話番号】",{"$nulls":49},"⑨","７欄は、該当するチェックボックスに「レ」マークを入れ、申請済の場合には、申請をした都道府"]
[null,"【ト.作成又は確認した設計図書】",{"$nulls":50},"県名又は指定構造計算適合性判定機関の名称及び事務所の所在地を記入してください。未"]
[{"$nulls":52},"申請の場合には、申請する予定の都道府県名又は指定構造計算適合性判定機関の名称及び"]
[null,"(その他の設計者)",{"$nulls":50},"事務所の所在地を記入し、申請をした後に、遅滞なく、申請をした旨（申請先を変更した場合に"]
[null,"【イ.資格】",{"$nulls":7},"（",null,null,"）","建築士",{"$nulls":4},"（",{"$nulls":4},"）","登録",null,"第",{"$nulls":4},"号",{"$nulls":20},"おいては、申請をした都道府県名又は指定構造計算適合性判定機関の名称及び事務所の所"]
[null,"【ロ.氏名】",{"$nulls":50},"在地を含む。）を届け出てください。なお、所在地については、○○県○○市、郡○○町、村、"]
[null,"【ハ.建築士事務所名】",{"$nulls":7},"（",null,null,"）","建築士事務所",{"$nulls":4},"（",{"$nulls":3},"）","知事登録第",{"$nulls":7},"号",{"$nulls":20},"程度で結構です。"]
[{"$nulls":51},"⑩","８欄は、該当するチェックボックスに「レ」マークを入れ、提出済の場合には、提出をした所管行"]
[null,"【ニ.郵便番号】",{"$nulls":7},{"$f":"IF(K39=\"\",\"\",\"〒\")","v":""},{"$nulls":42},"政庁又は登録建築物エネルギー消費性能判定機関の名称及び事務所の所在地を記入してく"]
[null,"【ホ.所在地】",{"$nulls":50},"ださい。未提出の場合には、提出する予定の所管行政庁又は登録建築物エネルギー消費性能"]
[null,"【へ.電話番号】",{"$nulls":50},"判定機関の名称及び事務所の所在地を記入し、提出をした場合に、遅滞なく、提出をした旨（提"]
[null,"【ト.作成又は確認した設計図書】",{"$nulls":31},"←","構造設計図書の作成確認した者が明確になるようにして",{"$nulls":17},"出先を変更した場合においては、提出した所管行政庁又は登録建築物エネルギー消費性能判"]
[{"$nulls":34},"ください。",{"$nulls":17},"定機関の名称及び事務所の所在地を含む。）を届け出てください。なお、所在地については、○"]
[null,"【イ.資格】",{"$nulls":7},"（",null,null,"）","建築士",{"$nulls":4},"（",{"$nulls":4},"）","登録",null,"第",{"$nulls":4},"号",null,null,"（例：構造は別の者が作成確認した場合、",{"$nulls":17},"○県○○市、郡○○町、村、程度で結構です。"]
[null,"【ロ.氏名】",{"$nulls":32},"　設計図書一式（構造図、構造計算書を除く））",{"$nulls":17},"また、提出不要の場合には、建築物のエネルギー消費性能の向上等に関する法律施行規則"]
[null,"【ハ.建築士事務所名】",{"$nulls":7},"（",null,null,"）","建築士事務所",{"$nulls":4},"（",{"$nulls":3},"）","知事登録第",{"$nulls":7},"号",{"$nulls":20},"第２条第１項各号に掲げる特定建築行為のうち該当するものの号番号（同項第１号に該当する"]
[{"$nulls":52},"場合にあっては、号番号及び同号イ又はロのうち該当するもの（気候風土適応住宅に該当する"]
[null,"【ニ.郵便番号】",{"$nulls":7},{"$f":"IF(K48=\"\",\"\",\"〒\")","v":""},{"$nulls":42},"場合にあっては、その旨を含む。））を記入する等、提出が不要である理由を記入してください。"]
[null,"【ホ.所在地】",{"$nulls":50},"なお、建築に係る部分の床面積が10平方メートル以下である場合、建築基準法第６条の４第１項"]
[null,"【へ.電話番号】",{"$nulls":50},"第３号に掲げる建築物の建築である場合その他の提出が不要であることが明らかな場合は、記入"]
[null,"【ト.作成又は確認した設計図書】",{"$nulls":50},"する必要はありません。"]
[{"$nulls":51},"⑪","建築物の名称又は工事名が定まっているときは、９欄に記入してください。"]
[null,"【イ.資格】",{"$nulls":7},"（",null,null,"）","建築士",{"$nulls":4},"（",{"$nulls":4},"）","登録",null,"第",{"$nulls":4},"号"]
[null,"【ロ.氏名】"]
[null,"【ハ.建築士事務所名】",{"$nulls":7},"（",null,null,"）","建築士事務所",{"$nulls":4},"（",{"$nulls":3},"）","知事登録第",{"$nulls":7},"号"]
[]
[null,"【ニ.郵便番号】",{"$nulls":7},{"$f":"IF(K57=\"\",\"\",\"〒\")","v":""}]
[null,"【ホ.所在地】"]
[null,"【へ.電話番号】"]
[null,"【ト.作成又は確認した設計図書】"]
[]
[]
[null,"（構造設計一級建築士又は設備設計一級建築士である旨の表示をした者）"]
[null,null,"上記の設計者のうち、"]
[null,null,"□","建築士法第20条の２第１項の表示をした者",{"$nulls":29},"←","構造一級建築士である旨の表示をした者のうち"]
[null,null,"【イ.氏名】",{"$nulls":31},"構造設計を行った場合、建築士法第20条の２第１項の表示をした者に記載"]
[null,null,"【ロ.資格】構造設計一級建築士交付",{"$nulls":13},"第",{"$nulls":5},"号",{"$nulls":11},"構造関係規定に適法することを確認した場合、建築士法第20条の２第３項の表示をした者に記載"]
[null,null,"□","建築士法第20条の２第３項の表示をした者"]
[null,null,"【イ.氏名】"]
[null,null,"【ロ.資格】構造設計一級建築士交付",{"$nulls":13},"第",{"$nulls":5},"号"]
[null,null,"□","建築士法第20条の３第１項の表示をした者",{"$nulls":29},"←","設備一級建築士も上記同様"]
[null,null,"【イ.氏名】"]
[null,null,"【ロ.資格】設備設計一級建築士交付",{"$nulls":13},"第",{"$nulls":5},"号"]
[null,null,"【イ.氏名】"]
[null,null,"【ロ.資格】設備設計一級建築士交付",{"$nulls":13},"第",{"$nulls":5},"号"]
[null,null,"【イ.氏名】"]
[null,null,"【ロ.資格】設備設計一級建築士交付",{"$nulls":13},"第",{"$nulls":5},"号"]
[null,null,"□","建築士法第20条の３第３項の表示をした者"]
[null,null,"【イ.氏名】"]
[null,null,"【ロ.資格】設備設計一級建築士交付",{"$nulls":13},"第",{"$nulls":5},"号"]
[null,null,"【イ.氏名】"]
[null,null,"【ロ.資格】設備設計一級建築士交付",{"$nulls":13},"第",{"$nulls":5},"号"]
[null,null,"【イ.氏名】"]
[null,null,"【ロ.資格】設備設計一級建築士交付",{"$nulls":13},"第",{"$nulls":5},"号"]
[]
[]
["【4.建築設備の設計に関し意見を聴いた者】"]
[null,"(代表となる建築設備の設計に関し意見を聴いた者)"]
[null,"【イ.氏名】"]
[null,"【ロ.勤務先】"]
[null,"【ハ.郵便番号】",{"$nulls":5},{"$f":"IF(I91=\"\",\"\",\"〒\")","v":""}]
[null,"【ニ.所在地】"]
[null,"【ホ.電話番号】"]
[null,"【ヘ.登録番号】"]
[null,"【ト.意見を聴いた設計図書】"]
[]
[null,"(その他の建築設備の設計に関し意見を聴いた者)"]
[null,"【イ.氏名】"]
[null,"【ロ.勤務先】"]
[null,"【ハ.郵便番号】",{"$nulls":5},{"$f":"IF(I100=\"\",\"\",\"〒\")","v":""}]
[null,"【ニ.所在地】"]
[null,"【ホ.電話番号】"]
[null,"【ヘ.登録番号】"]
[null,"【ト.意見を聴いた設計図書】"]
[]
[null,"【イ.氏名】"]
[null,"【ロ.勤務先】"]
[null,"【ハ.郵便番号】",{"$nulls":5},{"$f":"IF(I108=\"\",\"\",\"〒\")","v":""}]
[null,"【ニ.所在地】"]
[null,"【ホ.電話番号】"]
[null,"【ヘ.登録番号】"]
[null,"【ト.意見を聴いた設計図書】"]
[]
[null,"【イ.氏名】"]
[null,"【ロ.勤務先】"]
[null,"【ハ.郵便番号】",{"$nulls":5},{"$f":"IF(I116=\"\",\"\",\"〒\")","v":""}]
[null,"【ニ.所在地】"]
[null,"【ホ.電話番号】"]
[null,"【ヘ.登録番号】"]
[null,"【ト.意見を聴いた設計図書】"]
[]
[]
["【5.工事監理者】"]
[null,"(代表となる工事監理者)"]
[null,"【イ.資格】",{"$nulls":7},"（",null,null,"）","建築士",{"$nulls":4},"（",{"$nulls":4},"）","登録",null,"第",{"$nulls":4},"号"]
[null,"【ロ.氏名】"]
[null,"【ハ.建築士事務所名】",{"$nulls":7},"（",null,null,"）","建築士事務所",{"$nulls":4},"（",{"$nulls":3},"）","知事登録第",{"$nulls":7},"号"]
[]
[null,"【ニ.郵便番号】",{"$nulls":7},"〒"]
[null,"【ホ.所在地】"]
[null,"【へ.電話番号】"]
[null,"【ト.工事と照合する設計図書】"]
[]
[null,"(その他の工事監理者)"]
[null,"【イ.資格】",{"$nulls":7},"（",null,null,"）","建築士",{"$nulls":4},"（",{"$nulls":4},"）","登録",null,"第",{"$nulls":4},"号"]
[null,"【ロ.氏名】"]
[null,"【ハ.建築士事務所名】",{"$nulls":7},"（",null,null,"）","建築士事務所",{"$nulls":4},"（",{"$nulls":3},"）","知事登録第",{"$nulls":7},"号"]
[]
[null,"【ニ.郵便番号】",{"$nulls":7},{"$f":"IF(K139=\"\",\"\",\"〒\")","v":""}]
[null,"【ホ.所在地】"]
[null,"【へ.電話番号】"]
[null,"【ト.工事と照合する設計図書】"]
[]
[null,"【イ.資格】",{"$nulls":7},"（",null,null,"）","建築士",{"$nulls":4},"（",{"$nulls":4},"）","登録",null,"第",{"$nulls":4},"号"]
[null,"【ロ.氏名】"]
[null,"【ハ.建築士事務所名】",{"$nulls":7},"（",null,null,"）","建築士事務所",{"$nulls":4},"（",{"$nulls":3},"）","知事登録第",{"$nulls":7},"号"]
[]
[null,"【ニ.郵便番号】",{"$nulls":7},{"$f":"IF(K148=\"\",\"\",\"〒\")","v":""}]
[null,"【ホ.所在地】"]
[null,"【へ.電話番号】"]
[null,"【ト.工事と照合する設計図書】"]
[]
[null,"【イ.資格】",{"$nulls":7},"（",null,null,"）","建築士",{"$nulls":4},"（",{"$nulls":4},"）","登録",null,"第",{"$nulls":4},"号"]
[null,"【ロ.氏名】"]
[null,"【ハ.建築士事務所名】",{"$nulls":7},"（",null,null,"）","建築士事務所",{"$nulls":4},"（",{"$nulls":3},"）","知事登録第",{"$nulls":7},"号"]
[]
[null,"【ニ.郵便番号】",{"$nulls":7},{"$f":"IF(K157=\"\",\"\",\"〒\")","v":""}]
[null,"【ホ.所在地】"]
[null,"【へ.電話番号】"]
[null,"【ト.工事と照合する設計図書】"]
[]
[]
["【6.工事施工者】"]
[null,"【イ.氏名】"]
[null,"【ロ.営業所名】",{"$nulls":5},"建設業の許可",{"$nulls":4},"（",{"$nulls":4},"）","第",{"$nulls":7},"号",{"$nulls":6},"←","5年ごとの更新"]
[]
[null,"【ハ.郵便番号】",{"$nulls":5},"〒"]
[null,"【ニ.所在地】"]
[null,"【ホ.電話番号】"]
[]
[]
["【7.構造計算適合性判定の申請】"]
[{"$nulls":3},"□","申請済",null,null,"(",{"$nulls":23},")"]
[{"$nulls":3},"□","未申請",null,null,"(",{"$nulls":23},")"]
[{"$nulls":3},"□","申請不要"]
[]
[]
["【8.建築物エネルギー消費性能確保計画の提出】"]
[{"$nulls":3},"□","提出済",null,null,"(",{"$nulls":23},")"]
[{"$nulls":3},"□","未提出",null,null,"(",{"$nulls":23},")",null,null,"申請者は、建築物エネルギー消費性能確保計画の提出が不要の場合（適合性判定が不要の場合）には、"]
[{"$nulls":3},"□","提出不要",null,null,"(",{"$nulls":23},")",null,"←","提出不要である理由を「提出不要」のカッコ内に記入してください。"]
[]
[]
["【9.備考】",{"$nulls":47},"省エネ（住宅）【提出不要の場合の記載例】"]
[{"$nulls":33},"←","建築物の名称又は工事名(フリガナ）",{"$nulls":13},"省エネ基準適合の評価方法等",{"$nulls":19},"推奨する記入内容"]
[{"$nulls":33},"←","建築物の名称又は工事名",{"$nulls":13},"仕様基準",{"$nulls":19},"第１号イに該当"]
[{"$nulls":48},"誘導仕様基準",{"$nulls":19},"第１号ロに該当"]
[{"$nulls":3},"フリガナ",{"$f":"IF(E186=\"\",\"\",ASC(PHONETIC(E186)))","v":""},{"$nulls":43},"設計住宅性能評価を受けた場合",{"$nulls":19},"第２号に該当"]
[{"$nulls":48},"長期優良住宅の認定又は長期使用構造等の確認を受けた場合",{"$nulls":19},"第３号に該当"]
[{"$nulls":68},"建築物省エネ法第20条第一号による適用除外（用途名称）"]
[null,"●滋賀県・京都府・奈良県●",{"$nulls":66},"建築物が建築基準法第6条第1項第三号に該当"]
[null,"一般財団法人 日本建築総合試験所　　大阪府大阪市中央区内本町2丁目4番7号"]
[null,"一般財団法人 日本建築センター　　大阪府大阪市中央区"]
[null,"一般財団法人 日本建築センター　　東京都千代田区神田錦町1丁目9番地"]
[null,"●大阪府●"]
[null,"一般財団法人 日本建築総合試験所　　大阪府大阪市中央区内本町2丁目4番7号"]
[null,"一般財団法人 日本建築センター　　大阪府大阪市中央区"]
[null,"一般財団法人 日本建築センター　　東京都千代田区神田錦町1丁目9番地"]
[null,"一般財団法人 大阪建築防災センター　 　大阪府大阪市中央区谷町3丁目1番17号"]
[null,"株式会社確認検査機構アネックス　　滋賀県大津市末広町7番1号"]
[null,"4/30以降"]
[null,"滋賀県",null,null,"大臣",{"$nulls":4},"設計図書一式"]
[null,"京都府",null,null,"滋賀県知事",{"$nulls":4},"設計図書一式（構造図、構造計算書を除く）"]
[null,"大阪府",null,null,"京都府知事",{"$nulls":4},"構造図、構造計算書"]
[null,"奈良県",null,null,"大阪府知事"]
[{"$nulls":4},"奈良県知事"]
[null,"一般財団法人 日本建築センター　　大阪府大阪市中央区本町一丁目4番8号　エスリードビル本町４階"]

{"sheet":"申三面","index":4,"n_rows":159,"n_cols":82,"rows_kept":159,"merged":[[2,6,2,31],[3,6,3,31],[8,14,8,31],[9,1,9,31],[10,1,10,31],[12,8,12,14],[12,15,12,19],[13,15,13,19],[15,9,15,11],[15,15,15,17],[15,21,15,23],[15,27,15,29],[16,9,16,11],[16,15,16,17],[16,21,16,23],[16,27,16,29],[17,1,18,7],[17,8,18,8],[17,9,18,12],[17,13,18,13],[17,14,18,14],[17,15,18,18],[17,19,18,19],[17,20,18,20],[17,21,18,24],[17,25,18,25],[17,26,18,26],[17,27,18,30],[17,31,18,31],[20,9,20,11],[20,15,20,17],[20,21,20,23],[20,27,20,29],[22,9,22,11],[22,15,22,17],[22,21,22,23],[22,27,22,29],[23,12,23,16],[24,12,24,16],[25,23,25,27],[25,34,25,36],[25,37,25,41],[25,42,25,43],[26,23,26,27],[26,34,26,36],[26,37,26,41],[26,42,26,43],[27,5,27,30],[28,9,28,11],[28,13,28,30],[31,12,31,16],[31,19,31,23],[31,26,31,30],[32,12,32,15],[32,19,32,22],[32,26,32,29],[34,12,34,15],[34,19,34,22],[34,26,34,29],[35,7,35,16],[35,17,35,22],[35,37,35,41],[35,42,35,43],[36,12,36,16],[36,19,36,23],[36,26,36,30],[37,12,37,15],[37,19,37,22],[37,26,37,29],[39,12,39,15],[39,19,39,22],[39,26,39,29],[41,12,41,15],[41,19,41,22],[41,26,41,29],[43,12,43,15],[43,19,43,22],[43,26,43,29],[44,12,44,15],[44,19,44,22],[44,26,44,29],[45,12,45,15],[45,19,45,22],[45,26,45,29],[46,12,46,15],[46,19,46,22],[46,26,46,29],[47,12,47,15],[47,19,47,22],[47,26,47,29],[48,12,48,15],[48,19,48,22],[48,26,48,29],[49,12,49,15],[49,19,49,22],[49,26,49,29],[50,12,50,15],[50,19,50,22],[50,26,50,29],[51,12,51,15],[51,19,51,22],[51,26,51,29],[52,12,52,15],[52,19,52,22],[52,26,52,29],[53,12,53,15],[53,19,53,22],[53,26,53,29],[54,17,54,22],[55,7,55,16],[55,17,55,22],[55,37,55,41],[55,42,55,43],[57,15,57,19],[58,15,58,19],[59,11,59,15],[59,18,59,22],[60,11,60,14],[60,18,60,21],[61,11,61,15],[61,18,61,22],[62,11,62,15],[62,18,62,22],[63,8,63,16],[63,18,63,19],[63,20,63,28],[68,2,68,31],[69,2,69,31],[70,2,70,31],[71,2,71,31],[72,11,72,12],[72,13,72,14],[72,16,72,17],[72,19,72,20],[73,11,73,12],[73,13,73,14],[73,16,73,17],[73,19,73,20],[75,6,75,7],[75,15,75,30],[76,6,76,7],[76,15,76,30],[77,6,77,7],[77,15,77,30],[84,2,84,31],[85,2,85,31],[86,2,86,31],[88,2,88,31],[89,2,89,31],[90,2,90,31],[91,2,91,31]]}
["（第三面）",{"$nulls":47},"シートの保護を解除すると編集が可能になります（パスワードなし）"]
["建築物及びその敷地に関する事項",{"$nulls":47},"（注意）第三面",{"$nulls":32},"●滋賀県●"]
["【1.地名地番】",{"$nulls":32},"←","こちらの市町村を間違えると他のシートに影響するので注意",{"$nulls":13},"①","住居表示が定まっているときは、２欄に記入してください。",{"$nulls":31},"土台、柱、はりおよび筋かいを金物等により接合する工事の工程"]
["【2.住居表示】",{"$nulls":32},"←","住居表示が定まっていなければ空欄",{"$nulls":13},"②","３欄は、該当するチェックボックスに「レ」マークを入れてください。ただし、建築物の敷地が都",{"$nulls":31},"壁を設置する工事の工程"]
["【3.都市計画区域及び準都市計画区域の内外の別等】",{"$nulls":48},"市計画区域、準都市計画区域又はこれらの区域以外の区域のうち２以上の区域にわたる場合",{"$nulls":31},"鉄骨の軸組を溶接し、またはボルト等により接合する工事(建て方)の工程"]
[null,"□","都市計画区域内",{"$nulls":5},"（ ","□","市街化区域",{"$nulls":4},"□","市街化調整区域",{"$nulls":6},"□","区域区分非設定",{"$nulls":5},"）",{"$nulls":18},"においては、当該敷地の過半の属する区域について記入してください。なお、当該敷地が３の",{"$nulls":31},"2階の床版の取り付けまたは床版の鉄筋を配置する工事の工程"]
[null,"□","準都市計画区域内",{"$nulls":6},"□","都市計画区域及び準都市計画区域外",{"$nulls":38},"区域にわたる場合で、かつ、当該敷地の過半の属する区域がない場合においては、都市計画",{"$nulls":31},"基礎および地中梁に鉄筋を配置する工事の工程"]
["【4.防火地域】",{"$nulls":6},"□","防火地域",{"$nulls":3},"□","準防火地域",{"$nulls":4},"□","指定なし",null,null,"（","□","法第22条区域 ）",{"$nulls":24},"区域又は準都市計画区域のうち、当該敷地の属する面積が大きい区域について記入してくだ",{"$nulls":31},"2階の床およびこれを支持する梁に鉄筋を配置する工事の工程"]
["【5.その他の区域、地域、地区又は街区】",{"$nulls":48},"さい。",{"$nulls":31},"●京都市●特殊な構造の場合は名称が異なりますのでご注意ください。"]
[{"$nulls":48},"③","４欄は、該当するチェックボックスに「レ」マークを入れてください。なお、建築物の敷地が防火",{"$nulls":31},"地中はりの鉄筋を配置する工事の工程"]
[{"$nulls":49},"地域、準防火地域又は指定のない区域のうち２以上の地域又は区域にわたるときは、それぞれ",{"$nulls":31},"構造耐力上主要な部分である壁、柱、横架材、筋かい及び木板その他これに類するものの仕口、継手を金物等により接合する工事の工程"]
["【6.道路】",{"$nulls":48},"の地域又は区域について記入してください。",{"$nulls":31},"耐力壁、小屋ばり組及び屋根版を設置する工事の工程"]
[null,"【イ.幅員】",{"$nulls":18},"ｍ",{"$nulls":12},"←","4ｍ未満の2項道路の場合4.000ｍと記載",{"$nulls":13},"④","５欄は、建築物の敷地が存する３欄及び４欄に掲げる区域及び地域以外の区域、地域、地区",{"$nulls":31},"軸組、床組及び小屋ばり組をボルト等により接合、また溶接する工事の工程"]
[null,"【ロ.敷地と接している部分の長さ】",{"$nulls":18},"ｍ",{"$nulls":12},"←","道路（複数の道路に接する場合はいずれか",{"$nulls":14},"又は街区を記入してください。なお、建築物の敷地が２以上の区域、地域、地区又は街区にわ",{"$nulls":31},"２階の床（平家にあっては屋根）及びこれを支持するはりに鉄筋を配置する工事の工程"]
["【7.敷地面積】",{"$nulls":33},"一方）からの見付長さを記載",{"$nulls":14},"たる場合は、それぞれの区域、地域、地区又は街区を記入してください。",{"$nulls":31},"●京都府●"]
[null,"【イ.敷地面積】",{"$nulls":5},"（1）","（",{"$nulls":3},"㎡","）","（",{"$nulls":3},{"$f":"IF(P16=\"\",\"\",\"㎡\")","v":""},"）","（",{"$nulls":3},{"$f":"IF(V16=\"\",\"\",\"㎡\")","v":""},"）","（",{"$nulls":3},{"$f":"IF(AB16=\"\",\"\",\"㎡\")","v":""},"）",{"$nulls":16},"⑤","６欄は、建築物の敷地が２メートル以上接している道路のうち最も幅員の大きなものについて記",{"$nulls":31},"木造の軸組を金物等により接合する工事の工程"]
[{"$nulls":7},"（2）","（",{"$nulls":3},{"$f":"IF(J17=\"\",\"\",\"㎡\")","v":""},"）","（",{"$nulls":3},{"$f":"IF(P17=\"\",\"\",\"㎡\")","v":""},"）","（",{"$nulls":3},{"$f":"IF(V17=\"\",\"\",\"㎡\")","v":""},"）","（",{"$nulls":3},{"$f":"IF(AB17=\"\",\"\",\"㎡\")","v":""},"）",{"$nulls":17},"入してください。",{"$nulls":31},"耐力壁の設置工事の工程"]
[null,"【ロ.用途地域等】",{"$nulls":6},"（",{"$nulls":4},"）","（",{"$nulls":4},"）","（",{"$nulls":4},"）","（",{"$nulls":4},"）",{"$nulls":16},"⑥","７欄の「イ」(1)は、建築物の敷地が、２以上の用途地域若しくは高層住居誘導地区、建築基準",{"$nulls":31},"２階の床及びこれを支持するはりの配筋工事の工程"]
[{"$nulls":49},"法第52条第１項第１号から第６号までに規定する容積率の異なる地域、地区若しくは区域又は",{"$nulls":31},"２階のはり及び床版の取付け工事の工程"]
[null,"【ハ.建築基準法第52条第１項及び第２項の規定による建築物の容積率】",{"$nulls":47},"同法第53条第１項第１号から第６号までに規定する建蔽率若しくは高層住居誘導地区に関す",{"$nulls":31},"屋根床版の配筋工事又は建方工事の工程"]
[{"$nulls":8},"（",{"$nulls":3},"％","）","（",{"$nulls":3},{"$f":"IF(P21=\"\",\"\",\"％\")","v":""},"）","（",{"$nulls":3},{"$f":"IF(V21=\"\",\"\",\"％\")","v":""},"）","（",{"$nulls":3},{"$f":"IF(AB21=\"\",\"\",\"％\")","v":""},"）",null,"←","道路幅員による制限も考慮",{"$nulls":14},"る都市計画において定められた建築物の建蔽率の最高限度の異なる地域、地区若しくは区",{"$nulls":31},"●宇治市●　★★木造の軸組については京都府の欄をご利用ください★★"]
[null,"【ニ.建築基準法第53条第１項の規定による建築物の建蔽率】",{"$nulls":47},"域（以下「用途地域が異なる地域等」という。）にわたる場合においては、用途地域が異なる地",{"$nulls":31},"木造の軸組を金物等により接合する工事の工程"]
[{"$nulls":8},"（",{"$nulls":3},"％","）","（",{"$nulls":3},{"$f":"IF(P23=\"\",\"\",\"％\")","v":""},"）","（",{"$nulls":3},{"$f":"IF(V23=\"\",\"\",\"％\")","v":""},"）","（",{"$nulls":3},{"$f":"IF(AB23=\"\",\"\",\"％\")","v":""},"）",{"$nulls":17},"域等ごとに、それぞれの用途地域が異なる地域等に対応する敷地の面積を記入してください。",{"$nulls":31},"木材で組まれた枠組を設置する工事の工程"]
[null,"【ホ.敷地面積の合計】",{"$nulls":9},"（1）",{"$f":"IF(J16=\"\",\"\",J16+P16+V16+AB16)","v":""},{"$nulls":4},"㎡",{"$nulls":31},"「イ」(2)は、同法第52条第12項の規定を適用する場合において、同条第13項の規定に基づき、",{"$nulls":31},"2階の床の配筋工事の工程"]
[{"$nulls":11},"（2）",{"$f":"IF(J17=\"\",\"\",J17+P17+V17+AB17)","v":""},{"$nulls":4},{"$f":"IF(M25=\"\",\"\",\"㎡\")","v":""},{"$nulls":16},"参考：加重平均による計算（（1）のみ）",{"$nulls":14},"「イ」(1)で記入した敷地面積に対応する敷地の部分について、建築物の敷地のうち前面道路と",{"$nulls":31},"2階のはりおよび床版の取付け工事の工程"]
[null,"【ヘ.敷地に建築可能な延べ面積を敷地面積で除した数値】",{"$nulls":26},{"$f":"IF(X26=\"\",\"\",\"％\")","v":""},{"$nulls":5},"ヘ欄",null,null,{"$f":"IF(M24=\"\",\"\",(J16*J21+P16*P21+V16*V21+AB16*AB21)/M24)","v":""},{"$nulls":4},"％",{"$nulls":6},"壁面線又は壁面の位置の制限として定められた限度の線との間の部分を除いた敷地の面積を",{"$nulls":31},"屋根床版の配筋工事または建方工事の工程"]
[null,"【ト.敷地に建築可能な建築面積を敷地面積で除した数値】",{"$nulls":26},{"$f":"IF(X27=\"\",\"\",\"％\")","v":""},{"$nulls":5},"ト欄",null,null,{"$f":"IF(M24=\"\",\"\",(J16*J23+P16*P23+V16*V23+AB16*AB23)/M24)","v":""},{"$nulls":4},"％",{"$nulls":6},"記入してください。",{"$nulls":31},"●大阪府・奈良県は直接入力してください●"]
[null,"【チ.備考】",{"$nulls":46},"⑦","７欄の「ロ」、「ハ」及び「ニ」は、「イ」に記入した敷地面積に対応する敷地の部分について、"]
["【8.主要用途】",{"$nulls":5},"( 区分",{"$nulls":5},")",{"$nulls":20},"←","申請敷地の主たる用途を記載",{"$nulls":14},"それぞれ記入してください。",{"$nulls":31},"大阪・奈良業務エリア特定行政庁"]
["【9.工事種別】",{"$nulls":33},"申請部分の建物用途はカッコ書きで記載",{"$nulls":13},"⑧","７欄の「ホ」(1)は、「イ」(1)の合計とし、「ホ」(2)は、「イ」(2)の合計とします。",{"$nulls":31},"大阪市"]
[null,"□","新築",null,"□","増築",null,"□","改築",null,"□","移転",null,"□","用途変更",{"$nulls":3},"□","大規模の修繕",{"$nulls":4},"□","大規模の模様替",{"$nulls":22},"⑨","建築物の敷地が、建築基準法第52条第７項若しくは第９項に該当する場合又は同条第８項若",{"$nulls":31},"豊中市"]
["【10.建築面積】",{"$nulls":10},"（","申請部分",{"$nulls":4},"）","（","申請以外の部分",{"$nulls":4},"）","（","合計",{"$nulls":4},"）",{"$nulls":17},"しくは第12項の規定が適用される場合においては、７欄の「ヘ」に、同条第７項若しくは第９項",{"$nulls":31},"東大阪市"]
[null,"【イ.建築面積】",{"$nulls":9},"（",{"$nulls":4},"㎡","）","（",{"$nulls":4},{"$f":"IF(T33=\"\",\"\",\"㎡\")","v":""},"）","（",{"$f":"IF(M33+T33=0,\"\",M33+T33)","v":""},{"$nulls":3},"㎡","）",{"$nulls":17},"の規定に基づき定められる当該建築物の容積率又は同条第８項若しくは第12項の規定が適",{"$nulls":31},"吹田市"]
[null,"【ロ.建蔽率の算定の基礎となる建築面積】",{"$nulls":47},"用される場合における当該建築物の容積率を記入してください。",{"$nulls":31},"高槻市"]
[{"$nulls":11},"（",{"$nulls":4},{"$f":"IF(M35=\"\",\"\",\"㎡\")","v":""},"）","（",{"$nulls":4},{"$f":"IF(T35=\"\",\"\",\"㎡\")","v":""},"）","（",{"$f":"IF(M35+T35=0,\"\",M35+T35)","v":""},{"$nulls":3},{"$f":"IF(AA35=\"\",\"\",\"㎡\")","v":""},"）",null,"←","緩和部分が無くても記入必要です",{"$nulls":13},"⑩","建築物の敷地について、建築基準法第57条の２第４項の規定により現に特例容積率の限度が",{"$nulls":31},"守口市"]
[null,"【ハ.建蔽率】",{"$nulls":5},{"$f":"IF(X27=\"\",\"\",IF(M35=\"\",\"\",IF(R36<=X27,\"\",\"建蔽率限度超えていませんか→\")))","v":""},{"$nulls":9},{"$f":"IF(AA35=\"\",\"\",(ROUNDUP(AL36,2)))","v":""},{"$nulls":5},"％",{"$nulls":13},{"$f":"IF(AA35=\"\",\"\",(ROUNDDOWN(AA35/M24*100,4)))","v":""},{"$nulls":4},"％",{"$nulls":6},"公告されているときは、７欄の「チ」にその旨及び当該特例容積率の限度を記入してください。",{"$nulls":31},"枚方市"]
["【11.延べ面積】",{"$nulls":10},"（","申請部分",{"$nulls":4},"）","（","申請以外の部分",{"$nulls":4},"）","（","合計",{"$nulls":4},"）",{"$nulls":16},"⑪","建築物の敷地が建築基準法第53条第２項若しくは同法第57条の５第２項に該当する場合又は",{"$nulls":31},"八尾市"]
[null,"【イ.建築物全体】",{"$nulls":9},"（",{"$nulls":4},"㎡","）","（",{"$nulls":4},{"$f":"IF(T38=\"\",\"\",\"㎡\")","v":""},"）","（",{"$f":"IF(M38+T38=0,\"\",M38+T38)","v":""},{"$nulls":3},"㎡","）",{"$nulls":17},"建築物が同法第53条第３項、第５項若しくは第６項に該当する場合においては、７欄の「ト」に、",{"$nulls":31},"寝屋川市"]
[null,"【ロ.地階の住宅又は老人ホーム等の部分】",{"$nulls":47},"同条第２項、第３項、第５項又は第６項の規定に基づき定められる当該建築物の建蔽率を記入",{"$nulls":31},"茨木市"]
[{"$nulls":11},"（",{"$nulls":4},{"$f":"IF(M40=\"\",\"\",\"㎡\")","v":""},"）","（",{"$nulls":4},{"$f":"IF(T40=\"\",\"\",\"㎡\")","v":""},"）","（",{"$f":"IF(M40+T40=0,\"\",M40+T40)","v":""},{"$nulls":3},{"$f":"IF(AA40=\"\",\"\",\"㎡\")","v":""},"）",{"$nulls":17},"してください。",{"$nulls":31},"箕面市"]
[null,"【ハ.エレベーターの昇降路の部分】",{"$nulls":46},"⑫","８欄は、別紙の表の用途の区分に従い対応する記号を記入した上で、主要用途をできるだけ",{"$nulls":31},"門真市"]
[{"$nulls":11},"（",{"$nulls":4},{"$f":"IF(M42=\"\",\"\",\"㎡\")","v":""},"）","（",{"$nulls":4},{"$f":"IF(T42=\"\",\"\",\"㎡\")","v":""},"）","（",{"$f":"IF(M42+T42=0,\"\",M42+T42)","v":""},{"$nulls":3},{"$f":"IF(AA42=\"\",\"\",\"㎡\")","v":""},"）",{"$nulls":17},"具体的に記入してください。",{"$nulls":31},"池田市"]
[null,"【ニ.共同住宅又は老人ホーム等の共用の廊下等の部分】",{"$nulls":46},"⑬","９欄は、該当するチェックボックスに「レ」マークを入れてください。",{"$nulls":31},"大阪府"]
[{"$nulls":11},"（",{"$nulls":4},{"$f":"IF(M44=\"\",\"\",\"㎡\")","v":""},"）","（",{"$nulls":4},{"$f":"IF(T44=\"\",\"\",\"㎡\")","v":""},"）","（",{"$f":"IF(M44+T44=0,\"\",M44+T44)","v":""},{"$nulls":3},{"$f":"IF(AA44=\"\",\"\",\"㎡\")","v":""},"）",{"$nulls":16},"⑭","10欄の「ロ」は、建築物に建築基準法施行令第２条第１項第２号に規定する特例軒等を設ける場",{"$nulls":31},"奈良市"]
[null,"【ホ.認定機械室等の部分】",{"$nulls":9},"（",{"$nulls":4},"","）","（",{"$nulls":4},"","）","（","",{"$nulls":3},"","）",{"$nulls":17},"合において、当該特例軒等のうち当該建築物の外壁又はこれに代わる柱の中心線から突き出た",{"$nulls":31},"生駒市"]
[null,"【ヘ.自動車車庫等の部分】",{"$nulls":9},"（",{"$nulls":4},"","）","（",{"$nulls":4},"","）","（","",{"$nulls":3},"","）",{"$nulls":17},"距離が水平距離１メートル以上５メートル未満のものにあっては当該中心線で囲まれた部分の水",{"$nulls":31},"橿原市"]
[null,"【ト.備蓄倉庫の部分】",{"$nulls":9},"（",{"$nulls":4},"","）","（",{"$nulls":4},"","）","（","",{"$nulls":3},"","）",{"$nulls":17},"平投影面積を、当該中心線から突き出た距離が水平距離５メートル以上のものにあっては当該特",{"$nulls":31},"奈良県"]
[null,"【チ.蓄電池の設置部分】",{"$nulls":9},"（",{"$nulls":4},"","）","（",{"$nulls":4},"","）","（","",{"$nulls":3},"","）",{"$nulls":17},"例軒等の端から同号に規定する国土交通大臣が定める距離後退した線で囲まれた部分の水平"]
[null,"【リ.自家発電設備の設置部分】",{"$nulls":9},"（",{"$nulls":4},"","）","（",{"$nulls":4},"","）","（","",{"$nulls":3},"","）",{"$nulls":17},"投影面積を記入してください。その他の建築物である場合においては、10欄の「イ」と同じ面積を"]
[null,"【ヌ.貯水槽の設置部分】",{"$nulls":9},"（",{"$nulls":4},"","）","（",{"$nulls":4},"","）","（","",{"$nulls":3},"","）",{"$nulls":17},"記入してください。"]
[null,"【ル.宅配ボックスの設置部分】",{"$nulls":9},"（",{"$nulls":4},"","）","（",{"$nulls":4},"","）","（","",{"$nulls":3},"","）",{"$nulls":16},"⑮","都市計画区域内、準都市計画区域内及び建築基準法第６８条の９第１項の規定に基づく条例"]
[null,"【ヲ.その他の不算入部分】",{"$nulls":9},"（",{"$nulls":4},"","）","（",{"$nulls":4},"","）","（","",{"$nulls":3},"","）",{"$nulls":17},"により建築物の容積率の最高限度が定められた区域内においては、１１欄の「ロ」に建築物の地"]
[null,"【ワ.住宅の部分】",{"$nulls":9},"（",{"$nulls":4},"","）","（",{"$nulls":4},"","）","（","",{"$nulls":3},"","）",{"$nulls":17},"階でその天井が地盤面からの高さ１メートル以下にあるものの住宅又は老人ホーム、福祉ホーム"]
[null,"【カ.老人ホーム等の部分】",{"$nulls":9},"（",{"$nulls":4},"","）","（",{"$nulls":4},"","）","（","",{"$nulls":3},"","）",{"$nulls":17},"その他これらに類するものの用途に供する部分、「ハ」にエレベーターの昇降路の部分、「ニ」に"]
[null,"【ヨ.延べ面積】",{"$nulls":21},"㎡",{"$nulls":25},"共同住宅又は老人ホーム、福祉ホームその他これらに類するものの共用の廊下又は階段の用に"]
[null,"【タ.容積率】",{"$nulls":5},{"$f":"IF(X26=\"\",\"\",IF(R55=\"\",\"\",IF(R56<=X26,\"\",\"容積率限度超えていませんか→\")))","v":""},{"$nulls":9},{"$f":"IF(R55=\"\",\"\",ROUNDUP(AL56,2))","v":""},{"$nulls":5},"％",{"$nulls":13},{"$f":"IF(R55=\"\",\"\",ROUNDDOWN(R55/M24*100,4))","v":""},{"$nulls":4},"％",{"$nulls":6},"供する部分、「ホ」に住宅又は老人ホーム、福祉ホームその他これらに類するものに設ける機械"]
["【12.建築物の数】",{"$nulls":48},"室その他これに類する建築物の部分（建築基準法施行規則第10条の４の４に規定する建築設備"]
[null,"【イ.申請に係る建築物の数】",{"$nulls":31},"←","10㎡以下の建物の数は含まない",{"$nulls":14},"を設置するためのものであって、同規則第10条の４の５各号に掲げる基準に適合するものに限る。）"]
[null,"【ロ.同一敷地内の他の建築物の数】",{"$nulls":32},"10㎡以下の建物について【18.その他】欄に記入",{"$nulls":14},"で、特定行政庁が交通上、安全上、防火上及び衛生上支障がないと認めるもの、「ヘ」に自動車"]
["【13.建築物の高さ等】",{"$nulls":9},"（","申請に係る建築物",{"$nulls":4},"）","（","他の建築物",{"$nulls":4},"）",{"$nulls":25},"車庫その他の専ら自動車又は自転車の停留又は駐車のための施設（誘導車路、操車場所及び"]
[null,"【イ.最高の高さ】",{"$nulls":8},"（",{"$nulls":4},"ｍ","）","（",{"$nulls":4},{"$f":"IF(S61=\"\",\"\",\"ｍ\")","v":""},"）",{"$nulls":25},"乗降場を含む。）の用途に供する部分、「ト」に専ら防災のために設ける備蓄倉庫の用途に供す"]
[null,"【ロ.階数】",{"$nulls":6},"地上",null,"（",{"$nulls":5},"）","（",{"$nulls":5},"）",{"$nulls":25},"る部分、「チ」に蓄電池（床に据え付けるものに限る。）を設ける部分、「リ」に自家発電設備を設け"]
[{"$nulls":8},"地下",null,"（",{"$nulls":5},"）","（",{"$nulls":5},"）",{"$nulls":10},"敷地内での主たる構造を記載し",{"$nulls":14},"る部分、「ヌ」に貯水槽を設ける部分、「ル」に宅配ボックス（配達された物品（荷受人が不在その"]
[null,"【ハ.構造】",{"$nulls":16},"一部",{"$nulls":14},"←","カッコ書きで申請部分の構造を記載",{"$nulls":14},"他の事由により受け取ることができないものに限る。）の一時保管のための荷受箱をいう。）を設け"]
[null,"【ニ.建築基準法第56条第7項の規定による特例の適用の有無】",{"$nulls":19},"□","有",null,"□","無",{"$nulls":7},"←","天空率適用の有無",{"$nulls":14},"る部分、「ワ」に住宅の用途に供する部分、「カ」に老人ホーム、福祉ホームその他これらに類する"]
[null,"【ホ.適用があるときは、特例の区分】",{"$nulls":47},"ものの用途に供する部分のそれぞれの床面積を記入してください。また、建築基準法令以外の法"]
[{"$nulls":3},"□","道路高さ制限不適用",{"$nulls":7},"□","隣地高さ制限不適用",{"$nulls":7},"□","北側高さ制限不適用",{"$nulls":26},"令の規定により、容積率の算定の基礎となる延べ面積に算入しない部分を有する場合においては、"]
["【14.許可・認定等】",{"$nulls":48},"「ヲ」に当該部分の床面積を記入してください。"]
[{"$nulls":48},"⑯","住宅又は老人ホーム、福祉ホームその他これらに類するものについては、１１欄の「ロ」の床面"]
[{"$nulls":49},"積は、その地階の住宅又は老人ホーム、福祉ホームその他これらに類するものの用途に供する"]
[{"$nulls":49},"部分の床面積から、その地階のエレベーターの昇降路の部分又は共同住宅若しくは老人ホーム、"]
[{"$nulls":49},"福祉ホームその他これらに類するものの共用の廊下若しくは階段の用に供する部分の床面積を除"]
["【15.工事着手予定年月日】",{"$nulls":10},"令和",{"$nulls":3},"年",null,null,"月",null,null,"日",{"$nulls":27},"いた面積とします。"]
["【16.工事完了予定年月日】",{"$nulls":10},"令和",{"$nulls":3},"年",null,null,"月",null,null,"日",{"$nulls":26},"⑰","１１欄の「ワ」の延べ面積及び「カ」の容積率の算定の基礎となる延べ面積は、各階の床面積の"]
["【17.特定工程工事終了予定年月日】",{"$nulls":15},"（特定工程）",{"$nulls":32},"合計から「ロ」に記入した床面積（この面積が敷地内の建築物の住宅及び老人ホーム、福祉ホー"]
[null,"（ 第",null,null,"回 ）",null,"令和",null,null,"年",null,"月",null,"日","（",{"$nulls":16},"）",null,"←","特定行政庁により特定工程名称が異なります",{"$nulls":14},"ムその他これらに類するものの用途に供する部分（エレベーターの昇降路の部分又は共同住宅"]
[null,"（ 第",null,null,"回 ）",null,"令和",null,null,"年",null,"月",null,"日","（",{"$nulls":16},"）",{"$nulls":17},"若しくは老人ホーム、福祉ホームその他これらに類するものの共用の廊下若しくは階段の用に供"]
[null,"（ 第",null,null,"回 ）",null,"令和",null,null,"年",null,"月",null,"日","（",{"$nulls":16},"）",{"$nulls":17},"する部分を除く。）の床面積の合計の３分の１を超える場合においては、敷地内の建築物の住宅"]
["【18.建築基準法施行令第43条第１項及び第46条第４項等に係る経過措置の適用】",{"$nulls":32},"【19.その他必要な事項】",{"$nulls":15},"及び老人ホーム、福祉ホームその他これらに類するものの用途に供する部分（エレベーターの昇"]
[null,"【イ.適用の有無】",{"$nulls":6},"□","有",null,"□","無",{"$nulls":21},"10㎡以下の建物がある場合申請建物、",{"$nulls":14},"降路の部分又は共同住宅若しくは老人ホーム、福祉ホームその他これらに類するものの共用の"]
[null,"【ロ.適用があるときは、その区分】",{"$nulls":32},"既設建物の概要",{"$nulls":14},"廊下若しくは階段の用に供する部分を除く。）の床面積の合計の３分の１の面積）、「ハ」及び「ニ」"]
[{"$nulls":3},"□","建築基準法施行令第43条第１項及び第46条第４項",{"$nulls":29},"法86条の7を適用する場合、適用政令条項",{"$nulls":14},"に記入した床面積並びに「ホ」から「ヌ」までに記入した床面積（これらの面積が、次の(1)から(6)ま"]
[{"$nulls":3},"□","その他",{"$nulls":29},"及び適用（基準時及び原因）",{"$nulls":14},"でに掲げる建築物の部分の区分に応じ、敷地内の建築物の各階の床面積の合計にそれぞれ(1)"]
["【19.その他必要な事項】",{"$nulls":33},"滋賀県内取扱基準における別棟を適用した",{"$nulls":14},"から(6)までに定める割合を乗じて得た面積を超える場合においては、敷地内の建築物の各階の"]
[{"$nulls":34},"場合、別棟の適用基準番号",{"$nulls":14},"床面積の合計にそれぞれ(1)から(5)までに定める割合を乗じて得た面積）を除いた面積とします。"]
[{"$nulls":34},"都市計画法第41条である場合区域内である旨",{"$nulls":14},"また、建築基準法第５２条第１２項の規定を適用する場合においては、「カ」の容積率の算定の基"]
[{"$nulls":34},"都計法58条の2、基準法68条の2も同様",{"$nulls":14},"礎となる敷地面積は、７欄「ホ」(2)によることとします。"]
["【20.備考】",{"$nulls":32},"【20.備考】",{"$nulls":15},"(1)　自動車車庫等の部分　５分の１"]
[{"$nulls":33},"←","計画変更の場合、第三面に係る部分の",{"$nulls":14},"(2)　備蓄倉庫の部分　50分の１"]
[{"$nulls":34},"【計画変更の概要】",{"$nulls":5},"記入",{"$nulls":8},"(3)　蓄電池の設置部分　50分の１"]
[{"$nulls":49},"(4)　自家発電設備の設置部分　100分の１"]
[{"$nulls":49},"(5)　貯水槽の設置部分　100分の１"]
[{"$nulls":49},"(6)  宅配ボックスの設置部分　100分の1"]
[{"$nulls":48},"⑱","12欄の建築物の数は、延べ面積が10平方メートルを超えるものについて記入してください。"]
[{"$nulls":48},"⑲","13欄の「イ」及び「ロ」は、申請に係る建築物又は同一敷地内の他の建築物がそれぞれ２以上"]
[{"$nulls":49},"ある場合においては、最大のものを記入してください。"]
[{"$nulls":48},"⑳","13欄の「ハ」は、敷地内の建築物の主たる構造について記入してください。"]
[{"$nulls":48},"㉑","13欄の「ニ」は、該当するチェックボックスに「レ」マークを入れてください。"]
[{"$nulls":48},"㉒","13欄の「ホ」は、建築基準法第56条第７項第１号に掲げる規定が適用されない建築物について"]
[{"$nulls":49},"は「道路高さ制限不適用」、同項第２号に掲げる規定が適用されない建築物については「隣地"]
[{"$nulls":49},"高さ制限不適用」、同項第３号に掲げる規定が適用されない建築物については「北側高さ制限"]
[{"$nulls":49},"不適用」のチェックボックスに「レ」マークを入れてください。"]
{"$rows_empty":10}
[null,"滋賀県",{"$nulls":3},"下水道処理区域",{"$nulls":7},"角地緩和適用",{"$nulls":5},"08010",{"$nulls":5},"造"]
[null,"京都府",{"$nulls":11},"加重平均",{"$nulls":11},"木造"]
[null,"大阪府",{"$nulls":3},"（法43条第2項第1号）",{"$nulls":7},"地区計画による（法68条の2の制限による）",{"$nulls":5},"一戸建ての住宅",{"$nulls":5},"木造（枠組壁工法）",{"$nulls":6},"住宅用火災警報器設置"]
[null,"奈良県",{"$nulls":3},"（法43条第2項第2号）",{"$nulls":7},"都市計画法第41条の制限による",{"$nulls":11},"鉄骨造"]
[{"$nulls":13},"許可基準による",{"$nulls":11},"鉄筋コンクリート造"]
[{"$nulls":13},"風致地区による",{"$nulls":11},"壁式鉄筋コンクリート造"]
[null,"入力規則",{"$nulls":11},"など"]
[null,"第一種低層\n住居専用地域",{"$nulls":23},"一部"]
[null,"第二種低層\n住居専用地域"]
[null,"第一種中高層\n住居専用地域"]
[null,"第二種中高層\n住居専用地域"]
[null,"第一種住居\n地域",{"$nulls":11},"都市計画法第〇〇条に基づく許可、条項、許可番号、日付"]
[null,"第二種住居\n地域",{"$nulls":11},"都市計画法第〇〇条に基づく許可、条項、検査番号、日付"]
[null,"準住居地域",{"$nulls":11},"都市計画法施行規則第60条に基づく証明、証明番号、日付"]
[null,"田園住居地域",{"$nulls":11},"建築基準法に基づく許可条項、許可番号、認定条項、認定番号、日付"]
[null,"近隣商業地域",{"$nulls":11},"水路占用等の許可番号、日付、協議済である旨等"]
[null,"商業地域",{"$nulls":11},"建築基準法第68条の11又は第68条の22の規定に基づき認証を受けた型式認証番号、日付"]
[null,"準工業地域",{"$nulls":11},"建築物省エネ法に基づく省エネ適合性判定、判定番号、日付"]
[null,"工業地域",{"$nulls":11},"建築物省エネ法第20条第一号による適用除外（用途名称）"]
[null,"工業専用地域",{"$nulls":11},"都市計画法第58条の2（建築基準法第68条の2も同様）に基づく地区計画の届出　受理番号、日付"]
[null,"指定無し",{"$nulls":11},"宅地造成及び特定盛土等規制法に基づく許可条項、許可番号、検査番号、日付、又は届出条項、届出受理日"]
[{"$nulls":13},"宅地造成及び特定盛土等規制法施行規則第88条に基づく証明、証明番号、日付"]
[{"$nulls":13},"美観認定番号、日付"]
[{"$nulls":13},"風致地区許可番号、日付"]
[]
[{"$nulls":48},"㉓","建築物及びその敷地に関して許可・認定等を受けた場合には、根拠となる法令及びその条項、"]
[{"$nulls":49},"当該許可・認定等の番号並びに許可・認定等を受けた日付について14欄又は別紙に記載して"]
[{"$nulls":49},"添えてください。"]
[{"$nulls":48},"㉔","７欄の「ハ」、「ニ」、「ヘ」及び「ト」、10欄の「ロ」並びに11欄の「タ」は、百分率を用いてください。"]
[{"$nulls":48},"㉕","18欄の「イ」は、建築士法第20条の２第２項に規定する構造関係規定に係る経過措置の適用を"]
[{"$nulls":49},"受ける場合は、「有」に「レ」マークを入れてください。同項に規定する構造関係規定に係る経過"]
[{"$nulls":49},"措置の適用を受けない場合は、「無」に「レ」マークを入れてください。なお、申請に係る建築物"]
[{"$nulls":49},"が複数ある場合で、そのうち一部の建築物のみが建築士法第20条の２第２項に規定する構造関"]
[{"$nulls":49},"係規定に係る経過措置の適用を受ける場合は、「有」に「レ」マークを入れた上で、20欄に当該"]
[{"$nulls":49},"建築物の番号（第四面の１欄の番号をいう。）を記入してください。"]
[{"$nulls":48},"㉖","18欄の「ロ」は、建築基準法施行令第43条第１項及び第46条第４項に係る経過措置の適用を受"]
[{"$nulls":49},"ける場合は、「建築基準法施行令第43条第１項及び第46条第４項」に「レ」マークを入れてくださ"]
[{"$nulls":49},"い。建築士法第20条の２第２項に規定する構造関係規定のうち建築基準法施行令第43条第１項"]
[{"$nulls":49},"及び第46条第４項以外の規定に係る経過措置の適用を受ける場合は、「その他」に「レ」マークを"]
[{"$nulls":49},"入れてください。"]
[{"$nulls":48},"㉗","建築基準法第86条の７、同法第86条の８又は同法87条の２の規定の適用を受ける場合において"]
[{"$nulls":49},"は、工事の完了後においても引き続き同法第３条第２項（同法第86条の９第１項において準用す"]
[{"$nulls":49},"る場合を含む。）の適用を受けない規定並びに当該規定に適合しないこととなつた時期及び理由"]
[{"$nulls":49},"を18欄又は別紙に記載して添えてください。"]
[{"$nulls":48},"㉘","ここに書き表せない事項で特に確認を受けようとする事項は、18欄又は別紙に記載して添えてくだ"]
[{"$nulls":49},"さい。"]
[{"$nulls":48},"㉙","計画の変更申請の際は、19欄に第三面に係る部分の変更の概要について記入してください。"]

{"sheet":"申四面","index":5,"n_rows":97,"n_cols":49,"rows_kept":97,"merged":[[2,8,2,10],[2,11,2,30],[3,8,3,10],[3,12,3,30],[4,8,4,10],[4,12,4,30],[5,8,5,10],[5,12,5,30],[6,8,6,10],[6,12,6,30],[7,8,7,10],[7,12,7,30],[10,5,10,13],[10,15,10,16],[10,17,10,25],[34,12,34,13],[35,12,35,13],[36,12,36,13],[37,12,37,13],[39,10,39,13],[40,10,40,13],[41,8,41,31],[52,4,52,5],[52,9,52,24],[53,4,53,5],[53,19,53,23],[55,22,55,26],[56,14,56,25],[59,14,59,25],[60,11,60,15],[60,18,60,22],[60,25,60,29],[61,6,61,7],[61,11,61,14],[61,18,61,21],[61,25,61,28],[62,6,62,7],[62,11,62,14],[62,18,62,21],[62,25,62,28],[63,6,63,7],[63,11,63,14],[63,18,63,21],[63,25,63,28],[64,6,64,7],[64,11,64,14],[64,18,64,21],[64,25,64,28],[65,6,65,7],[65,11,65,14],[65,18,65,21],[65,25,65,28],[66,6,66,7],[66,11,66,14],[66,18,66,21],[66,25,66,28],[67,11,67,14],[67,18,67,21],[67,25,67,28],[68,5,68,31],[69,5,69,31],[70,5,70,31],[71,9,71,31],[72,9,72,31],[73,9,73,31],[74,5,74,31],[75,1,75,31],[76,1,76,31]]}
["（第四面）",{"$nulls":46},"シートの保護を解除すると編集が可能になります（パスワードなし）"]
["建築物別概要",{"$nulls":46},"（注意）第四面"]
["【1.番号】",{"$nulls":46},"①","この書類は、申請建築物ごと（延べ面積が10平方メートル以内のものを除く。以下同じ。）"]
["【2.用途】",{"$nulls":4},"（ 区分",{"$nulls":5},"）",{"$nulls":36},"に作成してください。"]
[{"$nulls":5},"（ 区分",{"$nulls":5},"）",{"$nulls":35},"②","この書類に記載する事項のうち、10欄から15欄までの事項については、別紙に明示して添"]
[{"$nulls":5},"（ 区分",{"$nulls":5},"）",{"$nulls":36},"付すれば記載する必要はありません。"]
[{"$nulls":5},"（ 区分",{"$nulls":5},"）",{"$nulls":35},"③","１欄は、建築物の数が１のときは「１」と記入し、建築物の数が２以上のときは、申請建築物"]
[{"$nulls":5},"（ 区分",{"$nulls":5},"）",{"$nulls":36},"ごとに通し番号を付し、その番号を記入してください。"]
["【3.工事種別】",{"$nulls":46},"④","２欄は、別紙の表の用途の区分に従い対応する記号を記入した上で、用途をできるだけ具"]
[null,null,"□","新築",null,"□","増築",null,"□","改築",null,"□","移転",null,"□","用途変更",null,null,"□","大規模の修繕",{"$nulls":4},"□","大規模の模様替",{"$nulls":22},"体的に書いてください。"]
["【4.構造】",{"$nulls":4},"造",{"$nulls":41},"⑤","３欄は、該当するチェックボックスに「レ」マークを入れてください。"]
["【5.主要構造部】",{"$nulls":46},"⑥","５欄は「耐火構造（防火上及び避難上支障がない主要構造部を有しない場合）」、「耐火構造"]
[null,null,"□","耐火構造（防火上及び避難上支障がない主要構造部を有しない場合）",{"$nulls":44},"（防火上及び避難上支障がない主要構造部を有する場合）」、「建築基準法施行令第108条の４"]
[null,null,"□","耐火構造（防火上及び避難上支障がない主要構造部を有する場合）",{"$nulls":44},"第１項第１号イ及びロに掲げる基準に適合する構造」「準耐火構造」、「準耐火構造と同等の"]
[null,null,"□","建築基準法施行令第108条の４第１項第１号イ及びロ\nに掲げる基準に適合する構造\n",{"$nulls":44},"準耐火性能を有する構造（ロ―１）」（建築基準法施行令第109条の３第１号に掲げる基準に"]
[null,null,"□","準耐火構造",{"$nulls":44},"適合する主要構造部の構造をいう）又は「準耐火構造と同等の準耐火性能を有する構造（ロ―２）」"]
[null,null,"□","準耐火構造と同等の準耐火性能を有する構造（ロ-１）",{"$nulls":44},"（同条第２号に掲げる基準に適合する主要構造部の構造をいう）のうち該当するチェックボックス"]
[null,null,"□","準耐火構造と同等の準耐火性能を有する構造（ロ-２）",{"$nulls":44},"に「レ」マークを入れてください。いずれも該当しない場合は「その他」に「レ」マークを入れてください。"]
[null,null,"□","その他",{"$nulls":43},"⑦","６欄は「建築基準法施行令第109条の５第１号に掲げる基準に適合する構造」、「建築基"]
["【6.建築基準法第21条及び第27条の規定の適用】",{"$nulls":47},"準法第21条第１項ただし書に該当する建築物」、「建築基準法施行令第109条の７第１項第"]
[null,null,"□","建築基準法施行令第109条の５第１号に掲げる基準に適合する構造",{"$nulls":44},"１号に掲げる基準に適合する構造」、「建築基準法施行令第110条第１号に掲げる基準に適"]
[null,null,"□","建築基準法第21条第1項ただし書きに該当する建築物",{"$nulls":44},"合する構造」又は「その他」（上記のいずれかに該当しない建築物で、建築基準法第21条又"]
[null,null,"□","建築基準法施行令第109条の７第１項第１号に掲げる基準に適合する構造",{"$nulls":44},"は第27条の規定の適用を受けるもの）のうち該当するチェックボックス全てに「レ」マークを入れ"]
[null,null,"□","建築基準法施行令第110条第1号に掲げる基準に適合する構造",{"$nulls":44},"てください。また、「建築基準法施行令第109条の５第１号に掲げる基準に適合する構造」又は"]
[null,null,"□","その他",{"$nulls":44},"「建築基準法施行令第110条第１号に掲げる基準に適合する構造」に該当する場合においては、"]
[null,null,"□","建築基準法第21条又は第27条の規定の適用を受けない",{"$nulls":44},"５欄の「準耐火構造」のチェックボックスにも「レ」マークを入れてください。建築基準法第21条"]
["【7.建築基準法第61条の規定の適用】",{"$nulls":47},"又は第27条の規定の適用を受けない場合は「建築基準法第21条又は第27条の規定の適用を"]
[null,null,"□","耐火建築物",{"$nulls":44},"受けない」に「レ」マークを入れてください。"]
[null,null,"□","延焼防止建築物",{"$nulls":43},"⑧","７欄は、「耐火建築物」、「延焼防止建築物」（建築基準法施行令第136条の２第１号ロに掲げ"]
[null,null,"□","準耐火建築物",{"$nulls":44},"る基準に適合する建築物をいう。）、「準耐火建築物」、「準延焼防止建築物」（同条第２号ロ"]
[null,null,"□","準延焼防止建築物",{"$nulls":44},"に掲げる基準に適合する建築物をいう。）又は「その他」（上記のいずれにも該当しない建築"]
[null,null,"□","その他",{"$nulls":44},"物で、建築基準法第61条の規定の適用を受けるもの）のうち該当するチェックボックスに「レ」"]
[null,null,"□","建築基準法第61条の規定の適用を受けない",{"$nulls":44},"マークを入れてください。建築基準法第61条の規定の適用を受けない場合は「建築基準法"]
["【8.階数】",{"$nulls":47},"第61条の規定の適用を受けない」に「レ」マークを入れてください。"]
[null,"【イ.地階を除く階数】",{"$nulls":12},"階",{"$nulls":32},"⑨","８欄の「ハ」は、建築基準法施行令第２条第１項第８号により階数に算入されない建築物"]
[null,"【ロ.地階の階数】",{"$nulls":12},{"$f":"IF(M36=\"\",\"\",\"階\")","v":""},{"$nulls":33},"の部分のうち昇降機塔、装飾塔、物見塔その他これらに類する建築物の屋上部分の階の"]
[null,"【ハ.昇降機塔等の階の数】",{"$nulls":12},{"$f":"IF(M37=\"\",\"\",\"階\")","v":""},{"$nulls":33},"数を記入してください。"]
[null,"【ニ.地階の倉庫等の階の数】",{"$nulls":12},{"$f":"IF(M38=\"\",\"\",\"階\")","v":""},{"$nulls":32},"⑩","８欄の「ニ」は、建築基準法施行令第２条第１項第８号により階数に算入されない建築物の"]
["【9.高さ】",{"$nulls":47},"部分のうち地階の倉庫、機械室その他これらに類する建築物の部分の階の数を記入して"]
[null,"【イ.最高の高さ】",{"$nulls":12},"ｍ",{"$nulls":33},"ください。"]
[null,"【ロ.最高の軒の高さ】",{"$nulls":12},"ｍ",{"$nulls":32},"⑪","10欄は、別紙にその概要を記載して添えてください。ただし、当該建築設備が特定の建築"]
["【10.建築設備の種類】",{"$nulls":47},"基準関係規定に適合していることを証する書面を添える場合には、当該建築基準関係規"]
["【11.確認の特例】",{"$nulls":47},"定に係る内容を概要として記載する必要はありません。"]
[null,"【イ.建築基準法第６条の３第１項ただし書又は法第18条第４項ただし書の規定による審査の特例",{"$nulls":31},"←","構造計算ルート2の特例を受ける場合",{"$nulls":12},"⑫","11欄の「イ」及び「ロ」は、該当するチェックボックスに「レ」マークを入れてください。"]
[null,"　　の適用の有無】",{"$nulls":16},"□","有",null,"□","無",{"$nulls":24},"⑬","11欄の「ハ」は、建築基準法第6条の4第1項の規定による確認の特例の適用がある場合に、"]
[null,"【ロ.適用があるときは、特例の区分】",{"$nulls":46},"建築基準法施行令第10条各号に掲げる建築物のうち、該当するものの号に数字を記入し"]
[{"$nulls":3},"□","建築基準法第６条の３第１項第１号に掲げる確認審査又は同法第18条第５項第１号に掲",{"$nulls":28},"←","構造計算ルート2の特例を受ける場合",{"$nulls":13},"てください。"]
[{"$nulls":4},"げる審査",{"$nulls":29},"通常こちら",{"$nulls":12},"⑭","11欄の「ニ」は、建築基準法施行令第10条第一号または第二号に掲げる建築物に該当す"]
[{"$nulls":3},"□","建築基準法第６条の３第１項第２号に掲げる確認審査又は同法第18条第５項第２号に掲",{"$nulls":28},"←","特殊な構造による場合",{"$nulls":13},"る場合にのみ記入してください。また、11欄の「ホ」は、同条第一号に掲げる建築物に該当"]
[{"$nulls":4},"げる審査",{"$nulls":43},"する場合に、該当するチェックボックスに「レ」マークを入れてください。"]
[{"$nulls":4},"（構造設計を行った構造設計一級建築士又は構造関係規定に適合することを確認した構",{"$nulls":42},"⑮","11欄の「へ」は、建築基準法第68条の20第1項に掲げる認証型式部材等に該当する場合"]
[{"$nulls":4},"造設計一級建築士）",{"$nulls":43},"にのみ記入してください。当該認証番号を記入すれば、第10条の5の4第一号に該当する"]
[{"$nulls":4},"（1）",null,"氏名",{"$nulls":41},"認証型式部材等の場合にあっては10欄の概要、11欄の「ニ」（屎尿浄化槽又は合併処理浄"]
[{"$nulls":4},"（2）",null,"資格",null,null,"構造設計一級建築士交付",{"$nulls":8},"第",{"$nulls":5},"号",{"$nulls":23},"化槽並びに給水タンク又は貯水タンクで屋上又は屋内以外にあるものに係るものを除く。)"]
[null,"【ハ.建築基準法第６条の４第１項の規定による確認の特例の適用の有無】",{"$nulls":23},"□","有",null,"□","無",{"$nulls":3},"←","確認の特例はこちら",{"$nulls":13},"並びに13欄から16欄まで及び第5面の３欄から６欄までの事項について、同条第二号に該"]
[null,"【ニ.建築基準法施行令第10条各号に掲げる建築物の区分】",{"$nulls":19},"第",{"$nulls":5},"号",{"$nulls":20},"当する認証型式部材等の場合ににあっては11欄の「ニ」（当該認証型式部材等に係るものに"]
[null,"【ホ.認定型式の認定番号】",{"$nulls":11},"第",{"$nulls":12},"号",{"$nulls":21},"限る。）並びに13欄から16欄まで及び第5面の３欄から６欄までの事項について、同条第三"]
[null,"【ヘ.適合する一連の規定の区分】",{"$nulls":11},"□","建築基準法施行令第136条の2の11第一号イ",{"$nulls":33},"号に該当する認証型式部材等の場合にあっては10欄の概要及び11欄の「ニ」「当該認証型式"]
[{"$nulls":13},"□","建築基準法施行令第136条の2の11第一号ロ",{"$nulls":33},"部材等に係るものに限る。）については記入する必要はありません。"]
[null,"【ト.認証型式部材等の認証番号】",{"$nulls":11},"第",{"$nulls":12},"号",{"$nulls":20},"⑯","12欄の「イ」は、最上階から順に記入してください。記入欄が不足する場合には、別紙に必"]
["【12.床面積】",{"$nulls":9},"（","申請部分",{"$nulls":4},"）","（","申請以外の部分",{"$nulls":4},"）","（","合計",{"$nulls":4},"）",{"$nulls":17},"要な事項を記入し添えてください。"]
[null,"【イ.階別】",{"$nulls":3},"（",null,null,"階）",null,"（",{"$nulls":4},"㎡","）","（",{"$nulls":4},{"$f":"IF(S62=\"\",\"\",\"㎡\")","v":""},"）","（",{"$f":"IF(L62+S62=0,\"\",L62+S62)","v":""},{"$nulls":3},"㎡","）",null,null,"←","最上階から順に",{"$nulls":12},"⑰","16欄は、最下階の居室の床が木造である場合に記入してください。"]
[{"$nulls":5},"（",null,null,"階）",null,"（",{"$nulls":4},{"$f":"IF(L63=\"\",\"\",\"㎡\")","v":""},"）","（",{"$nulls":4},{"$f":"IF(S63=\"\",\"\",\"㎡\")","v":""},"）","（","",{"$nulls":3},{"$f":"IF(Z63=\"\",\"\",\"㎡\")","v":""},"）",{"$nulls":16},"⑱","17欄は、「水洗」、「くみ取り」又は「くみ取り（改良）」のうち該当するものを記入してください。"]
[{"$nulls":5},"（",null,null,"階）",null,"（",{"$nulls":4},{"$f":"IF(L64=\"\",\"\",\"㎡\")","v":""},"）","（",{"$nulls":4},"","）","（","",{"$nulls":3},{"$f":"IF(Z64=\"\",\"\",\"㎡\")","v":""},"）",{"$nulls":16},"⑲","ここに書き表せない事項で特に確認を受けようとする事項は、18欄又は別紙に記載して添"]
[{"$nulls":5},"（",null,null,"階）",null,"（",{"$nulls":4},{"$f":"IF(L65=\"\",\"\",\"㎡\")","v":""},"）","（",{"$nulls":4},"","）","（","",{"$nulls":3},{"$f":"IF(Z65=\"\",\"\",\"㎡\")","v":""},"）",{"$nulls":17},"えてください。"]
[{"$nulls":5},"（",null,null,"階）",null,"（",{"$nulls":4},{"$f":"IF(L66=\"\",\"\",\"㎡\")","v":""},"）","（",{"$nulls":4},"","）","（","",{"$nulls":3},{"$f":"IF(Z66=\"\",\"\",\"㎡\")","v":""},"）",{"$nulls":16},"⑳","申請建築物が高床式住宅（豪雪地において積雪対策のため通常より床を高くした住宅を"]
[{"$nulls":5},"（",null,null,"階）",null,"（",{"$nulls":4},{"$f":"IF(L67=\"\",\"\",\"㎡\")","v":""},"）","（",{"$nulls":4},"","）","（","",{"$nulls":3},{"$f":"IF(Z67=\"\",\"\",\"㎡\")","v":""},"）",{"$nulls":17},"いう。）である場合には、床面積の算定において床下部分の面積を除くものとし、19欄に、"]
[null,"【ロ.合計】",{"$nulls":8},"（",{"$f":"IF(SUM(L62:O67)=0,\"\",SUM(L62:O67))","v":""},{"$nulls":3},"㎡","）","（",{"$f":"IF(SUM(S62:V67)=0,\"\",SUM(S62:V67))","v":""},{"$nulls":3},"","）","（",{"$f":"IF(SUM(Z62:AC67)=0,\"\",SUM(Z62:AC67))","v":""},{"$nulls":3},"㎡","）",{"$nulls":17},"高床式住宅である旨及び床下部分の面積を記入してください。"]
["【13.屋根】",{"$nulls":46},"㉑","計画の変更申請の際は、19欄に第四面に係る部分の変更の概要について記入してくださ"]
["【14.外壁】",{"$nulls":32},"←","防火構造等で認定を使う場合は認定の",{"$nulls":13},"い。"]
["【15.軒裏】",{"$nulls":33},"内容に適合する屋内側被覆材も記入"]
["【16.居室の床の高さ】"]
["【17.便所の種類】"]
["【18.その他必要な事項】"]
["【19.備考】",{"$nulls":32},"←","計画変更の場合第四面に係る部分の"]
[{"$nulls":34},"【計画変更の概要】",{"$nulls":6},"記入"]
{"$rows_empty":12}
[null,"08010",{"$nulls":5},"造",{"$nulls":8},1,{"$nulls":4},"水洗（公共下水）",{"$nulls":8},"住宅用火災警報器設置"]
[{"$nulls":7},"木造",{"$nulls":8},2,{"$nulls":4},"水洗（農村下水）"]
[null,"一戸建ての住宅",{"$nulls":5},"木造（枠組壁工法）",{"$nulls":8},3,{"$nulls":4},"水洗（合併浄化槽）"]
[{"$nulls":7},"鉄骨造",{"$nulls":8},4,{"$nulls":4},"水洗（団地内浄化槽）"]
[{"$nulls":7},"鉄筋コンクリート造",{"$nulls":13},"くみ取り"]
[{"$nulls":7},"壁式鉄筋コンクリート造",{"$nulls":13},"くみ取り（改良）"]
[]
[{"$nulls":7},"一部"]
[null,"電気、ガス、給水、排水、換気、暖房、冷房、消火、排煙、汚物処理設備、煙突、避雷、昇降機（別途申請）"]

{"sheet":"申五面","index":6,"n_rows":54,"n_cols":48,"rows_kept":54,"merged":[[2,10,2,11],[2,12,2,27],[3,10,3,11],[4,9,4,11],[4,15,4,17],[5,9,5,11],[6,9,6,11],[8,9,8,11],[11,4,11,6],[11,9,11,20],[11,23,11,27],[12,4,12,6],[12,9,12,20],[12,23,12,26],[13,4,13,6],[13,9,13,20],[13,23,13,26],[14,4,14,6],[14,9,14,20],[14,23,14,26],[15,4,15,6],[15,9,15,20],[15,23,15,26],[16,4,16,6],[16,9,16,20],[16,23,16,26],[17,4,17,6],[17,9,17,20],[17,23,17,26],[18,7,18,28],[19,3,19,28],[24,10,24,11],[24,12,24,27],[25,10,25,11],[26,9,26,11],[26,15,26,17],[27,9,27,11],[28,9,28,11],[30,9,30,11],[33,4,33,6],[33,9,33,20],[33,23,33,27],[34,4,34,6],[34,9,34,20],[34,23,34,26],[35,4,35,6],[35,9,35,20],[35,23,35,26],[36,4,36,6],[36,9,36,20],[36,23,36,26],[37,4,37,6],[37,9,37,20],[37,23,37,26],[38,4,38,6],[38,9,38,20],[38,23,38,26],[39,4,39,6],[39,9,39,20],[39,23,39,26],[40,7,40,28],[41,3,41,28]]}
["（第五面）",{"$nulls":45},"シートの保護を解除すると編集が可能になります（パスワードなし）"]
["建築物の階別概要",{"$nulls":45},"（注意）第五面"]
["【1.番号】",{"$nulls":45},"①","この書類に記載すべき事項を別紙に明示して添付すれば、この書類を別途提出する必要は"]
["【2.階】",{"$nulls":11},"階",{"$nulls":34},"ありません。"]
["【3.柱の小径】",{"$nulls":11},"mm",{"$nulls":5},{"$f":"IF(O5=\"\",\"\",M5)","v":""},{"$nulls":27},"②","この書類は、各申請建築物の階ごとに作成してください。ただし、木造の場合は３欄から"]
["【4.横架材間の垂直距離】",{"$nulls":11},"ｍ",{"$nulls":34},"８欄まで、木造以外の場合は５欄から８欄までの記載内容が同じときは、２欄に同じ記載内"]
["【5.階の高さ】",{"$nulls":11},"ｍ",{"$nulls":34},"容となる階を列記し、併せて１枚とすることができます。"]
["【6.天井】",{"$nulls":45},"③","１欄は、第二号様式の第四面の１欄に記入した番号と同じ番号を記入してください。"]
[null,"【ｲ.居室の天井の高さ】",{"$nulls":10},"ｍ",{"$nulls":33},"④","３欄及び４欄は、木造の場合にのみ記入してください。"]
[null,"【ﾛ.建築基準法施行令第39条第3項に規定する特定天井】",{"$nulls":16},"□","有",null,"□","無",{"$nulls":23},"⑤","６欄の「ロ」は、該当するチェックボックスに「レ」マークを入れてください。"]
["【7.用途別床面積】",{"$nulls":45},"⑥","７欄は、別紙の表の用途の区分に従い対応する記号を記入した上で、用途をできるだけ具"]
[{"$nulls":3},"（","用途の区分",null,null,"）","（","具体的な用途の名称",{"$nulls":11},"）","（","床面積",{"$nulls":4},"）",{"$nulls":18},"体的に書き、それぞれの用途に供する部分の床面積を記入してください。"]
[null,"【イ.】",null,"（",{"$nulls":3},"）","（",{"$nulls":12},"）","（",{"$nulls":4},"㎡","）",{"$nulls":17},"⑦","ここに書き表せない事項で特に確認を受けようとする事項は、８欄又は別紙に記載して添"]
[null,"【ロ.】",null,"（",{"$nulls":3},"）","（",{"$nulls":12},"）","（",{"$nulls":4},{"$f":"IF(X14=\"\",\"\",\"㎡\")","v":""},"）",{"$nulls":18},"えてください。"]
[null,"【ハ.】",null,"（",{"$nulls":3},"）","（",{"$nulls":12},"）","（",{"$nulls":4},{"$f":"IF(X15=\"\",\"\",\"㎡\")","v":""},"）",{"$nulls":17},"⑧","計画の変更申請の際は、９欄に第五面に係る部分の変更の概要について記入してください。"]
[null,"【ニ.】",null,"（",{"$nulls":3},"）","（",{"$nulls":12},"）","（",{"$nulls":4},{"$f":"IF(X16=\"\",\"\",\"㎡\")","v":""},"）"]
[null,"【ホ.】",null,"（",{"$nulls":3},"）","（",{"$nulls":12},"）","（",{"$nulls":4},{"$f":"IF(X17=\"\",\"\",\"㎡\")","v":""},"）"]
[null,"【ヘ.】",null,"（",{"$nulls":3},"）","（",{"$nulls":12},"）","（",{"$nulls":4},{"$f":"IF(X18=\"\",\"\",\"㎡\")","v":""},"）"]
["【8.その他必要な事項】"]
["【9.備考】",{"$nulls":29},"←","計画変更の場合第五面に係る部分の"]
[{"$nulls":31},"【計画変更の概要】",{"$nulls":5},"記入"]
[]
["（第五面）"]
["建築物の階別概要"]
["【1.番号】"]
["【2.階】",{"$nulls":11},"階"]
["【3.柱の小径】",{"$nulls":11},"mm",{"$nulls":5},{"$f":"IF(O27=\"\",\"\",M27)","v":""}]
["【4.横架材間の垂直距離】",{"$nulls":11},"ｍ"]
["【5.階の高さ】",{"$nulls":11},"ｍ"]
["【6.天井】"]
[null,"【ｲ.居室の天井の高さ】",{"$nulls":10},"ｍ"]
[null,"【ﾛ.建築基準法施行令第39条第3項に規定する特定天井】",{"$nulls":16},"□","有",null,"□","無"]
["【7.用途別床面積】"]
[{"$nulls":3},"（","用途の区分",null,null,"）","（","具体的な用途の名称",{"$nulls":11},"）","（","床面積",{"$nulls":4},"）"]
[null,"【イ.】",null,"（",{"$nulls":3},"）","（",{"$nulls":12},"）","（",{"$nulls":4},"㎡","）"]
[null,"【ロ.】",null,"（",{"$nulls":3},"）","（",{"$nulls":12},"）","（",{"$nulls":4},{"$f":"IF(X36=\"\",\"\",\"㎡\")","v":""},"）"]
[null,"【ハ.】",null,"（",{"$nulls":3},"）","（",{"$nulls":12},"）","（",{"$nulls":4},{"$f":"IF(X37=\"\",\"\",\"㎡\")","v":""},"）"]
[null,"【ニ.】",null,"（",{"$nulls":3},"）","（",{"$nulls":12},"）","（",{"$nulls":4},{"$f":"IF(X38=\"\",\"\",\"㎡\")","v":""},"）"]
[null,"【ホ.】",null,"（",{"$nulls":3},"）","（",{"$nulls":12},"）","（",{"$nulls":4},{"$f":"IF(X39=\"\",\"\",\"㎡\")","v":""},"）"]
[null,"【ヘ.】",null,"（",{"$nulls":3},"）","（",{"$nulls":12},"）","（",{"$nulls":4},{"$f":"IF(X40=\"\",\"\",\"㎡\")","v":""},"）"]
["【8.その他必要な事項】"]
["【9.備考】",{"$nulls":29},"←","計画変更の場合第五面に係る部分の"]
[{"$nulls":31},"【計画変更の概要】",{"$nulls":5},"記入"]
[]
[]
[]
[]
[]
[]
[null,"×",{"$nulls":3},"08010"]
[]
[null,"ｍ",{"$nulls":3},"一戸建ての住宅"]
[null,"cm"]
[null,"mm"]

{"sheet":"申六面","index":7,"n_rows":44,"n_cols":53,"rows_kept":44,"merged":[[2,10,2,13],[2,14,2,27],[3,10,3,13],[5,10,5,13],[6,10,6,13],[7,10,7,11],[7,12,7,13],[7,17,7,18],[7,19,7,20],[8,6,8,14],[8,16,8,17],[8,18,8,26],[19,5,19,21],[22,9,22,21],[25,3,25,15],[26,4,26,28],[27,1,27,28],[28,1,28,28]]}
["（第六面）"]
["建築物独立部分別概要",{"$nulls":29},"シートの保護を解除すると編集が可能になります（パスワードなし）"]
["【1.番号】",{"$nulls":50},"（注意）第六面"]
["【2.延べ面積】",{"$nulls":13},"㎡",{"$nulls":36},"①","この書類は、申請に係る建築物（建築物の二以上の部分がエキスパンションジョイントそ"]
["【3.建築物の高さ等】",{"$nulls":51},"の他の相互に応力を伝えない構造方法のみで接している場合においては当該建築物の"]
[null,"【イ.最高の高さ】",{"$nulls":12},"ｍ",{"$nulls":37},"部分。以下同じ。）ごとに作成してください。"]
[null,"【ロ.最高の軒の高さ】",{"$nulls":12},"ｍ",{"$nulls":36},"②","１欄は、建築物の数が１のときは「１」と記入し、建築物の数が２以上のときは、申請建築物"]
[null,"【ハ.階数】",{"$nulls":7},"（","地上",{"$nulls":3},"階","）","（","地下",{"$nulls":3},{"$f":"IF(T8=\"\",\"\",\"階\")","v":""},"）",{"$nulls":29},"ごとに通し番号を付し、その番号を記入してください。"]
[null,"【ニ.構造】",{"$nulls":4},"造",{"$nulls":44},"③","２欄及び３欄の「イ」から「ハ」までは、申請に係る建築物について、それぞれ記入してくだ"]
["【4.特定構造計算基準又は特定増改築構造計算基準の別】",{"$nulls":51},"さい。ただし、建築物の数が１のときは記入する必要はありません。"]
[null,null,"□","特定構造計算基準",{"$nulls":47},"④","３欄の「ニ」は、申請に係る建築物の主たる構造について記入してください。ただし、建築"]
[null,null,"□","特定増改築構造計算基準",{"$nulls":48},"物の数が１のときは記入する必要はありません。"]
["【5.構造計算の区分】",{"$nulls":50},"⑤","４欄、５欄及び６欄は、該当するチェックボックスに「レ」マークを入れてください。"]
[null,null,"□","建築基準法施行令第81条第1項各号に掲げる基準に従つた構造計算",{"$nulls":26},"←","時刻歴応答解析",{"$nulls":19},"⑥","６欄の「イ」は、構造計算に用いたプログラムが特定できるよう記載してください。"]
[null,null,"□","建築基準法施行令第81条第2項第1号イに掲げる構造計算",{"$nulls":27},"保有水平耐力計算",{"$nulls":19},"⑦","７欄は、建築基準法施行令第１３７条の２各号に定める基準のうち、該当する基準の号の"]
[null,null,"□","建築基準法施行令第81条第2項第1号ロに掲げる構造計算",{"$nulls":27},"限界耐力計算",{"$nulls":20},"数字及び「イ」又は「ロ」の別を記入してください。"]
[null,null,"□","建築基準法施行令第81条第2項第2号イに掲げる構造計算",{"$nulls":27},"許容応力度等計算（ルート２）",{"$nulls":19},"⑧","計画の変更申請の際は、８欄に第六面に係る部分の変更の概要について記入してくだ"]
[null,null,"□","建築基準法施行令第81条第3項に掲げる構造計算",{"$nulls":27},"許容応力度計算",{"$nulls":20},"さい。"]
["【6.構造計算に用いたプログラム】"]
[null,"【イ.名称】"]
[null,"【ロ.区分】"]
[null,null,"□","建築基準法第20条第1項第2号イ又は第3号イの認定を受けたプログラム"]
[{"$nulls":3},"（","大臣認定番号",{"$nulls":17},"）"]
[null,null,"□","その他のプログラム"]
["【7.建築基準法施行令第137条の2各号に定める基準の区分】"]
[null,null,"（",{"$nulls":13},"）"]
["【8.備考】",{"$nulls":29},"←","計画変更の場合第四面に係る部分の"]
[{"$nulls":31},"【計画変更の概要】",{"$nulls":5},"記入"]
{"$rows_empty":8}
[null,"造"]
[null,"木造"]
[null,"木造（枠組壁工法）"]
[null,"鉄骨造"]
[null,"鉄筋コンクリート造"]
[null,"壁式鉄筋コンクリート造"]
[]
[null,"一部"]

{"sheet":"委任状","index":8,"n_rows":82,"n_cols":45,"rows_kept":82,"merged":[[2,16,2,17],[2,18,2,19],[4,0,4,5],[5,0,5,5],[8,11,8,12],[9,11,9,12],[9,13,9,24],[10,11,10,12],[10,13,10,24],[12,2,12,4],[12,6,12,10],[22,2,22,24],[23,2,23,24],[24,2,24,24],[24,44,25,62],[25,2,25,24],[33,1,33,24],[36,1,36,24],[39,3,39,10],[39,13,39,15],[39,16,39,24],[40,3,40,24],[43,16,43,17],[43,18,43,19],[45,0,45,5],[46,0,46,5],[49,11,49,12],[50,11,50,12],[50,13,50,24],[51,11,51,12],[51,13,51,21],[53,2,53,4],[53,6,53,10],[63,2,63,24],[64,2,64,24],[65,2,65,24],[65,44,66,62],[66,2,66,24],[74,1,74,24],[77,1,77,24],[80,3,80,10],[80,13,80,15],[80,16,80,24],[81,3,81,24]]}
["委　任　状"]
[{"$nulls":26},"シートの保護を解除すると編集が可能になります（パスワードなし）"]
[{"$nulls":16},"令和",{"$nulls":3},"年",null,"月",null,"日"]
[]
["指定確認検査機関"]
["登録住宅性能評価機関"]
["株式会社確認検査機構アネックス　様"]
[]
[{"$nulls":11},"申請者"]
[{"$nulls":11},"住　所",null,{"$f":"IF(申二面!J9=\"\",\"\",申二面!J9)","v":""}]
[{"$nulls":11},"氏　名",null,{"$f":"IF(申一面!S20&申一面!S21=\"\",\"\",IF(申一面!S20=\"\",申一面!S21,申一面!S20&\"\n\"&申一面!S21))","v":""}]
[]
["　私は、",null,{"$f":"IF(申二面!K14=\"\",\"\",IF(申二面!K14=\"一級\",\"一級建築士\",IF(申二面!K14=\"二級\",\"二級建築士\",\"木造建築士\")))","v":""},{"$nulls":3},{"$f":"IF(申二面!J15=\"\",\"\",申二面!J15)","v":""},{"$nulls":4},"を代理者と定め、下記建築物等に係る建築基準法及び"]
["建築基準関係規定等の規定に基づく手続き（引受承諾書の受領を含む。）等に関する一切の権限を"]
["委任します。"]
[]
["記"]
[]
["１．申請の区分"]
[null,null,"建築基準法第６条の２第１項の規定による確認"]
[null,null,"建築基準法第７条の４第１項の規定による中間検査"]
[null,null,"建築基準法第７条の２第１項の規定による完了検査"]
[{"$nulls":26},"建築確認検査業務に係る各種届出書類の訂正"]
[{"$nulls":26},"建築基準法第６条の２第１項の規定による計画の変更の確認"]
[{"$nulls":26},"上記手続きの申請様式における申請者欄に下記委任先の者を記載する",{"$nulls":16},"←","電子申請における建築主の電子署名を不要とする場合は記入の上チェック\nその場合　5欄の委任先も表示してください。"]
[{"$nulls":26},"住宅金融支援機構の証券化支援事業（フラット３５）に係る物件検査"]
[{"$nulls":26},"建築物のｴﾈﾙｷﾞｰ消費性能の向上に関する法律第12条第1項又は第13条第2項の定による建築物ｴﾈﾙｷﾞｰ消費性能確保計画の提出又は通知"]
["２．申請する建築物等",{"$nulls":25},"上記計画の変更が軽微な変更に該当していることを証する書面の交付申請"]
[null,null,"建築物"]
[null,null,"建築設備（昇降機）",{"$nulls":11},"工作物（法第88条第１項）"]
[null,null,"建築設備（昇降機以外）",{"$nulls":11},"工作物（法第88条第２項）"]
[]
["３．建築場所、設置場所又は築造場所"]
[null,{"$f":"IF(申三面!G3=\"\",\"\",申三面!G3)","v":""}]
[]
["４．建築物等の用途"]
[]
[]
["５．建築物等の用途","委任先"]
[null,"氏名：",null,{"$f":"IF(申二面!J15=\"\",\"\",申二面!J15)","v":""},{"$nulls":7},"資格：",null,{"$f":"IF(申二面!K14=\"\",\"\",IF(申二面!K14=\"一級\",\"一級建築士\",IF(申二面!K14=\"二級\",\"二級建築士\",\"木造建築士\")))","v":""},null,null,{"$f":"IF(申二面!T14=\"\",\"\",\"（\"&申二面!T14&\"）\"&\"登録　第\"&申二面!AB14&\"号\")","v":""}]
[null,"所属：",null,{"$f":"IF(申二面!J17=\"\",\"\",申二面!J17&\"　　\"&申二面!J19)","v":""}]
["委　任　状"]
[]
[{"$nulls":16},"令和",{"$nulls":3},"年",null,"月",null,"日"]
[]
["指定確認検査機関"]
["登録住宅性能評価機関"]
["株式会社確認検査機構アネックス　様"]
[]
[{"$nulls":11},"申請者"]
[{"$nulls":11},"住　所"]
[{"$nulls":11},"氏　名",{"$nulls":11},"印"]
[]
["　私は、",null,{"$f":"IF(申二面!K14=\"\",\"\",IF(申二面!K14=\"一級\",\"一級建築士\",IF(申二面!K14=\"二級\",\"二級建築士\",\"木造建築士\")))","v":""},{"$nulls":3},{"$f":"IF(申二面!J15=\"\",\"\",申二面!J15)","v":""},{"$nulls":4},"を代理者と定め、下記建築物等に係る建築基準法及び"]
["建築基準関係規定等の規定に基づく手続き（引受承諾書の受領を含む。）等に関する一切の権限を"]
["委任します。"]
[]
["記"]
[]
["１．申請の区分"]
[null,null,"建築基準法第６条の２第１項の規定による確認"]
[null,null,"建築基準法第７条の４第１項の規定による中間検査"]
[null,null,"建築基準法第７条の２第１項の規定による完了検査"]
[{"$nulls":26},"建築確認検査業務に係る各種届出書類の訂正"]
[{"$nulls":26},"建築基準法第６条の２第１項の規定による計画の変更の確認"]
[{"$nulls":26},"上記手続きの申請様式における申請者欄に下記委任先の者を記載する",{"$nulls":16},"←","電子申請における建築主の電子署名を不要とする場合は記入の上チェック\nその場合　5欄の委任先も表示してください。"]
[{"$nulls":26},"住宅金融支援機構の証券化支援事業（フラット３５）に係る物件検査"]
[{"$nulls":26},"建築物のｴﾈﾙｷﾞｰ消費性能の向上に関する法律第12条第1項又は第13条第2項の定による建築物ｴﾈﾙｷﾞｰ消費性能確保計画の提出又は通知"]
["２．申請する建築物等",{"$nulls":25},"上記計画の変更が軽微な変更に該当していることを証する書面の交付申請"]
[null,null,"建築物"]
[null,null,"建築設備（昇降機）",{"$nulls":11},"工作物（法第88条第１項）"]
[null,null,"建築設備（昇降機以外）",{"$nulls":11},"工作物（法第88条第２項）"]
[]
["３．建築場所、設置場所又は築造場所"]
[null,{"$f":"IF(申三面!G49=\"\",\"\",申三面!G49)","v":""}]
[]
["４．建築物等の用途"]
[]
[]
["５．建築物等の用途","委任先"]
[null,"氏名：",null,{"$f":"IF(申二面!J15=\"\",\"\",申二面!J15)","v":""},{"$nulls":7},"資格：",null,{"$f":"IF(申二面!K14=\"\",\"\",IF(申二面!K14=\"一級\",\"一級建築士\",IF(申二面!K14=\"二級\",\"二級建築士\",\"木造建築士\")))","v":""},null,null,{"$f":"IF(申二面!T14=\"\",\"\",\"（\"&申二面!T14&\"）\"&\"登録　第\"&申二面!AB14&\"号\")","v":""}]
[null,"所属：",null,{"$f":"IF(申二面!J17=\"\",\"\",申二面!J17&\"　　\"&申二面!J19)","v":""}]

{"sheet":"別紙追加様式","index":9,"n_rows":146,"n_cols":56,"rows_kept":146,"merged":[[4,9,4,31],[4,33,4,48],[5,9,5,31],[5,33,5,48],[6,10,6,15],[7,9,7,31],[8,9,8,15],[12,10,12,11],[12,19,12,22],[12,27,12,30],[13,9,13,31],[14,10,14,11],[14,19,14,21],[14,27,14,30],[15,9,15,31],[16,10,16,15],[17,9,17,31],[18,9,18,15],[23,10,23,11],[23,19,23,22],[23,27,23,30],[24,9,24,31],[25,10,25,11],[25,19,25,21],[25,27,25,30],[26,9,26,31],[27,10,27,15],[28,9,28,31],[29,9,29,15],[30,1,30,11],[30,12,30,31],[32,10,32,11],[32,19,32,22],[32,27,32,30],[33,9,33,31],[34,10,34,11],[34,19,34,21],[34,27,34,30],[35,9,35,31],[36,10,36,15],[37,9,37,31],[38,9,38,15],[39,1,39,11],[39,12,39,31],[44,10,44,11],[44,19,44,22],[44,27,44,30],[45,9,45,31],[46,10,46,11],[46,19,46,21],[46,27,46,30],[47,9,47,31],[48,10,48,15],[49,9,49,31],[50,9,50,15],[51,1,51,10],[51,11,51,31],[53,10,53,11],[53,19,53,22],[53,27,53,30],[54,9,54,31],[55,10,55,11],[55,19,55,21],[55,27,55,30],[56,9,56,31],[57,10,57,15],[58,9,58,31],[59,9,59,15],[60,1,60,10],[60,11,60,31],[65,9,65,31],[66,9,66,31],[67,10,67,15],[68,9,68,31],[72,10,72,11],[72,19,72,22],[72,27,72,30],[73,9,73,31],[74,10,74,11],[74,19,74,21],[74,27,74,30],[75,9,75,31],[76,10,76,15],[77,9,77,31],[78,9,78,15],[83,10,83,11],[83,19,83,22],[83,27,83,30],[84,9,84,31],[85,10,85,11],[85,19,85,21],[85,27,85,30],[86,9,86,31],[87,10,87,15],[88,9,88,31],[89,9,89,15],[90,1,90,11],[90,12,90,31],[92,10,92,11],[92,19,92,22],[92,27,92,30],[93,9,93,31],[94,10,94,11],[94,19,94,21],[94,27,94,30],[95,9,95,31],[96,10,96,15],[97,9,97,31],[98,9,98,15],[99,1,99,11],[99,12,99,31],[104,10,104,11],[104,19,104,22],[104,27,104,30],[105,9,105,31],[106,10,106,11],[106,19,106,21],[106,27,106,30],[107,9,107,31],[108,10,108,15],[109,9,109,31],[110,9,110,15],[111,1,111,10],[111,11,111,31],[113,10,113,11],[113,19,113,22],[113,27,113,30],[114,9,114,31],[115,10,115,11],[115,19,115,21],[115,27,115,30],[116,9,116,31],[117,10,117,15],[118,9,118,31],[119,9,119,15],[120,1,120,10],[120,11,120,31],[124,7,124,31],[125,13,125,16],[125,19,125,25],[126,7,126,31],[127,8,127,13],[128,7,128,31],[129,7,129,13]]}
["（第二面）別紙追加様式"]
[null,"建築主等の概要",{"$nulls":31},"シートの保護を解除すると編集が可能になります（パスワードなし）"]
[]
["【1.建築主】",{"$nulls":53},"（注意）第二面"]
[null,"【イ.氏名のフリガナ】",{"$nulls":31},"氏名のフリガナ",{"$nulls":20},"①　建築主が２以上のときは、１欄は代表となる建築主について記入し、"]
[null,"【ロ.氏名】",{"$nulls":31},{"$f":"IF(J6=\"\",\"\",ASC(PHONETIC(J6)))","v":""},{"$nulls":21},"別紙に他の建築主についてそれぞれ必要な事項を記入して添えてください。"]
[null,"【ハ.郵便番号】",{"$nulls":7},"〒"]
[null,"【ニ.住所】"]
[null,"【ホ.電話番号】"]
[]
[]
["【2.代理者】"]
[null,"【イ.資格】",{"$nulls":7},"（",null,null,"）","建築士",{"$nulls":4},"（",{"$nulls":4},"）","登録",null,"第",{"$nulls":4},"号",null,"追加される必要な欄以外は、抹消していただいて結構です。"]
[null,"【ロ.氏名】"]
[null,"【ハ.建築士事務所名】",{"$nulls":7},"（",null,null,"）","建築士事務所",{"$nulls":4},"（",{"$nulls":3},"）","知事登録第",{"$nulls":7},"号"]
[]
[null,"【ニ.郵便番号】",{"$nulls":7},"〒"]
[null,"【ホ.所在地】"]
[null,"【へ.電話番号】"]
[]
[]
["【3.設計者】"]
[null,"(その他の設計者)"]
[null,"【イ.資格】",{"$nulls":7},"（",null,null,"）","建築士",{"$nulls":4},"（",{"$nulls":4},"）","登録",null,"第",{"$nulls":4},"号"]
[null,"【ロ.氏名】"]
[null,"【ハ.建築士事務所名】",{"$nulls":7},"（",null,null,"）","建築士事務所",{"$nulls":4},"（",{"$nulls":3},"）","知事登録第",{"$nulls":7},"号"]
[]
[null,"【ニ.郵便番号】",{"$nulls":7},"〒"]
[null,"【ホ.所在地】"]
[null,"【へ.電話番号】"]
[null,"【ト.作成又は確認した設計図書】",{"$nulls":31},"確認申請時",{"$nulls":3},"【ト.作成又は確認した設計図書】"]
[{"$nulls":33},"検査申請時",{"$nulls":3},"【ト.作成した設計図書】"]
[null,"【イ.資格】",{"$nulls":7},"（",null,null,"）","建築士",{"$nulls":4},"（",{"$nulls":4},"）","登録",null,"第",{"$nulls":4},"号"]
[null,"【ロ.氏名】"]
[null,"【ハ.建築士事務所名】",{"$nulls":7},"（",null,null,"）","建築士事務所",{"$nulls":4},"（",{"$nulls":3},"）","知事登録第",{"$nulls":7},"号"]
[]
[null,"【ニ.郵便番号】",{"$nulls":7},{"$f":"IF(K37=\"\",\"\",\"〒\")","v":""}]
[null,"【ホ.所在地】"]
[null,"【へ.電話番号】"]
[null,"【ト.作成又は確認した設計図書】"]
[]
[]
["【5.工事監理者】"]
[null,"(その他の工事監理者)"]
[null,"【イ.資格】",{"$nulls":7},"（",null,null,"）","建築士",{"$nulls":4},"（",{"$nulls":4},"）","登録",null,"第",{"$nulls":4},"号"]
[null,"【ロ.氏名】"]
[null,"【ハ.建築士事務所名】",{"$nulls":7},"（",null,null,"）","建築士事務所",{"$nulls":4},"（",{"$nulls":3},"）","知事登録第",{"$nulls":7},"号"]
[]
[null,"【ニ.郵便番号】",{"$nulls":7},"〒"]
[null,"【ホ.所在地】"]
[null,"【へ.電話番号】"]
[null,"【ト.工事と照合する設計図書】",{"$nulls":31},"確認申請時",{"$nulls":3},"【ト.工事と照合する設計図書】"]
[{"$nulls":33},"検査申請時",{"$nulls":3},"【ト.工事と照合した設計図書】"]
[null,"【イ.資格】",{"$nulls":7},"（",null,null,"）","建築士",{"$nulls":4},"（",{"$nulls":4},"）","登録",null,"第",{"$nulls":4},"号"]
[null,"【ロ.氏名】"]
[null,"【ハ.建築士事務所名】",{"$nulls":7},"（",null,null,"）","建築士事務所",{"$nulls":4},"（",{"$nulls":3},"）","知事登録第",{"$nulls":7},"号"]
[]
[null,"【ニ.郵便番号】",{"$nulls":7},{"$f":"IF(K58=\"\",\"\",\"〒\")","v":""}]
[null,"【ホ.所在地】"]
[null,"【へ.電話番号】"]
[null,"【ト.工事と照合する設計図書】"]
["建築計画概要書（第一面）別紙追加様式"]
[null,"建築主等の概要"]
[]
["【1.建築主】"]
[null,"【イ.氏名のフリガナ】",{"$nulls":7},{"$f":"IF(J5=\"\",\"\",J5)","v":""}]
[null,"【ロ.氏名】",{"$nulls":7},{"$f":"IF(J6=\"\",\"\",J6)","v":""}]
[null,"【ハ.郵便番号】",{"$nulls":7},"〒",{"$f":"IF(K7=\"\",\"\",K7)","v":""}]
[null,"【ニ.住所】",{"$nulls":7},{"$f":"IF(J8=\"\",\"\",J8)","v":""}]
[]
[]
["【2.代理者】"]
[null,"【イ.資格】",{"$nulls":7},"（",{"$f":"IF(K13=\"\",\"\",K13)","v":""},null,"）","建築士",{"$nulls":4},"（",{"$f":"IF(T13=\"\",\"\",T13)","v":""},{"$nulls":3},"）","登録",null,"第",{"$f":"IF(AB13=\"\",\"\",AB13)","v":""},{"$nulls":3},"号"]
[null,"【ロ.氏名】",{"$nulls":7},{"$f":"IF(J14=\"\",\"\",J14)","v":""}]
[null,"【ハ.建築士事務所名】",{"$nulls":7},"（",{"$f":"IF(K15=\"\",\"\",K15)","v":""},null,"）","建築士事務所",{"$nulls":4},"（",{"$f":"IF(T15=\"\",\"\",T15)","v":""},null,null,"）","知事登録第",{"$nulls":3},{"$f":"IF(AB15=\"\",\"\",AB15)","v":""},{"$nulls":3},"号"]
[{"$nulls":9},{"$f":"IF(J16=\"\",\"\",J16)","v":""}]
[null,"【ニ.郵便番号】",{"$nulls":7},"〒",{"$f":"IF(K17=\"\",\"\",K17)","v":""}]
[null,"【ホ.所在地】",{"$nulls":7},{"$f":"IF(J18=\"\",\"\",J18)","v":""}]
[null,"【へ.電話番号】",{"$nulls":7},{"$f":"IF(J19=\"\",\"\",J19)","v":""}]
[]
[]
["【3.設計者】"]
[null,"(その他の設計者)"]
[null,"【イ.資格】",{"$nulls":7},"（",{"$f":"IF(K24=\"\",\"\",K24)","v":""},null,"）","建築士",{"$nulls":4},"（",{"$f":"IF(T24=\"\",\"\",T24)","v":""},{"$nulls":3},"）","登録",null,"第",{"$f":"IF(AB24=\"\",\"\",AB24)","v":""},{"$nulls":3},"号"]
[null,"【ロ.氏名】",{"$nulls":7},{"$f":"IF(J25=\"\",\"\",J25)","v":""}]
[null,"【ハ.建築士事務所名】",{"$nulls":7},"（",{"$f":"IF(K26=\"\",\"\",K26)","v":""},null,"）","建築士事務所",{"$nulls":4},"（",{"$f":"IF(T26=\"\",\"\",T26)","v":""},null,null,"）","知事登録第",{"$nulls":3},{"$f":"IF(AB26=\"\",\"\",AB26)","v":""},{"$nulls":3},"号"]
[{"$nulls":9},{"$f":"IF(J27=\"\",\"\",J27)","v":""}]
[null,"【ニ.郵便番号】",{"$nulls":7},"〒",{"$f":"IF(K28=\"\",\"\",K28)","v":""}]
[null,"【ホ.所在地】",{"$nulls":7},{"$f":"IF(J29=\"\",\"\",J29)","v":""}]
[null,"【へ.電話番号】",{"$nulls":7},{"$f":"IF(J30=\"\",\"\",J30)","v":""}]
[null,"【ト.作成又は確認した設計図書】",{"$nulls":10},{"$f":"IF(M31=\"\",\"\",M31)","v":""}]
[]
[null,"【イ.資格】",{"$nulls":7},"（",{"$f":"IF(K33=\"\",\"\",K33)","v":""},null,"）","建築士",{"$nulls":4},"（",{"$f":"IF(T33=\"\",\"\",T33)","v":""},{"$nulls":3},"）","登録",null,"第",{"$f":"IF(AB33=\"\",\"\",AB33)","v":""},{"$nulls":3},"号"]
[null,"【ロ.氏名】",{"$nulls":7},{"$f":"IF(J34=\"\",\"\",J34)","v":""}]
[null,"【ハ.建築士事務所名】",{"$nulls":7},"（",{"$f":"IF(K35=\"\",\"\",K35)","v":""},null,"）","建築士事務所",{"$nulls":4},"（",{"$f":"IF(T35=\"\",\"\",T35)","v":""},null,null,"）","知事登録第",{"$nulls":3},{"$f":"IF(AB35=\"\",\"\",AB35)","v":""},{"$nulls":3},"号"]
[{"$nulls":9},{"$f":"IF(J36=\"\",\"\",J36)","v":""}]
[null,"【ニ.郵便番号】",{"$nulls":7},{"$f":"IF(K97=\"\",\"\",\"〒\")","v":""},{"$f":"IF(K37=\"\",\"\",K37)","v":""}]
[null,"【ホ.所在地】",{"$nulls":7},{"$f":"IF(J38=\"\",\"\",J38)","v":""}]
[null,"【へ.電話番号】",{"$nulls":7},{"$f":"IF(J39=\"\",\"\",J39)","v":""}]
[null,"【ト.作成又は確認した設計図書】",{"$nulls":10},{"$f":"IF(M40=\"\",\"\",M40)","v":""}]
[]
[]
["【5.工事監理者】"]
[null,"(その他の工事監理者)"]
[null,"【イ.資格】",{"$nulls":7},"（",{"$f":"IF(K45=\"\",\"\",K45)","v":""},null,"）","建築士",{"$nulls":4},"（",{"$f":"IF(T45=\"\",\"\",T45)","v":""},{"$nulls":3},"）","登録",null,"第",{"$f":"IF(AB45=\"\",\"\",AB45)","v":""},{"$nulls":3},"号"]
[null,"【ロ.氏名】",{"$nulls":7},{"$f":"IF(J46=\"\",\"\",J46)","v":""}]
[null,"【ハ.建築士事務所名】",{"$nulls":7},"（",{"$f":"IF(K47=\"\",\"\",K47)","v":""},null,"）","建築士事務所",{"$nulls":4},"（",{"$f":"IF(T47=\"\",\"\",T47)","v":""},null,null,"）","知事登録第",{"$nulls":3},{"$f":"IF(AB47=\"\",\"\",AB47)","v":""},{"$nulls":3},"号"]
[{"$nulls":9},{"$f":"IF(J48=\"\",\"\",J48)","v":""}]
[null,"【ニ.郵便番号】",{"$nulls":7},"〒",{"$f":"IF(K49=\"\",\"\",K49)","v":""}]
[null,"【ホ.所在地】",{"$nulls":7},{"$f":"IF(J50=\"\",\"\",J50)","v":""}]
[null,"【へ.電話番号】",{"$nulls":7},{"$f":"IF(J51=\"\",\"\",J51)","v":""}]
[null,"【ト.工事と照合する設計図書】",{"$nulls":9},{"$f":"IF(L52=\"\",\"\",L52)","v":""}]
[]
[null,"【イ.資格】",{"$nulls":7},"（",{"$f":"IF(K54=\"\",\"\",K54)","v":""},null,"）","建築士",{"$nulls":4},"（",{"$f":"IF(T54=\"\",\"\",T54)","v":""},{"$nulls":3},"）","登録",null,"第",{"$f":"IF(AB54=\"\",\"\",AB54)","v":""},{"$nulls":3},"号"]
[null,"【ロ.氏名】",{"$nulls":7},{"$f":"IF(J55=\"\",\"\",J55)","v":""}]
[null,"【ハ.建築士事務所名】",{"$nulls":7},"（",{"$f":"IF(K56=\"\",\"\",K56)","v":""},null,"）","建築士事務所",{"$nulls":4},"（",{"$f":"IF(T56=\"\",\"\",T56)","v":""},null,null,"）","知事登録第",{"$nulls":3},{"$f":"IF(AB56=\"\",\"\",AB56)","v":""},{"$nulls":3},"号"]
[{"$nulls":9},{"$f":"IF(J57=\"\",\"\",J57)","v":""}]
[null,"【ニ.郵便番号】",{"$nulls":7},{"$f":"IF(K118=\"\",\"\",\"〒\")","v":""},{"$f":"IF(K58=\"\",\"\",K58)","v":""}]
[null,"【ホ.所在地】",{"$nulls":7},{"$f":"IF(J59=\"\",\"\",J59)","v":""}]
[null,"【へ.電話番号】",{"$nulls":7},{"$f":"IF(J60=\"\",\"\",J60)","v":""}]
[null,"【ト.工事と照合する設計図書】",{"$nulls":9},{"$f":"IF(L61=\"\",\"\",L61)","v":""}]
[]
[]
["【6.工事施工者】"]
[null,"【イ.氏名】"]
[null,"【ロ.営業所名】",{"$nulls":5},"建設業の許可",{"$nulls":4},"（",{"$nulls":4},"）","第",{"$nulls":7},"号"]
[]
[null,"【ハ.郵便番号】",{"$nulls":5},"〒"]
[null,"【ニ.所在地】"]
[null,"【ホ.電話番号】"]
{"$rows_empty":8}
[null,"（第二面）別紙追加様式"]
[null,"建築計画概要書（第一面）別紙追加様式"]
[]
[null,"滋賀県",null,null,"大臣",{"$nulls":4},"設計図書一式"]
[null,"京都府",null,null,"滋賀県知事",{"$nulls":4},"設計図書一式（構造図、構造計算書を除く）"]
[null,"大阪府",null,null,"京都府知事",{"$nulls":4},"構造図、構造計算書"]
[null,"奈良県",null,null,"大阪府知事"]
[{"$nulls":4},"奈良県知事"]

{"sheet":"概一面","index":10,"n_rows":175,"n_cols":35,"rows_kept":175,"merged":[[1,13,1,18],[1,27,1,30],[2,25,2,27],[3,13,3,18],[3,25,3,31],[7,9,7,31],[8,9,8,31],[9,10,9,15],[10,9,10,31],[14,10,14,11],[14,19,14,22],[14,27,14,30],[15,9,15,31],[16,10,16,11],[16,19,16,21],[16,27,16,30],[17,9,17,31],[18,10,18,15],[19,9,19,31],[20,9,20,15],[25,10,25,11],[25,19,25,22],[25,27,25,30],[26,9,26,31],[27,10,27,11],[27,19,27,21],[27,27,27,30],[28,9,28,31],[29,10,29,15],[30,9,30,31],[31,9,31,15],[32,12,32,31],[35,10,35,11],[35,19,35,22],[35,27,35,30],[36,9,36,31],[37,10,37,11],[37,19,37,21],[37,27,37,30],[38,9,38,31],[39,10,39,15],[40,9,40,31],[41,9,41,15],[42,12,42,31],[44,10,44,11],[44,19,44,22],[44,27,44,30],[45,9,45,31],[46,10,46,11],[46,19,46,21],[46,27,46,30],[47,9,47,31],[48,10,48,15],[49,9,49,31],[50,9,50,15],[51,12,51,31],[53,10,53,11],[53,19,53,22],[53,27,53,30],[54,9,54,31],[55,10,55,11],[55,19,55,21],[55,27,55,30],[56,9,56,31],[57,10,57,15],[58,9,58,31],[59,9,59,15],[60,12,60,31],[65,7,65,22],[66,17,66,21],[68,7,68,22],[69,17,69,21],[71,7,71,22],[72,17,72,21],[73,7,73,22],[74,17,74,21],[75,7,75,22],[76,17,76,21],[78,7,78,22],[79,17,79,21],[80,7,80,22],[81,17,81,21],[82,7,82,22],[83,17,83,21],[88,7,88,31],[89,7,89,31],[90,8,90,13],[91,7,91,31],[92,7,92,13],[93,7,93,13],[94,11,94,31],[97,7,97,31],[98,7,98,31],[99,8,99,13],[100,7,100,31],[101,7,101,13],[102,7,102,13],[103,11,103,31],[105,7,105,31],[106,7,106,31],[107,8,107,13],[108,7,108,31],[109,7,109,13],[110,7,110,13],[111,11,111,31],[113,7,113,31],[114,7,114,31],[115,8,115,13],[116,7,116,31],[117,7,117,13],[118,7,118,13],[119,11,119,31],[124,10,124,11],[124,19,124,22],[124,27,124,30],[125,9,125,31],[126,10,126,11],[126,19,126,21],[126,27,126,30],[127,9,127,31],[128,10,128,15],[129,9,129,31],[130,9,130,15],[131,11,131,31],[134,10,134,11],[134,19,134,22],[134,27,134,30],[135,9,135,31],[136,10,136,11],[136,19,136,21],[136,27,136,30],[137,9,137,31],[138,10,138,15],[139,9,139,31],[140,9,140,15],[141,11,141,31],[143,10,143,11],[143,19,143,22],[143,27,143,30],[144,9,144,31],[145,10,145,11],[145,19,145,21],[145,27,145,30],[146,9,146,31],[147,10,147,15],[148,9,148,31],[149,9,149,15],[150,11,150,31],[152,10,152,11],[152,19,152,22],[152,27,152,30],[153,9,153,31],[154,10,154,11],[154,19,154,21],[154,27,154,30],[155,9,155,31],[156,10,156,15],[157,9,157,31],[158,9,158,15],[159,11,159,31],[163,7,163,31],[164,13,164,16],[164,19,164,25],[165,7,165,31],[166,8,166,13],[167,7,167,31],[168,7,168,13],[171,4,171,31],[172,4,172,31],[173,4,173,31],[174,4,174,31],[183,54,183,58],[184,52,184,55],[185,52,185,59]]}
[{"$nulls":25},"R",null,".",null,"."]
[{"$nulls":13},"建築計画概要書",{"$nulls":11},"第",null,"確認建機構ア",{"$nulls":3},{"$f":"IF(受付用!B9=\"\",\"\",受付用!B9)","v":""}]
[{"$nulls":25},{"$f":"IF(受付用!C9=\"\",\"\",受付用!C9)","v":""},{"$nulls":5},"号",null,"シートの保護を解除すると編集が可能になります（パスワードなし）"]
[{"$nulls":13},"（第一面）",{"$nulls":11},"㈱確認検査機構ｱﾈｯｸｽ",{"$nulls":7},"確認申請書第二面を改行等修正された場合は反映されているか確認してください"]
[null,"建築主等の概要"]
[]
["【1.建築主】"]
[null,"【イ.氏名のフリガナ】",{"$nulls":7},{"$f":"IF(申二面!J6=\"\",\"\",申二面!J6)","v":""}]
[null,"【ロ.氏名】",{"$nulls":7},{"$f":"IF(申二面!J7=\"\",\"\",申二面!J7)","v":""}]
[null,"【ハ.郵便番号】",{"$nulls":7},"〒",{"$f":"IF(申二面!K8=\"\",\"\",申二面!K8)","v":""}]
[null,"【ニ.住所】",{"$nulls":7},{"$f":"IF(申二面!J9=\"\",\"\",申二面!J9)","v":""}]
[]
[]
["【2.代理者】",{"$nulls":33},"大阪府下は、"]
[null,"【イ.資格】",{"$nulls":7},"（",{"$f":"IF(申二面!K14=\"\",\"\",申二面!K14)","v":""},null,"）","建築士",{"$nulls":4},"（",{"$f":"IF(申二面!T14=\"\",\"\",申二面!T14)","v":""},{"$nulls":3},"）","登録",null,"第",{"$f":"IF(申二面!AB14=\"\",\"\",申二面!AB14)","v":""},{"$nulls":3},"号",null,null,"大阪府下行政庁指定様式"]
[null,"【ロ.氏名】",{"$nulls":7},{"$f":"IF(申二面!J15=\"\",\"\",申二面!J15)","v":""},{"$nulls":24},"（Ａ３判、厚紙仕様）のもので"]
[null,"【ハ.建築士事務所名】",{"$nulls":7},"（",{"$f":"IF(申二面!K16=\"\",\"\",申二面!K16)","v":""},null,"）","建築士事務所",{"$nulls":4},"（",{"$f":"IF(申二面!T16=\"\",\"\",申二面!T16)","v":""},null,null,"）","知事登録第",{"$nulls":3},{"$f":"IF(申二面!AB16=\"\",\"\",申二面!AB16)","v":""},{"$nulls":3},"号",null,null,"提出をお願いします。"]
[{"$nulls":9},{"$f":"IF(申二面!J17=\"\",\"\",申二面!J17)","v":""}]
[null,"【ニ.郵便番号】",{"$nulls":7},"〒",{"$f":"IF(申二面!K18=\"\",\"\",申二面!K18)","v":""},{"$nulls":23},"奈良県下は、"]
[null,"【ホ.所在地】",{"$nulls":7},{"$f":"IF(申二面!J19=\"\",\"\",申二面!J19)","v":""},{"$nulls":24},"厚紙仕様のもので"]
[null,"【へ.電話番号】",{"$nulls":7},{"$f":"IF(申二面!J20=\"\",\"\",申二面!J20)","v":""},{"$nulls":24},"提出をお願いします。"]
[]
[]
["【3.設計者】"]
[null,"(代表となる設計者)"]
[null,"【イ.資格】",{"$nulls":7},"（",{"$f":"IF(申二面!K25=\"\",\"\",申二面!K25)","v":""},null,"）","建築士",{"$nulls":4},"（",{"$f":"IF(申二面!T25=\"\",\"\",申二面!T25)","v":""},{"$nulls":3},"）","登録",null,"第",{"$f":"IF(申二面!AB25=\"\",\"\",申二面!AB25)","v":""},{"$nulls":3},"号"]
[null,"【ロ.氏名】",{"$nulls":7},{"$f":"IF(申二面!J26=\"\",\"\",申二面!J26)","v":""}]
[null,"【ハ.建築士事務所名】",{"$nulls":7},"（",{"$f":"IF(申二面!K27=\"\",\"\",申二面!K27)","v":""},null,"）","建築士事務所",{"$nulls":4},"（",{"$f":"IF(申二面!T27=\"\",\"\",申二面!T27)","v":""},null,null,"）","知事登録第",{"$nulls":3},{"$f":"IF(申二面!AB27=\"\",\"\",申二面!AB27)","v":""},{"$nulls":3},"号"]
[{"$nulls":9},{"$f":"IF(申二面!J28=\"\",\"\",申二面!J28)","v":""}]
[null,"【ニ.郵便番号】",{"$nulls":7},"〒",{"$f":"IF(申二面!K29=\"\",\"\",申二面!K29)","v":""}]
[null,"【ホ.所在地】",{"$nulls":7},{"$f":"IF(申二面!J30=\"\",\"\",申二面!J30)","v":""}]
[null,"【へ.電話番号】",{"$nulls":7},{"$f":"IF(申二面!J31=\"\",\"\",申二面!J31)","v":""}]
[null,"【ト.作成又は確認した設計図書】",{"$nulls":10},{"$f":"IF(申二面!M32=\"\",\"\",申二面!M32)","v":""}]
[]
[null,"(その他の設計者)"]
[null,"【イ.資格】",{"$nulls":7},"（",{"$f":"IF(申二面!K35=\"\",\"\",申二面!K35)","v":""},null,"）","建築士",{"$nulls":4},"（",{"$f":"IF(申二面!T35=\"\",\"\",申二面!T35)","v":""},{"$nulls":3},"）","登録",null,"第",{"$f":"IF(申二面!AB35=\"\",\"\",申二面!AB35)","v":""},{"$nulls":3},"号"]
[null,"【ロ.氏名】",{"$nulls":7},{"$f":"IF(申二面!J36=\"\",\"\",申二面!J36)","v":""}]
[null,"【ハ.建築士事務所名】",{"$nulls":7},"（",{"$f":"IF(申二面!K37=\"\",\"\",申二面!K37)","v":""},null,"）","建築士事務所",{"$nulls":4},"（",{"$f":"IF(申二面!T37=\"\",\"\",申二面!T37)","v":""},null,null,"）","知事登録第",{"$nulls":3},{"$f":"IF(申二面!AB37=\"\",\"\",申二面!AB37)","v":""},{"$nulls":3},"号"]
[{"$nulls":9},{"$f":"IF(申二面!J38=\"\",\"\",申二面!J38)","v":""}]
[null,"【ニ.郵便番号】",{"$nulls":7},{"$f":"IF(K40=\"\",\"\",\"〒\")","v":""},{"$f":"IF(申二面!K39=\"\",\"\",申二面!K39)","v":""}]
[null,"【ホ.所在地】",{"$nulls":7},{"$f":"IF(申二面!J40=\"\",\"\",申二面!J40)","v":""}]
[null,"【へ.電話番号】",{"$nulls":7},{"$f":"IF(申二面!J41=\"\",\"\",申二面!J41)","v":""}]
[null,"【ト.作成又は確認した設計図書】",{"$nulls":10},{"$f":"IF(申二面!M42=\"\",\"\",申二面!M42)","v":""}]
[]
[null,"【イ.資格】",{"$nulls":7},"（",{"$f":"IF(申二面!K44=\"\",\"\",申二面!K44)","v":""},null,"）","建築士",{"$nulls":4},"（",{"$f":"IF(申二面!T44=\"\",\"\",申二面!T44)","v":""},{"$nulls":3},"）","登録",null,"第",{"$f":"IF(申二面!AB44=\"\",\"\",申二面!AB44)","v":""},{"$nulls":3},"号"]
[null,"【ロ.氏名】",{"$nulls":7},{"$f":"IF(申二面!J45=\"\",\"\",申二面!J45)","v":""}]
[null,"【ハ.建築士事務所名】",{"$nulls":7},"（",{"$f":"IF(申二面!K46=\"\",\"\",申二面!K46)","v":""},null,"）","建築士事務所",{"$nulls":4},"（",{"$f":"IF(申二面!T46=\"\",\"\",申二面!T46)","v":""},null,null,"）","知事登録第",{"$nulls":3},{"$f":"IF(申二面!AB46=\"\",\"\",申二面!AB46)","v":""},{"$nulls":3},"号"]
[{"$nulls":9},{"$f":"IF(申二面!J47=\"\",\"\",申二面!J47)","v":""}]
[null,"【ニ.郵便番号】",{"$nulls":7},{"$f":"IF(K49=\"\",\"\",\"〒\")","v":""},{"$f":"IF(申二面!K48=\"\",\"\",申二面!K48)","v":""}]
[null,"【ホ.所在地】",{"$nulls":7},{"$f":"IF(申二面!J49=\"\",\"\",申二面!J49)","v":""}]
[null,"【へ.電話番号】",{"$nulls":7},{"$f":"IF(申二面!J50=\"\",\"\",申二面!J50)","v":""}]
[null,"【ト.作成又は確認した設計図書】",{"$nulls":10},{"$f":"IF(申二面!M51=\"\",\"\",申二面!M51)","v":""}]
[]
[null,"【イ.資格】",{"$nulls":7},"（",{"$f":"IF(申二面!K53=\"\",\"\",申二面!K53)","v":""},null,"）","建築士",{"$nulls":4},"（",{"$f":"IF(申二面!T53=\"\",\"\",申二面!T53)","v":""},{"$nulls":3},"）","登録",null,"第",{"$f":"IF(申二面!AB53=\"\",\"\",申二面!AB53)","v":""},{"$nulls":3},"号"]
[null,"【ロ.氏名】",{"$nulls":7},{"$f":"IF(申二面!J54=\"\",\"\",申二面!J54)","v":""}]
[null,"【ハ.建築士事務所名】",{"$nulls":7},"（",{"$f":"IF(申二面!K55=\"\",\"\",申二面!K55)","v":""},null,"）","建築士事務所",{"$nulls":4},"（",{"$f":"IF(申二面!T55=\"\",\"\",申二面!T55)","v":""},null,null,"）","知事登録第",{"$nulls":3},{"$f":"IF(申二面!AB55=\"\",\"\",申二面!AB55)","v":""},{"$nulls":3},"号"]
[{"$nulls":9},{"$f":"IF(申二面!J56=\"\",\"\",申二面!J56)","v":""}]
[null,"【ニ.郵便番号】",{"$nulls":7},{"$f":"IF(K58=\"\",\"\",\"〒\")","v":""},{"$f":"IF(申二面!K57=\"\",\"\",申二面!K57)","v":""}]
[null,"【ホ.所在地】",{"$nulls":7},{"$f":"IF(申二面!J58=\"\",\"\",申二面!J58)","v":""}]
[null,"【へ.電話番号】",{"$nulls":7},{"$f":"IF(申二面!J59=\"\",\"\",申二面!J59)","v":""}]
[null,"【ト.作成又は確認した設計図書】",{"$nulls":10},{"$f":"IF(申二面!M60=\"\",\"\",申二面!M60)","v":""}]
[]
[null,"（構造設計一級建築士又は設備設計一級建築士である旨の表示をした者）"]
[null,null,"上記の設計者のうち、"]
[null,null,{"$f":"IF(申二面!C65=\"\",\"\",申二面!C65)","v":"□"},"建築士法第20条の２第１項の表示をした者"]
[null,null,"【イ.氏名】",{"$nulls":4},{"$f":"IF(申二面!H66=\"\",\"\",申二面!H66)","v":""}]
[null,null,"【ロ.資格】構造設計一級建築士交付",{"$nulls":13},"第",{"$f":"IF(申二面!R67=\"\",\"\",申二面!R67)","v":""},{"$nulls":4},"号"]
[null,null,{"$f":"IF(申二面!C68=\"\",\"\",申二面!C68)","v":"□"},"建築士法第20条の２第３項の表示をした者"]
[null,null,"【イ.氏名】",{"$nulls":4},{"$f":"IF(申二面!H69=\"\",\"\",申二面!H69)","v":""}]
[null,null,"【ロ.資格】構造設計一級建築士交付",{"$nulls":13},"第",{"$f":"IF(申二面!R70=\"\",\"\",申二面!R70)","v":""},{"$nulls":4},"号"]
[null,null,{"$f":"IF(申二面!C71=\"\",\"\",申二面!C71)","v":"□"},"建築士法第20条の３第１項の表示をした者"]
[null,null,"【イ.氏名】",{"$nulls":4},{"$f":"IF(申二面!H72=\"\",\"\",申二面!H72)","v":""}]
[null,null,"【ロ.資格】設備設計一級建築士交付",{"$nulls":13},"第",{"$f":"IF(申二面!R73=\"\",\"\",申二面!R73)","v":""},{"$nulls":4},"号"]
[null,null,"【イ.氏名】",{"$nulls":4},{"$f":"IF(申二面!H74=\"\",\"\",申二面!H74)","v":""}]
[null,null,"【ロ.資格】設備設計一級建築士交付",{"$nulls":13},"第",{"$f":"IF(申二面!R75=\"\",\"\",申二面!R75)","v":""},{"$nulls":4},"号"]
[null,null,"【イ.氏名】",{"$nulls":4},{"$f":"IF(申二面!H76=\"\",\"\",申二面!H76)","v":""}]
[null,null,"【ロ.資格】設備設計一級建築士交付",{"$nulls":13},"第",{"$f":"IF(申二面!R77=\"\",\"\",申二面!R77)","v":""},{"$nulls":4},"号"]
[null,null,{"$f":"IF(申二面!C78=\"\",\"\",申二面!C78)","v":"□"},"建築士法第20条の３第３項の表示をした者"]
[null,null,"【イ.氏名】",{"$nulls":4},{"$f":"IF(申二面!H79=\"\",\"\",申二面!H79)","v":""}]
[null,null,"【ロ.資格】設備設計一級建築士交付",{"$nulls":13},"第",{"$f":"IF(申二面!R80=\"\",\"\",申二面!R80)","v":""},{"$nulls":4},"号"]
[null,null,"【イ.氏名】",{"$nulls":4},{"$f":"IF(申二面!H81=\"\",\"\",申二面!H81)","v":""}]
[null,null,"【ロ.資格】設備設計一級建築士交付",{"$nulls":13},"第",{"$f":"IF(申二面!R82=\"\",\"\",申二面!R82)","v":""},{"$nulls":4},"号"]
[null,null,"【イ.氏名】",{"$nulls":4},{"$f":"IF(申二面!H83=\"\",\"\",申二面!H83)","v":""}]
[null,null,"【ロ.資格】設備設計一級建築士交付",{"$nulls":13},"第",{"$f":"IF(申二面!R84=\"\",\"\",申二面!R84)","v":""},{"$nulls":4},"号"]
[]
[]
["【4.建築設備の設計に関し意見を聴いた者】"]
[null,"(代表となる建築設備の設計に関し意見を聴いた者)"]
[null,"【イ.氏名】",{"$nulls":5},{"$f":"IF(申二面!H89=\"\",\"\",申二面!H89)","v":""}]
[null,"【ロ.勤務先】",{"$nulls":5},{"$f":"IF(申二面!H90=\"\",\"\",申二面!H90)","v":""}]
[null,"【ハ.郵便番号】",{"$nulls":5},{"$f":"IF(I91=\"\",\"\",\"〒\")","v":""},{"$f":"IF(申二面!I91=\"\",\"\",申二面!I91)","v":""}]
[null,"【ニ.所在地】",{"$nulls":5},{"$f":"IF(申二面!H92=\"\",\"\",申二面!H92)","v":""}]
[null,"【ホ.電話番号】",{"$nulls":5},{"$f":"IF(申二面!H93=\"\",\"\",申二面!H93)","v":""}]
[null,"【ヘ.登録番号】",{"$nulls":5},{"$f":"IF(申二面!H94=\"\",\"\",申二面!H94)","v":""}]
[null,"【ト.意見を聴いた設計図書】",{"$nulls":9},{"$f":"IF(申二面!L95=\"\",\"\",申二面!L95)","v":""}]
[]
[null,"(その他の建築設備の設計に関し意見を聴いた者)"]
[null,"【イ.氏名】",{"$nulls":5},{"$f":"IF(申二面!H98=\"\",\"\",申二面!H98)","v":""}]
[null,"【ロ.勤務先】",{"$nulls":5},{"$f":"IF(申二面!H99=\"\",\"\",申二面!H99)","v":""}]
[null,"【ハ.郵便番号】",{"$nulls":5},{"$f":"IF(I100=\"\",\"\",\"〒\")","v":""},{"$f":"IF(申二面!I100=\"\",\"\",申二面!I100)","v":""}]
[null,"【ニ.所在地】",{"$nulls":5},{"$f":"IF(申二面!H101=\"\",\"\",申二面!H101)","v":""}]
[null,"【ホ.電話番号】",{"$nulls":5},{"$f":"IF(申二面!H102=\"\",\"\",申二面!H102)","v":""}]
[null,"【ヘ.登録番号】",{"$nulls":5},{"$f":"IF(申二面!H103=\"\",\"\",申二面!H103)","v":""}]
[null,"【ト.意見を聴いた設計図書】",{"$nulls":9},{"$f":"IF(申二面!L104=\"\",\"\",申二面!L104)","v":""}]
[]
[null,"【イ.氏名】",{"$nulls":5},{"$f":"IF(申二面!H106=\"\",\"\",申二面!H106)","v":""}]
[null,"【ロ.勤務先】",{"$nulls":5},{"$f":"IF(申二面!H107=\"\",\"\",申二面!H107)","v":""}]
[null,"【ハ.郵便番号】",{"$nulls":5},{"$f":"IF(I108=\"\",\"\",\"〒\")","v":""},{"$f":"IF(申二面!I108=\"\",\"\",申二面!I108)","v":""}]
[null,"【ニ.所在地】",{"$nulls":5},{"$f":"IF(申二面!H109=\"\",\"\",申二面!H109)","v":""}]
[null,"【ホ.電話番号】",{"$nulls":5},{"$f":"IF(申二面!H110=\"\",\"\",申二面!H110)","v":""}]
[null,"【ヘ.登録番号】",{"$nulls":5},{"$f":"IF(申二面!H111=\"\",\"\",申二面!H111)","v":""}]
[null,"【ト.意見を聴いた設計図書】",{"$nulls":9},{"$f":"IF(申二面!L112=\"\",\"\",申二面!L112)","v":""}]
[]
[null,"【イ.氏名】",{"$nulls":5},{"$f":"IF(申二面!H114=\"\",\"\",申二面!H114)","v":""}]
[null,"【ロ.勤務先】",{"$nulls":5},{"$f":"IF(申二面!H115=\"\",\"\",申二面!H115)","v":""}]
[null,"【ハ.郵便番号】",{"$nulls":5},{"$f":"IF(I116=\"\",\"\",\"〒\")","v":""},{"$f":"IF(申二面!I116=\"\",\"\",申二面!I116)","v":""}]
[null,"【ニ.所在地】",{"$nulls":5},{"$f":"IF(申二面!H117=\"\",\"\",申二面!H117)","v":""}]
[null,"【ホ.電話番号】",{"$nulls":5},{"$f":"IF(申二面!H118=\"\",\"\",申二面!H118)","v":""}]
[null,"【ヘ.登録番号】",{"$nulls":5},{"$f":"IF(申二面!H119=\"\",\"\",申二面!H119)","v":""}]
[null,"【ト.意見を聴いた設計図書】",{"$nulls":9},{"$f":"IF(申二面!L120=\"\",\"\",申二面!L120)","v":""}]
[]
[]
["【5.工事監理者】"]
[null,"(代表となる工事監理者)"]
[null,"【イ.資格】",{"$nulls":7},"（",{"$f":"IF(申二面!K125=\"\",\"\",申二面!K125)","v":""},null,"）","建築士",{"$nulls":4},"（",{"$f":"IF(申二面!T125=\"\",\"\",申二面!T125)","v":""},{"$nulls":3},"）","登録",null,"第",{"$f":"IF(申二面!AB125=\"\",\"\",申二面!AB125)","v":""},{"$nulls":3},"号"]
[null,"【ロ.氏名】",{"$nulls":7},{"$f":"IF(申二面!J126=\"\",\"\",申二面!J126)","v":""}]
[null,"【ハ.建築士事務所名】",{"$nulls":7},"（",{"$f":"IF(申二面!K127=\"\",\"\",申二面!K127)","v":""},null,"）","建築士事務所",{"$nulls":4},"（",{"$f":"IF(申二面!T127=\"\",\"\",申二面!T127)","v":""},null,null,"）","知事登録第",{"$nulls":3},{"$f":"IF(申二面!AB127=\"\",\"\",申二面!AB127)","v":""},{"$nulls":3},"号"]
[{"$nulls":9},{"$f":"IF(申二面!J128=\"\",\"\",申二面!J128)","v":""}]
[null,"【ニ.郵便番号】",{"$nulls":7},"〒",{"$f":"IF(申二面!K129=\"\",\"\",申二面!K129)","v":""}]
[null,"【ホ.所在地】",{"$nulls":7},{"$f":"IF(申二面!J130=\"\",\"\",申二面!J130)","v":""}]
[null,"【へ.電話番号】",{"$nulls":7},{"$f":"IF(申二面!J131=\"\",\"\",申二面!J131)","v":""}]
[null,"【ト.工事と照合する設計図書】",{"$nulls":9},{"$f":"IF(申二面!L132=\"\",\"\",申二面!L132)","v":""}]
[]
[null,"(その他の工事監理者)"]
[null,"【イ.資格】",{"$nulls":7},"（",{"$f":"IF(申二面!K135=\"\",\"\",申二面!K135)","v":""},null,"）","建築士",{"$nulls":4},"（",{"$f":"IF(申二面!T135=\"\",\"\",申二面!T135)","v":""},{"$nulls":3},"）","登録",null,"第",{"$f":"IF(申二面!AB135=\"\",\"\",申二面!AB135)","v":""},{"$nulls":3},"号"]
[null,"【ロ.氏名】",{"$nulls":7},{"$f":"IF(申二面!J136=\"\",\"\",申二面!J136)","v":""}]
[null,"【ハ.建築士事務所名】",{"$nulls":7},"（",{"$f":"IF(申二面!K137=\"\",\"\",申二面!K137)","v":""},null,"）","建築士事務所",{"$nulls":4},"（",{"$f":"IF(申二面!T137=\"\",\"\",申二面!T137)","v":""},null,null,"）","知事登録第",{"$nulls":3},{"$f":"IF(申二面!AB137=\"\",\"\",申二面!AB137)","v":""},{"$nulls":3},"号"]
[{"$nulls":9},{"$f":"IF(申二面!J138=\"\",\"\",申二面!J138)","v":""}]
[null,"【ニ.郵便番号】",{"$nulls":7},{"$f":"IF(K139=\"\",\"\",\"〒\")","v":""},{"$f":"IF(申二面!K139=\"\",\"\",申二面!K139)","v":""}]
[null,"【ホ.所在地】",{"$nulls":7},{"$f":"IF(申二面!J140=\"\",\"\",申二面!J140)","v":""}]
[null,"【へ.電話番号】",{"$nulls":7},{"$f":"IF(申二面!J141=\"\",\"\",申二面!J141)","v":""}]
[null,"【ト.工事と照合する設計図書】",{"$nulls":9},{"$f":"IF(申二面!L142=\"\",\"\",申二面!L142)","v":""}]
[]
[null,"【イ.資格】",{"$nulls":7},"（",{"$f":"IF(申二面!K144=\"\",\"\",申二面!K144)","v":""},null,"）","建築士",{"$nulls":4},"（",{"$f":"IF(申二面!T144=\"\",\"\",申二面!T144)","v":""},{"$nulls":3},"）","登録",null,"第",{"$f":"IF(申二面!AB144=\"\",\"\",申二面!AB144)","v":""},{"$nulls":3},"号"]
[null,"【ロ.氏名】",{"$nulls":7},{"$f":"IF(申二面!J145=\"\",\"\",申二面!J145)","v":""}]
[null,"【ハ.建築士事務所名】",{"$nulls":7},"（",{"$f":"IF(申二面!K146=\"\",\"\",申二面!K146)","v":""},null,"）","建築士事務所",{"$nulls":4},"（",{"$f":"IF(申二面!T146=\"\",\"\",申二面!T146)","v":""},null,null,"）","知事登録第",{"$nulls":3},{"$f":"IF(申二面!AB146=\"\",\"\",申二面!AB146)","v":""},{"$nulls":3},"号"]
[{"$nulls":9},{"$f":"IF(申二面!J147=\"\",\"\",申二面!J147)","v":""}]
[null,"【ニ.郵便番号】",{"$nulls":7},{"$f":"IF(K148=\"\",\"\",\"〒\")","v":""},{"$f":"IF(申二面!K148=\"\",\"\",申二面!K148)","v":""}]
[null,"【ホ.所在地】",{"$nulls":7},{"$f":"IF(申二面!J149=\"\",\"\",申二面!J149)","v":""}]
[null,"【へ.電話番号】",{"$nulls":7},{"$f":"IF(申二面!J150=\"\",\"\",申二面!J150)","v":""}]
[null,"【ト.工事と照合する設計図書】",{"$nulls":9},{"$f":"IF(申二面!L151=\"\",\"\",申二面!L151)","v":""}]
[]
[null,"【イ.資格】",{"$nulls":7},"（",{"$f":"IF(申二面!K153=\"\",\"\",申二面!K153)","v":""},null,"）","建築士",{"$nulls":4},"（",{"$f":"IF(申二面!T153=\"\",\"\",申二面!T153)","v":""},{"$nulls":3},"）","登録",null,"第",{"$f":"IF(申二面!AB153=\"\",\"\",申二面!AB153)","v":""},{"$nulls":3},"号"]
[null,"【ロ.氏名】",{"$nulls":7},{"$f":"IF(申二面!J154=\"\",\"\",申二面!J154)","v":""}]
[null,"【ハ.建築士事務所名】",{"$nulls":7},"（",{"$f":"IF(申二面!K155=\"\",\"\",申二面!K155)","v":""},null,"）","建築士事務所",{"$nulls":4},"（",{"$f":"IF(申二面!T155=\"\",\"\",申二面!T155)","v":""},null,null,"）","知事登録第",{"$nulls":3},{"$f":"IF(申二面!AB155=\"\",\"\",申二面!AB155)","v":""},{"$nulls":3},"号"]
[{"$nulls":9},{"$f":"IF(申二面!J156=\"\",\"\",申二面!J156)","v":""}]
[null,"【ニ.郵便番号】",{"$nulls":7},{"$f":"IF(K157=\"\",\"\",\"〒\")","v":""},{"$f":"IF(申二面!K157=\"\",\"\",申二面!K157)","v":""}]
[null,"【ホ.所在地】",{"$nulls":7},{"$f":"IF(申二面!J158=\"\",\"\",申二面!J158)","v":""}]
[null,"【へ.電話番号】",{"$nulls":7},{"$f":"IF(申二面!J159=\"\",\"\",申二面!J159)","v":""}]
[null,"【ト.工事と照合する設計図書】",{"$nulls":9},{"$f":"IF(申二面!L160=\"\",\"\",申二面!L160)","v":""}]
[]
[]
["【6.工事施工者】"]
[null,"【イ.氏名】",{"$nulls":5},{"$f":"IF(申二面!H164=\"\",\"\",申二面!H164)","v":""}]
[null,"【ロ.営業所名】",{"$nulls":5},"建設業の許可",{"$nulls":4},"（",{"$f":"IF(申二面!N165=\"\",\"\",申二面!N165)","v":""},{"$nulls":3},"）","第",{"$f":"IF(申二面!T165=\"\",\"\",申二面!T165)","v":""},{"$nulls":6},"号"]
[{"$nulls":7},{"$f":"IF(申二面!H166=\"\",\"\",申二面!H166)","v":""}]
[null,"【ハ.郵便番号】",{"$nulls":5},"〒",{"$f":"IF(申二面!I167=\"\",\"\",申二面!I167)","v":""}]
[null,"【ニ.所在地】",{"$nulls":5},{"$f":"IF(申二面!H168=\"\",\"\",申二面!H168)","v":""}]
[null,"【ホ.電話番号】",{"$nulls":5},{"$f":"IF(申二面!H169=\"\",\"\",申二面!H169)","v":""}]
[]
[]
["【7.備考】",{"$nulls":3},{"$f":"IF(申二面!E184=\"\",\"\",申二面!E184)","v":""}]
[{"$nulls":4},{"$f":"IF(申二面!E185=\"\",\"\",申二面!E185)","v":""}]
[{"$nulls":4},{"$f":"IF(申二面!E186=\"\",\"\",申二面!E186)","v":""}]
[{"$nulls":33},"←","書き込み可能"]

{"sheet":"概二面","index":11,"n_rows":97,"n_cols":35,"rows_kept":97,"merged":[[2,6,2,31],[3,6,3,31],[8,14,8,31],[9,1,9,31],[10,1,10,31],[12,8,12,14],[12,15,12,19],[13,15,13,19],[15,9,15,11],[15,15,15,17],[15,21,15,23],[15,27,15,29],[16,9,16,11],[16,15,16,17],[16,21,16,23],[16,27,16,29],[17,1,18,7],[17,8,18,8],[17,9,18,12],[17,13,18,13],[17,14,18,14],[17,15,18,18],[17,19,18,19],[17,20,18,20],[17,21,18,24],[17,25,18,25],[17,26,18,26],[17,27,18,30],[17,31,18,31],[20,9,20,11],[20,15,20,17],[20,21,20,23],[20,27,20,29],[22,9,22,11],[22,15,22,17],[22,21,22,23],[22,27,22,29],[23,12,23,16],[24,12,24,16],[25,23,25,27],[25,34,25,36],[25,37,25,41],[25,42,25,43],[26,23,26,27],[26,34,26,36],[26,37,26,41],[26,42,26,43],[27,5,27,31],[28,9,28,11],[28,13,28,31],[31,12,31,16],[31,19,31,23],[31,26,31,30],[32,12,32,15],[32,19,32,22],[32,26,32,29],[34,12,34,15],[34,19,34,22],[34,26,34,29],[35,16,35,22],[36,12,36,16],[36,19,36,23],[36,26,36,30],[37,12,37,15],[37,19,37,22],[37,26,37,29],[39,12,39,15],[39,19,39,22],[39,26,39,29],[41,12,41,15],[41,19,41,22],[41,26,41,29],[43,12,43,15],[43,19,43,22],[43,26,43,29],[44,12,44,15],[44,19,44,22],[44,26,44,29],[45,12,45,15],[45,19,45,22],[45,26,45,29],[46,12,46,15],[46,19,46,22],[46,26,46,29],[47,12,47,15],[47,19,47,22],[47,26,47,29],[48,12,48,15],[48,19,48,22],[48,26,48,29],[49,12,49,15],[49,19,49,22],[49,26,49,29],[50,12,50,15],[50,19,50,22],[50,26,50,29],[51,12,51,15],[51,19,51,22],[51,26,51,29],[52,12,52,15],[52,19,52,22],[52,26,52,29],[53,12,53,15],[53,19,53,22],[53,26,53,29],[54,17,54,22],[55,17,55,22],[57,15,57,19],[58,15,58,19],[59,11,59,15],[59,18,59,22],[60,11,60,14],[60,18,60,21],[61,11,61,15],[61,18,61,22],[62,11,62,15],[62,18,62,22],[63,8,63,16],[63,18,63,19],[63,20,63,28],[68,2,68,31],[69,2,69,31],[70,2,70,31],[71,2,71,31],[72,2,72,31],[73,13,73,14],[73,16,73,17],[73,19,73,20],[74,13,74,14],[74,16,74,17],[74,19,74,20],[76,15,76,30],[77,15,77,30],[78,15,78,30],[89,2,89,31],[90,2,90,31],[91,2,91,31],[92,2,92,31],[93,2,93,31],[94,2,94,31],[95,2,95,31],[96,2,96,31],[97,2,97,31]]}
["建築計画概要書（第二面）"]
["建築物及びその敷地に関する事項",{"$nulls":32},"シートの保護を解除すると編集が可能になります（パスワードなし）"]
["【1.地名地番】",{"$nulls":5},{"$f":"IF(申三面!G3=\"\",\"\",申三面!G3)","v":""},{"$nulls":26},"確認申請書第三面を改行等修正された場合は反映されているか確認してください"]
["【2.住居表示】",{"$nulls":5},{"$f":"IF(申三面!G4=\"\",\"\",申三面!G4)","v":""}]
["【3.都市計画区域及び準都市計画区域の内外の別等】"]
[null,{"$f":"IF(申三面!B6=\"\",\"\",申三面!B6)","v":"□"},"都市計画区域内",{"$nulls":5},"（ ",{"$f":"IF(申三面!J6=\"\",\"\",申三面!J6)","v":"□"},"市街化区域",{"$nulls":4},{"$f":"IF(申三面!P6=\"\",\"\",申三面!P6)","v":"□"},"市街化調整区域",{"$nulls":6},{"$f":"IF(申三面!X6=\"\",\"\",申三面!X6)","v":"□"},"区域区分非設定",{"$nulls":5},"）"]
[null,{"$f":"IF(申三面!B7=\"\",\"\",申三面!B7)","v":"□"},"準都市計画区域内",{"$nulls":6},{"$f":"IF(申三面!J7=\"\",\"\",申三面!J7)","v":"□"},"都市計画区域及び準都市計画区域外"]
["【4.防火地域】",{"$nulls":6},{"$f":"IF(申三面!H8=\"\",\"\",申三面!H8)","v":"□"},"防火地域",{"$nulls":3},{"$f":"IF(申三面!M8=\"\",\"\",申三面!M8)","v":"□"},"準防火地域",{"$nulls":4},{"$f":"IF(申三面!S8=\"\",\"\",申三面!S8)","v":"□"},"指定なし",null,null,"（",{"$f":"IF(申三面!X8=\"\",\"\",申三面!X8)","v":"□"},"法第22条区域 ）"]
["【5.その他の区域、地域、地区又は街区】",{"$nulls":13},{"$f":"IF(申三面!O9=\"\",\"\",申三面!O9)","v":""}]
[null,{"$f":"IF(申三面!B10=\"\",\"\",申三面!B10)","v":""}]
[null,{"$f":"IF(申三面!B11=\"\",\"\",申三面!B11)","v":""}]
["【6.道路】"]
[null,"【イ.幅員】",{"$nulls":6},{"$f":"IF(申三面!I13=\"\",\"\",申三面!I13)","v":""},{"$nulls":6},{"$f":"IF(申三面!P13=\"\",\"\",申三面!P13)","v":""},{"$nulls":4},"ｍ"]
[null,"【ロ.敷地と接している部分の長さ】",{"$nulls":13},{"$f":"IF(申三面!P14=\"\",\"\",申三面!P14)","v":""},{"$nulls":4},"ｍ"]
["【7.敷地面積】"]
[null,"【イ.敷地面積】",{"$nulls":5},"（1）","（",{"$f":"IF(申三面!J16=\"\",\"\",申三面!J16)","v":""},null,null,"㎡","）","（",{"$f":"IF(申三面!P16=\"\",\"\",申三面!P16)","v":""},null,null,{"$f":"IF(P16=\"\",\"\",\"㎡\")","v":""},"）","（",{"$f":"IF(申三面!V16=\"\",\"\",申三面!V16)","v":""},null,null,{"$f":"IF(V16=\"\",\"\",\"㎡\")","v":""},"）","（",{"$f":"IF(申三面!AB16=\"\",\"\",申三面!AB16)","v":""},null,null,{"$f":"IF(AB16=\"\",\"\",\"㎡\")","v":""},"）"]
[{"$nulls":7},"（2）","（",{"$f":"IF(申三面!J17=\"\",\"\",申三面!J17)","v":""},null,null,{"$f":"IF(J17=\"\",\"\",\"㎡\")","v":""},"）","（",{"$f":"IF(申三面!P17=\"\",\"\",申三面!P17)","v":""},null,null,{"$f":"IF(P17=\"\",\"\",\"㎡\")","v":""},"）","（",{"$f":"IF(申三面!V17=\"\",\"\",申三面!V17)","v":""},null,null,{"$f":"IF(V17=\"\",\"\",\"㎡\")","v":""},"）","（",{"$f":"IF(申三面!AB17=\"\",\"\",申三面!AB17)","v":""},null,null,{"$f":"IF(AB17=\"\",\"\",\"㎡\")","v":""},"）"]
[null,"【ロ.用途地域等】",{"$nulls":6},"（",{"$f":"IF(申三面!J18=\"\",\"\",申三面!J18)","v":""},{"$nulls":3},"）","（",{"$f":"IF(申三面!P18=\"\",\"\",申三面!P18)","v":""},{"$nulls":3},"）","（",{"$f":"IF(申三面!V18=\"\",\"\",申三面!V18)","v":""},{"$nulls":3},"）","（",{"$f":"IF(申三面!AB18=\"\",\"\",申三面!AB18)","v":""},{"$nulls":3},"）"]
[]
[null,"【ハ.建築基準法第52条第１項及び第２項の規定による建築物の容積率】"]
[{"$nulls":8},"（",{"$f":"IF(申三面!J21=\"\",\"\",申三面!J21)","v":""},null,null,"％","）","（",{"$f":"IF(申三面!P21=\"\",\"\",申三面!P21)","v":""},null,null,{"$f":"IF(P21=\"\",\"\",\"％\")","v":""},"）","（",{"$f":"IF(申三面!V21=\"\",\"\",申三面!V21)","v":""},null,null,{"$f":"IF(V21=\"\",\"\",\"％\")","v":""},"）","（",{"$f":"IF(申三面!AB21=\"\",\"\",申三面!AB21)","v":""},null,null,{"$f":"IF(AB21=\"\",\"\",\"％\")","v":""},"）"]
[null,"【ニ.建築基準法第53条第１項の規定による建築物の建蔽率】"]
[{"$nulls":8},"（",{"$f":"IF(申三面!J23=\"\",\"\",申三面!J23)","v":""},null,null,"％","）","（",{"$f":"IF(申三面!P23=\"\",\"\",申三面!P23)","v":""},null,null,{"$f":"IF(P23=\"\",\"\",\"％\")","v":""},"）","（",{"$f":"IF(申三面!V23=\"\",\"\",申三面!V23)","v":""},null,null,{"$f":"IF(V23=\"\",\"\",\"％\")","v":""},"）","（",{"$f":"IF(申三面!AB23=\"\",\"\",申三面!AB23)","v":""},null,null,{"$f":"IF(AB23=\"\",\"\",\"％\")","v":""},"）"]
[null,"【ホ.敷地面積の合計】",{"$nulls":9},"（1）",{"$f":"IF(申三面!M24=\"\",\"\",申三面!M24)","v":""},{"$nulls":4},"㎡"]
[{"$nulls":11},"（2）",{"$f":"IF(申三面!M25=\"\",\"\",申三面!M25)","v":""},{"$nulls":4},"㎡"]
[null,"【ヘ.敷地に建築可能な延べ面積を敷地面積で除した数値】",{"$nulls":21},{"$f":"IF(申三面!X26=\"\",\"\",申三面!X26)","v":""},{"$nulls":4},{"$f":"IF(X26=\"\",\"\",\"％\")","v":""}]
[null,"【ト.敷地に建築可能な建築面積を敷地面積で除した数値】",{"$nulls":21},{"$f":"IF(申三面!X27=\"\",\"\",申三面!X27)","v":""},{"$nulls":4},{"$f":"IF(X27=\"\",\"\",\"％\")","v":""}]
[null,"【チ.備考】",{"$nulls":3},{"$f":"IF(申三面!F28=\"\",\"\",申三面!F28)","v":""}]
["【8.主要用途】",{"$nulls":5},"( 区分",null,null,{"$f":"IF(申三面!J29=\"\",\"\",申三面!J29)","v":""},null,null,")",{"$f":"IF(申三面!N29=\"\",\"\",申三面!N29)","v":""}]
["【9.工事種別】"]
[null,{"$f":"IF(申三面!B31=\"\",\"\",申三面!B31)","v":"□"},"新築",null,{"$f":"IF(申三面!E31=\"\",\"\",申三面!E31)","v":"□"},"増築",null,{"$f":"IF(申三面!H31=\"\",\"\",申三面!H31)","v":"□"},"改築",null,{"$f":"IF(申三面!K31=\"\",\"\",申三面!K31)","v":"□"},"移転",null,{"$f":"IF(申三面!N31=\"\",\"\",申三面!N31)","v":"□"},"用途変更",{"$nulls":3},{"$f":"IF(申三面!S31=\"\",\"\",申三面!S31)","v":"□"},"大規模の修繕",{"$nulls":4},{"$f":"IF(申三面!Y31=\"\",\"\",申三面!Y31)","v":"□"},"大規模の模様替"]
["【10.建築面積】",{"$nulls":10},"（","申請部分",{"$nulls":4},"）","（","申請以外の部分",{"$nulls":4},"）","（","合計",{"$nulls":4},"）"]
[null,"【イ.建築面積】",{"$nulls":9},"（",{"$f":"IF(申三面!M33=\"\",\"\",申三面!M33)","v":""},{"$nulls":3},"㎡","）","（",{"$f":"IF(申三面!T33=\"\",\"\",申三面!T33)","v":""},{"$nulls":3},{"$f":"IF(T33=\"\",\"\",\"㎡\")","v":""},"）","（",{"$f":"IF(申三面!AA33=\"\",\"\",申三面!AA33)","v":""},{"$nulls":3},"㎡","）"]
[null,"【ロ.建蔽率の算定の基礎となる建築面積】"]
[{"$nulls":11},"（",{"$f":"IF(申三面!M35=\"\",\"\",申三面!M35)","v":""},{"$nulls":3},{"$f":"IF(M35=\"\",\"\",\"㎡\")","v":""},"）","（",{"$f":"IF(申三面!T35=\"\",\"\",申三面!T35)","v":""},{"$nulls":3},{"$f":"IF(T35=\"\",\"\",\"㎡\")","v":""},"）","（",{"$f":"IF(申三面!AA35=\"\",\"\",申三面!AA35)","v":""},{"$nulls":3},{"$f":"IF(AA35=\"\",\"\",\"㎡\")","v":""},"）"]
[null,"【ハ.建蔽率】",{"$nulls":14},{"$f":"IF(申三面!R36=\"\",\"\",申三面!R36)","v":""},{"$nulls":6},"％"]
["【11.延べ面積】",{"$nulls":10},"（","申請部分",{"$nulls":4},"）","（","申請以外の部分",{"$nulls":4},"）","（","合計",{"$nulls":4},"）"]
[null,"【イ.建築物全体】",{"$nulls":9},"（",{"$f":"IF(申三面!M38=\"\",\"\",申三面!M38)","v":""},{"$nulls":3},"㎡","）","（",{"$f":"IF(申三面!T38=\"\",\"\",申三面!T38)","v":""},{"$nulls":3},{"$f":"IF(T38=\"\",\"\",\"㎡\")","v":""},"）","（",{"$f":"IF(申三面!AA38=\"\",\"\",申三面!AA38)","v":""},{"$nulls":3},"㎡","）"]
[null,"【ロ.地階の住宅又は老人ホーム等の部分】"]
[{"$nulls":11},"（",{"$f":"IF(申三面!M40=\"\",\"\",申三面!M40)","v":""},{"$nulls":3},{"$f":"IF(M40=\"\",\"\",\"㎡\")","v":""},"）","（",{"$f":"IF(申三面!T40=\"\",\"\",申三面!T40)","v":""},{"$nulls":3},{"$f":"IF(T40=\"\",\"\",\"㎡\")","v":""},"）","（",{"$f":"IF(申三面!AA40=\"\",\"\",申三面!AA40)","v":""},{"$nulls":3},{"$f":"IF(AA40=\"\",\"\",\"㎡\")","v":""},"）"]
[null,"【ハ.エレベーターの昇降路の部分】"]
[{"$nulls":11},"（",{"$f":"IF(申三面!M42=\"\",\"\",申三面!M42)","v":""},{"$nulls":3},{"$f":"IF(M42=\"\",\"\",\"㎡\")","v":""},"）","（",{"$f":"IF(申三面!T42=\"\",\"\",申三面!T42)","v":""},{"$nulls":3},{"$f":"IF(T42=\"\",\"\",\"㎡\")","v":""},"）","（",{"$f":"IF(申三面!AA42=\"\",\"\",申三面!AA42)","v":""},{"$nulls":3},{"$f":"IF(AA42=\"\",\"\",\"㎡\")","v":""},"）"]
[null,"【ニ.共同住宅又は老人ホーム等の共用の廊下等の部分】"]
[{"$nulls":11},"（",{"$f":"IF(申三面!M44=\"\",\"\",申三面!M44)","v":""},{"$nulls":3},{"$f":"IF(M44=\"\",\"\",\"㎡\")","v":""},"）","（",{"$f":"IF(申三面!T44=\"\",\"\",申三面!T44)","v":""},{"$nulls":3},{"$f":"IF(T44=\"\",\"\",\"㎡\")","v":""},"）","（",{"$f":"IF(申三面!AA44=\"\",\"\",申三面!AA44)","v":""},{"$nulls":3},{"$f":"IF(AA44=\"\",\"\",\"㎡\")","v":""},"）"]
[null,"【ホ.認定機械室等の部分】",{"$nulls":9},"（",{"$f":"IF(申三面!M45=\"\",\"\",申三面!M45)","v":""},{"$nulls":3},"","）","（",{"$f":"IF(申三面!T45=\"\",\"\",申三面!T45)","v":""},{"$nulls":3},"","）","（",{"$f":"IF(申三面!AA45=\"\",\"\",申三面!AA45)","v":""},{"$nulls":3},"","）"]
[null,"【ヘ.自動車車庫等の部分】",{"$nulls":9},"（",{"$f":"IF(申三面!M46=\"\",\"\",申三面!M46)","v":""},{"$nulls":3},"","）","（",{"$f":"IF(申三面!T46=\"\",\"\",申三面!T46)","v":""},{"$nulls":3},"","）","（",{"$f":"IF(申三面!AA46=\"\",\"\",申三面!AA46)","v":""},{"$nulls":3},"","）"]
[null,"【ト.備蓄倉庫の部分】",{"$nulls":9},"（",{"$f":"IF(申三面!M47=\"\",\"\",申三面!M47)","v":""},{"$nulls":3},"","）","（",{"$f":"IF(申三面!T47=\"\",\"\",申三面!T47)","v":""},{"$nulls":3},"","）","（",{"$f":"IF(申三面!AA47=\"\",\"\",申三面!AA47)","v":""},{"$nulls":3},"","）"]
[null,"【チ.蓄電池の設置部分】",{"$nulls":9},"（",{"$f":"IF(申三面!M48=\"\",\"\",申三面!M48)","v":""},{"$nulls":3},"","）","（",{"$f":"IF(申三面!T48=\"\",\"\",申三面!T48)","v":""},{"$nulls":3},"","）","（",{"$f":"IF(申三面!AA48=\"\",\"\",申三面!AA48)","v":""},{"$nulls":3},"","）"]
[null,"【リ.自家発電設備の設置部分】",{"$nulls":9},"（",{"$f":"IF(申三面!M49=\"\",\"\",申三面!M49)","v":""},{"$nulls":3},"","）","（",{"$f":"IF(申三面!T49=\"\",\"\",申三面!T49)","v":""},{"$nulls":3},"","）","（",{"$f":"IF(申三面!AA49=\"\",\"\",申三面!AA49)","v":""},{"$nulls":3},"","）"]
[null,"【ヌ.貯水槽の設置部分】",{"$nulls":9},"（",{"$f":"IF(申三面!M50=\"\",\"\",申三面!M50)","v":""},{"$nulls":3},"","）","（",{"$f":"IF(申三面!T50=\"\",\"\",申三面!T50)","v":""},{"$nulls":3},"","）","（",{"$f":"IF(申三面!AA50=\"\",\"\",申三面!AA50)","v":""},{"$nulls":3},"","）"]
[null,"【ル.宅配ボックスの設置部分】",{"$nulls":9},"（",{"$f":"IF(申三面!M51=\"\",\"\",申三面!M51)","v":""},{"$nulls":3},"","）","（",{"$f":"IF(申三面!T51=\"\",\"\",申三面!T51)","v":""},{"$nulls":3},"","）","（",{"$f":"IF(申三面!AA51=\"\",\"\",申三面!AA51)","v":""},{"$nulls":3},"","）"]
[null,"【ヲ.その他の不算入部分】",{"$nulls":9},"（",{"$f":"IF(申三面!M52=\"\",\"\",申三面!M52)","v":""},{"$nulls":3},"","）","（",{"$f":"IF(申三面!T52=\"\",\"\",申三面!T52)","v":""},{"$nulls":3},"","）","（",{"$f":"IF(申三面!AA52=\"\",\"\",申三面!AA52)","v":""},{"$nulls":3},"","）"]
[null,"【ワ.住宅の部分】",{"$nulls":9},"（",{"$f":"IF(申三面!M53=\"\",\"\",申三面!M53)","v":""},{"$nulls":3},"","）","（",{"$f":"IF(申三面!T53=\"\",\"\",申三面!T53)","v":""},{"$nulls":3},"","）","（",{"$f":"IF(申三面!AA53=\"\",\"\",申三面!AA53)","v":""},{"$nulls":3},"","）"]
[null,"【カ.老人ホーム等の部分】",{"$nulls":9},"（",{"$f":"IF(申三面!M54=\"\",\"\",申三面!M54)","v":""},{"$nulls":3},"","）","（",{"$f":"IF(申三面!T54=\"\",\"\",申三面!T54)","v":""},{"$nulls":3},"","）","（",{"$f":"IF(申三面!AA54=\"\",\"\",申三面!AA54)","v":""},{"$nulls":3},"","）"]
[null,"【ヨ.延べ面積】",{"$nulls":15},{"$f":"IF(申三面!R55=\"\",\"\",申三面!R55)","v":""},{"$nulls":5},"㎡"]
[null,"【タ.容積率】",{"$nulls":14},{"$f":"IF(M55=\"\",\"\",ROUNDUP(AA55/M43*100,2))","v":""},{"$f":"IF(申三面!R56=\"\",\"\",申三面!R56)","v":""},{"$nulls":5},"％"]
["【12.建築物の数】"]
[null,"【イ.申請に係る建築物の数】",{"$nulls":13},{"$f":"IF(申三面!P58=\"\",\"\",申三面!P58)","v":""}]
[null,"【ロ.同一敷地内の他の建築物の数】",{"$nulls":13},{"$f":"IF(申三面!P59=\"\",\"\",申三面!P59)","v":""}]
["【13.建築物の高さ等】",{"$nulls":9},"（","申請に係る建築物",{"$nulls":4},"）","（","他の建築物",{"$nulls":4},"）"]
[null,"【イ.最高の高さ】",{"$nulls":8},"（",{"$f":"IF(申三面!L61=\"\",\"\",申三面!L61)","v":""},{"$nulls":3},"ｍ","）","（",{"$f":"IF(申三面!S61=\"\",\"\",申三面!S61)","v":""},{"$nulls":3},{"$f":"IF(S61=\"\",\"\",\"ｍ\")","v":""},"）"]
[null,"【ロ.階数】",{"$nulls":6},"地上",null,"（",{"$f":"IF(申三面!L62=\"\",\"\",申三面!L62)","v":""},{"$nulls":4},"）","（",{"$f":"IF(申三面!S62=\"\",\"\",申三面!S62)","v":""},{"$nulls":4},"）"]
[{"$nulls":8},"地下",null,"（",{"$f":"IF(申三面!L63=\"\",\"\",申三面!L63)","v":""},{"$nulls":4},"）","（",{"$f":"IF(申三面!S63=\"\",\"\",申三面!S63)","v":""},{"$nulls":4},"）"]
[null,"【ハ.構造】",{"$nulls":6},{"$f":"IF(申三面!I64=\"\",\"\",申三面!I64)","v":""},{"$nulls":9},{"$f":"IF(申三面!S64=\"\",\"\",申三面!S64)","v":"一部"},null,{"$f":"IF(申三面!U64=\"\",\"\",申三面!U64)","v":""}]
[null,"【ニ.建築基準法第56条第7項の規定による特例の適用の有無】",{"$nulls":20},{"$f":"IF(申三面!V65=\"\",\"\",申三面!V65)","v":"□"},"有",null,{"$f":"IF(申三面!Y65=\"\",\"\",申三面!Y65)","v":"□"},"無"]
[null,"【ホ.適用があるときは、特例の区分】"]
[{"$nulls":3},{"$f":"IF(申三面!D67=\"\",\"\",申三面!D67)","v":"□"},"道路高さ制限不適用",{"$nulls":7},{"$f":"IF(申三面!M67=\"\",\"\",申三面!M67)","v":"□"},"隣地高さ制限不適用",{"$nulls":7},{"$f":"IF(申三面!V67=\"\",\"\",申三面!V67)","v":"□"},"北側高さ制限不適用"]
["【14.許可・認定等】"]
[null,null,{"$f":"IF(申三面!C69=\"\",\"\",申三面!C69)","v":""}]
[null,null,{"$f":"IF(申三面!C70=\"\",\"\",申三面!C70)","v":""}]
[null,null,{"$f":"IF(申三面!C71=\"\",\"\",申三面!C71)","v":""}]
[null,null,{"$f":"IF(申三面!C72=\"\",\"\",申三面!C72)","v":""}]
[{"$nulls":33},"←","書き込み可能"]
["【15.工事着手予定年月日】",{"$nulls":10},{"$f":"IF(申三面!L73=\"\",\"\",申三面!L73)","v":"令和"},null,{"$f":"IF(申三面!N73=\"\",\"\",申三面!N73)","v":""},null,"年",{"$f":"IF(申三面!Q73=\"\",\"\",申三面!Q73)","v":""},null,"月",{"$f":"IF(申三面!T73=\"\",\"\",申三面!T73)","v":""},null,"日",{"$nulls":12},"建築物エネルギー消費性能確保計画の判定番号・日付　等記入"]
["【16.工事完了予定年月日】",{"$nulls":10},{"$f":"IF(申三面!L74=\"\",\"\",申三面!L74)","v":"令和"},null,{"$f":"IF(申三面!N74=\"\",\"\",申三面!N74)","v":""},null,"年",{"$f":"IF(申三面!Q74=\"\",\"\",申三面!Q74)","v":""},null,"月",{"$f":"IF(申三面!T74=\"\",\"\",申三面!T74)","v":""},null,"日",{"$nulls":12},"建築物エネルギー消費性能確保計画　提出不要の理由"]
["【17.特定工程工事終了予定年月日】",{"$nulls":15},"（特定工程）"]
[null,"（ 第",null,{"$f":"IF(申三面!D76=\"\",\"\",申三面!D76)","v":""},"回 ）",null,null,{"$f":"IF(申三面!G76=\"\",\"\",申三面!G76)","v":"令和"},{"$f":"IF(申三面!I76=\"\",\"\",申三面!I76)","v":""},"年",{"$f":"IF(申三面!K76=\"\",\"\",申三面!K76)","v":""},"月",{"$f":"IF(申三面!M76=\"\",\"\",申三面!M76)","v":""},"日","（",{"$f":"IF(申三面!P76=\"\",\"\",申三面!P76)","v":""},{"$nulls":15},"）"]
[null,"（ 第",null,{"$f":"IF(申三面!D77=\"\",\"\",申三面!D77)","v":""},"回 ）",null,null,{"$f":"IF(申三面!G77=\"\",\"\",申三面!G77)","v":"令和"},{"$f":"IF(申三面!I77=\"\",\"\",申三面!I77)","v":""},"年",{"$f":"IF(申三面!K77=\"\",\"\",申三面!K77)","v":""},"月",{"$f":"IF(申三面!M77=\"\",\"\",申三面!M77)","v":""},"日","（",{"$f":"IF(申三面!P77=\"\",\"\",申三面!P77)","v":""},{"$nulls":15},"）"]
[null,"（ 第",null,{"$f":"IF(申三面!D78=\"\",\"\",申三面!D78)","v":""},"回 ）",null,null,{"$f":"IF(申三面!G78=\"\",\"\",申三面!G78)","v":"令和"},{"$f":"IF(申三面!I78=\"\",\"\",申三面!I78)","v":""},"年",{"$f":"IF(申三面!K78=\"\",\"\",申三面!K78)","v":""},"月",{"$f":"IF(申三面!M78=\"\",\"\",申三面!M78)","v":""},"日","（",{"$f":"IF(申三面!P78=\"\",\"\",申三面!P78)","v":""},{"$nulls":15},"）"]
["【18.建築基準法第12条第１項の規定による調査の要否】",{"$nulls":32},"←","定期報告"]
[null,null,"□","要",null,"□","否"]
["【19.建築基準法第12条第3項の規定による検査を要する防火設備の有無】",{"$nulls":32},"←","特定建築設備等の定期報告"]
[null,null,"□","有",null,"□","無"]
["【20.建築基準法施行令第43条第1項及び第46条第4項等に係る経過措置の適用】"]
[null,"【イ.適用の有無】",{"$nulls":6},{"$f":"IF(申三面!I80=\"\",\"\",申三面!I80)","v":"□"},"有",null,{"$f":"IF(申三面!L80=\"\",\"\",申三面!L80)","v":"□"},"無",{"$nulls":20},"←","第二面の20欄の「イ」は、申請に係る建築物が複数ある場合で、そのうち一部の建築物"]
[null,"【ロ.適用があるときは、その区分】",{"$nulls":32},"物のみが建築士法第20条の２第２項に規定する構造関係規定に係る経過措置の適用を"]
[{"$nulls":3},{"$f":"IF(申三面!D82=\"\",\"\",申三面!D82)","v":"□"},"建築基準法施行令第43条第1項及び第46条第4項",{"$nulls":29},"受ける場合は、「有」に「レ」マークを入れた上で、第三面の配置図に当該建築物を明"]
[{"$nulls":3},{"$f":"IF(申三面!D83=\"\",\"\",申三面!D83)","v":"□"},"その他",{"$nulls":29},"示してください。"]
["【21.その他必要な事項】"]
[null,null,{"$f":"IF(申三面!C85=\"\",\"\",申三面!C85)","v":""}]
[null,null,{"$f":"IF(申三面!C86=\"\",\"\",申三面!C86)","v":""}]
[null,null,{"$f":"IF(申三面!C87=\"\",\"\",申三面!C87)","v":""}]
[null,null,{"$f":"IF(申三面!C89=\"\",\"\",申三面!C89)","v":""}]
[null,null,{"$f":"IF(申三面!C90=\"\",\"\",申三面!C90)","v":""}]
[null,null,{"$f":"IF(申三面!C91=\"\",\"\",申三面!C91)","v":""}]
[null,null,{"$f":"IF(申三面!C92=\"\",\"\",申三面!C92)","v":""}]
[{"$nulls":33},"←","書き込み可能"]

{"sheet":"概三面","index":12,"n_rows":24,"n_cols":40,"rows_kept":24,"merged":[[0,0,0,28],[2,4,2,28],[3,0,17,28],[18,3,18,28],[19,0,37,28],[44,0,44,28]]}
["建築計画概要書（第三面）"]
[]
["　付近見取図",{"$nulls":37},"（注意）第三面"]
[{"$nulls":38},"A4サイズ1枚での提出をお願いします。A4サイズ1枚では小さすぎる場合に限り2枚に分けて"]
[{"$nulls":38},"ください。A3サイズは提出不可の行政があります。"]
[{"$nulls":38},"①","付近見取図には、方位、道路及び目標となる地物を明示してください。"]
{"$rows_empty":12}
["　配置図",{"$nulls":37},"②","配置図には、縮尺、方位、敷地境界線、敷地内における建築物の位置、申請に係る建"]
[{"$nulls":39},"築物と他の建築物との別並びに敷地の接する道路の位置及び幅員を明示してください。"]
[{"$nulls":39},"建築物の高さも明示"]
[]
[{"$nulls":30},"概要書は閲覧に供していることから読みやすいもの"]
[{"$nulls":30},"となるように文字サイズを調整してください"]

{"sheet":"工事届","index":13,"n_rows":345,"n_cols":48,"rows_kept":345,"merged":[[0,0,1,12],[3,0,4,35],[5,0,6,35],[7,0,8,35],[9,24,10,27],[9,28,10,28],[9,29,10,30],[9,31,10,31],[9,32,10,33],[9,34,10,34],[11,0,12,11],[11,12,12,15],[13,3,13,7],[14,0,14,12],[15,3,15,7],[15,8,15,35],[16,3,16,7],[16,8,16,12],[16,14,16,19],[16,45,17,55],[17,3,17,7],[17,8,17,35],[18,3,18,7],[18,8,18,12],[18,14,18,18],[18,20,18,25],[20,45,21,55],[21,3,21,7],[21,8,21,35],[22,3,22,14],[22,15,22,35],[23,3,23,7],[23,8,23,12],[23,14,23,19],[23,45,24,55],[24,3,24,7],[24,8,24,35],[25,3,25,7],[25,8,25,12],[25,14,25,18],[25,20,25,25],[26,3,26,9],[26,10,26,35],[27,3,27,9],[27,10,27,14],[27,16,27,20],[27,22,27,27],[30,3,30,7],[30,8,30,35],[31,3,31,14],[31,15,31,35],[32,3,32,7],[32,8,32,12],[32,14,32,19],[33,3,33,7],[33,8,33,35],[34,3,34,7],[34,8,34,12],[34,14,34,18],[34,20,34,25],[36,0,36,12],[37,3,37,10],[37,11,37,13],[37,14,37,15],[37,24,37,25],[37,29,37,30],[38,3,38,10],[38,13,38,16],[38,18,38,21],[38,23,38,26],[39,3,39,10],[39,11,39,30],[41,0,41,12],[42,3,42,7],[42,8,42,35],[43,3,43,7],[43,8,43,35],[44,3,44,7],[44,8,44,12],[44,14,44,19],[45,3,45,7],[45,8,45,35],[46,3,46,7],[46,8,46,12],[46,14,46,18],[46,20,46,25],[47,3,47,9],[47,10,47,35],[48,3,48,9],[48,10,48,14],[48,16,48,20],[48,22,48,27],[51,0,51,12],[52,0,54,35],[55,0,55,35],[55,45,58,55],[58,0,58,14],[59,1,59,8],[59,11,59,14],[59,16,59,18],[59,20,59,22],[60,1,60,8],[60,11,60,14],[60,16,60,18],[60,20,60,22],[63,0,63,5],[64,1,65,8],[66,1,67,8],[70,8,70,13],[70,17,70,22],[71,1,71,8],[71,9,71,13],[71,14,71,19],[71,20,71,35],[72,1,74,8],[80,0,80,8],[80,9,80,17],[82,0,82,10],[83,1,83,8],[83,9,83,17],[83,18,83,26],[83,27,83,35],[84,1,84,8],[84,9,84,17],[84,18,84,26],[84,27,84,35],[85,1,86,8],[85,9,85,17],[85,18,85,26],[85,27,85,35],[86,9,86,17],[86,18,86,26],[86,27,86,35],[87,1,88,8],[87,9,88,17],[87,18,88,26],[87,27,88,35],[89,1,89,8],[89,10,89,14],[89,15,89,16],[89,19,89,23],[89,24,89,25],[89,28,89,32],[89,33,89,34],[90,1,91,8],[90,19,90,23],[91,10,91,14],[91,15,91,16],[91,19,91,23],[91,24,91,25],[91,28,91,32],[91,33,91,34],[93,1,98,8],[93,10,93,12],[93,13,93,17],[93,19,93,21],[93,22,93,26],[93,28,93,30],[93,31,93,35],[94,10,94,12],[94,13,94,16],[94,19,94,21],[94,22,94,25],[94,28,94,30],[94,31,94,34],[95,10,95,12],[95,13,95,17],[95,19,95,21],[95,22,95,26],[95,28,95,30],[95,31,95,35],[96,10,96,12],[96,13,96,16],[96,19,96,21],[96,22,96,25],[96,28,96,30],[96,31,96,34],[97,10,97,12],[97,13,97,17],[97,19,97,21],[97,22,97,26],[97,28,97,30],[97,31,97,35],[98,10,98,12],[98,13,98,16],[98,19,98,21],[98,22,98,25],[98,28,98,30],[98,31,98,34],[99,1,101,8],[99,10,99,14],[99,15,99,16],[99,19,99,23],[99,24,99,25],[99,28,99,32],[99,33,99,34],[102,1,103,8],[103,10,103,14],[103,15,103,16],[103,19,103,23],[103,24,103,25],[103,28,103,32],[103,33,103,34],[104,1,105,8],[104,10,104,15],[104,19,104,24],[104,28,104,33],[105,12,105,14],[105,15,105,16],[105,21,105,23],[105,24,105,25],[105,30,105,32],[105,33,105,34],[108,0,108,14],[108,17,108,25],[111,0,111,35],[115,1,115,8],[115,9,115,15],[116,1,116,8],[117,1,118,8],[117,18,117,22],[117,25,117,34],[118,10,118,17],[118,20,118,23],[119,1,119,8],[119,10,119,14],[119,17,119,22],[119,24,119,29],[120,1,120,8],[120,10,120,14],[120,17,120,22],[120,24,120,29],[121,1,121,8],[121,10,121,15],[121,17,121,22],[121,24,121,28],[121,30,121,34],[122,1,122,8],[122,10,122,15],[122,17,122,21],[122,24,122,28],[122,31,122,35],[123,1,123,8],[123,9,123,13],[123,16,123,20],[123,23,123,27],[123,30,123,34],[124,1,124,8],[124,9,124,13],[124,16,124,20],[124,23,124,27],[124,30,124,34],[127,1,127,8],[127,9,127,15],[128,1,128,8],[129,1,130,8],[129,18,129,22],[129,25,129,34],[130,10,130,17],[130,20,130,23],[131,1,131,8],[131,10,131,14],[131,17,131,22],[131,24,131,29],[132,1,132,8],[132,10,132,14],[132,17,132,22],[132,24,132,29],[133,1,133,8],[133,10,133,15],[133,17,133,22],[133,24,133,28],[133,30,133,34],[134,1,134,8],[134,10,134,15],[134,17,134,21],[134,24,134,28],[134,31,134,35],[135,1,135,8],[135,9,135,13],[135,16,135,20],[135,23,135,27],[135,30,135,34],[136,1,136,8],[136,9,136,13],[136,16,136,20],[136,23,136,27],[136,30,136,34],[139,1,139,8],[139,9,139,15],[140,1,140,8],[141,1,142,8],[141,18,141,22],[141,25,141,34],[142,10,142,17],[142,20,142,23],[143,1,143,8],[143,10,143,14],[143,17,143,22],[143,24,143,29],[144,1,144,8],[144,10,144,14],[144,17,144,22],[144,24,144,29],[145,1,145,8],[145,10,145,15],[145,17,145,22],[145,24,145,28],[145,30,145,34],[146,1,146,8],[146,10,146,15],[146,17,146,21],[146,24,146,28],[146,31,146,35],[147,1,147,8],[147,9,147,13],[147,16,147,20],[147,23,147,27],[147,30,147,34],[148,1,148,8],[148,9,148,13],[148,16,148,20],[148,23,148,27],[148,30,148,34],[151,0,151,12],[152,1,152,10],[152,11,152,18],[153,1,153,10],[154,1,154,10],[155,1,155,10],[155,11,155,15],[155,16,155,17],[156,1,156,10],[156,11,156,15],[156,16,156,17],[157,1,157,10],[157,12,157,15],[157,17,157,20],[157,22,157,26],[158,1,158,10],[158,11,158,15],[158,16,158,17],[159,1,159,10],[159,11,159,15],[159,16,159,17],[162,0,180,37],[182,1,182,30],[182,31,182,36],[183,1,183,8],[183,9,183,30],[183,31,183,36],[184,1,184,8],[184,9,184,30],[184,31,184,36],[185,0,186,37],[187,1,188,30],[187,31,187,36],[188,31,188,33],[188,34,188,36],[189,1,189,8],[189,9,189,30],[189,31,189,33],[189,34,189,36],[190,1,190,30],[190,31,190,33],[190,34,190,36],[191,1,191,8],[191,9,191,30],[191,31,191,33],[191,34,191,36],[192,1,192,30],[192,31,192,33],[192,34,192,36],[193,1,193,8],[193,9,193,30],[193,31,193,33],[193,34,193,36],[194,1,194,8],[194,9,194,30],[194,31,194,33],[194,34,194,36],[195,1,195,30],[195,31,195,33],[195,34,195,36],[196,1,196,30],[196,31,196,33],[196,34,196,36],[197,1,197,8],[197,9,197,30],[197,31,197,33],[197,34,197,36],[198,1,198,8],[198,9,198,30],[198,31,198,33],[198,34,198,36],[199,1,199,8],[199,9,199,30],[199,31,199,33],[199,34,199,36],[200,1,200,8],[200,9,200,30],[200,31,200,33],[200,34,200,36],[201,1,201,8],[201,9,201,30],[201,31,201,33],[201,34,201,36],[202,1,202,30],[202,31,202,33],[202,34,202,36],[203,1,203,30],[203,31,203,33],[203,34,203,36],[205,0,210,37],[211,1,211,32],[211,33,211,36],[212,1,212,32],[212,33,212,36],[213,1,213,32],[213,33,213,36],[214,1,214,32],[214,33,214,36],[215,1,215,32],[215,33,215,36],[216,1,216,32],[216,33,216,36],[218,0,223,37],[224,1,224,32],[224,33,224,36],[225,1,225,30],[226,1,226,30],[227,1,227,30],[228,1,228,30],[229,1,229,30],[230,1,230,30],[231,1,231,32],[231,33,231,36],[232,1,232,32],[232,33,232,36],[233,1,233,32],[233,33,233,36],[234,1,234,32],[234,33,234,36],[235,1,235,32],[235,33,235,36],[236,1,236,32],[236,33,236,36],[237,1,237,32],[237,33,237,36],[238,1,238,32],[238,33,238,36],[239,1,239,32],[239,33,239,36],[240,1,240,32],[240,33,240,36],[241,1,241,32],[241,33,241,36],[242,1,242,32],[242,33,242,36],[243,1,243,32],[243,33,243,36],[244,1,244,32],[244,33,244,36],[245,1,245,32],[245,33,245,36],[246,1,246,32],[246,33,246,36],[247,1,247,32],[247,33,247,36],[248,1,248,32],[248,33,248,36],[249,1,249,32],[249,33,249,36],[250,1,250,32],[250,33,250,36],[251,1,251,32],[251,33,251,36],[252,1,252,32],[252,33,252,36],[253,1,253,32],[253,33,253,36],[254,1,254,32],[254,33,254,36],[255,1,255,32],[255,33,255,36],[256,1,256,32],[256,33,256,36],[257,1,257,32],[257,33,257,36],[258,1,258,32],[258,33,258,36],[259,1,259,32],[259,33,259,36],[260,1,260,32],[260,33,260,36],[261,1,261,32],[261,33,261,36],[262,1,262,32],[262,33,262,36],[263,1,263,32],[263,33,263,36],[264,1,264,32],[264,33,264,36],[265,1,265,32],[265,33,265,36],[266,1,266,32],[266,33,266,36],[267,1,267,32],[267,33,267,36],[268,1,268,32],[268,33,268,36],[269,1,269,32],[269,33,269,36],[270,1,270,32],[270,33,270,36],[271,1,271,32],[271,33,271,36],[272,1,272,32],[272,33,272,36],[273,1,273,32],[273,33,273,36],[274,1,274,32],[274,33,274,36],[275,1,275,32],[275,33,275,36],[276,1,276,32],[276,33,276,36],[277,1,277,32],[277,33,277,36],[278,1,278,32],[278,33,278,36],[279,1,279,32],[279,33,279,36],[280,1,280,32],[280,33,280,36],[281,1,281,32],[281,33,281,36],[282,1,282,32],[282,33,282,36],[283,1,283,32],[283,33,283,36],[284,1,284,32],[284,33,284,36],[285,1,285,32],[285,33,285,36],[286,1,286,32],[286,33,286,36],[287,1,287,32],[287,33,287,36],[288,1,288,32],[288,33,288,36],[289,1,289,32],[289,33,289,36],[290,1,290,32],[290,33,290,36],[291,1,291,32],[291,33,291,36],[292,1,292,32],[292,33,292,36],[293,1,293,32],[293,33,293,36],[294,1,294,32],[294,33,294,36],[295,1,295,32],[295,33,295,36],[296,1,296,32],[296,33,296,36],[297,1,297,32],[297,33,297,36],[299,0,300,37],[301,1,301,32],[301,33,301,36],[302,1,302,32],[302,33,302,36],[303,1,303,32],[303,33,303,36],[304,1,304,32],[304,33,304,36],[305,1,305,32],[305,33,305,36],[306,1,306,32],[306,33,306,36],[307,1,307,32],[307,33,307,36],[309,0,313,37],[314,0,328,37],[329,0,343,37],[344,0,356,37]]}
["第四十号様式（第八条関係）（Ａ４）"]
[]
[]
["建築基準法第15条第１項の規定による"]
[]
["建築工事届"]
[]
["（第一面）"]
[]
[{"$nulls":28},"年",null,null,"月",null,null,"日"]
[]
[{"$nulls":12},"知事　様"]
[]
[]
["　　建築主",{"$nulls":44},"全て西暦で記入"]
[{"$nulls":3},"氏名",{"$nulls":4},{"$f":"IF(申二面!J7=\"\",\"\",申二面!J7)","v":""}]
[{"$nulls":3},"郵便番号",{"$nulls":9},"-",{"$nulls":31},"全て整数で記入\n（小数点以下は四捨五入）"]
[{"$nulls":3},"住所",{"$nulls":4},{"$f":"IF(申二面!J9=\"\",\"\",申二面!J9)","v":""}]
[{"$nulls":3},"電話番号",{"$nulls":9},"-",{"$nulls":5},"-"]
[]
["　　工事施工者（設計者又は代理者）（担当者の連絡先を記入してください）",{"$nulls":44},"工事期間も整数で\n（小数点以下は入力できません）"]
[{"$nulls":3},"氏名"]
[{"$nulls":3},"営業所名（建築士事務所名）"]
[{"$nulls":3},"郵便番号",{"$nulls":9},"-",{"$nulls":31},"第一面着色部分はリンクされてい\nません"]
[{"$nulls":3},"所在地"]
[{"$nulls":3},"電話番号",{"$nulls":9},"-",{"$nulls":5},"-"]
[{"$nulls":3},"担当者の氏名"]
[{"$nulls":3},"担当者の電話番号",{"$nulls":11},"-",{"$nulls":5},"-"]
[]
["　　工事監理者（担当者の連絡先を記入してください）"]
[{"$nulls":3},"氏名",{"$nulls":4},{"$f":"IF(申二面!J126=\"\",\"\",申二面!J126)","v":""}]
[{"$nulls":3},"営業所名（建築士事務所名）",{"$nulls":11},{"$f":"IF(申二面!J128=\"\",\"\",申二面!J128)","v":""}]
[{"$nulls":3},"郵便番号",{"$nulls":9},"-"]
[{"$nulls":3},"所在地",{"$nulls":4},{"$f":"IF(申二面!J130=\"\",\"\",申二面!J130)","v":""}]
[{"$nulls":3},"電話番号",{"$nulls":9},"-",{"$nulls":5},"-"]
[]
["　　建築確認"]
[{"$nulls":3},"確認済証番号",{"$nulls":10},"第",null,"　　　",null,"確認建機構ア",{"$nulls":4},{"$f":"IF(受付用!B9=\"\",\"\",受付用!B9)","v":""},{"$f":"IF(受付用!C9=\"\",\"\",受付用!C9)","v":""},{"$nulls":4},"号"]
[{"$nulls":3},"確認済証交付年月日",{"$nulls":13},"年",{"$nulls":4},"月",{"$nulls":4},"日"]
[{"$nulls":3},"確認済証交付者",{"$nulls":7},"株式会社確認検査機構アネックス"]
[]
["　　除却工事施工者"]
[{"$nulls":3},"氏名"]
[{"$nulls":3},"営業所名"]
[{"$nulls":3},"郵便番号",{"$nulls":9},"-"]
[{"$nulls":3},"所在地"]
[{"$nulls":3},"電話番号",{"$nulls":9},"-",{"$nulls":5},"-"]
[{"$nulls":3},"担当者の氏名"]
[{"$nulls":3},"担当者の電話番号",{"$nulls":11},"-",{"$nulls":5},"-"]
[]
[]
[" 　※受付経由機関記載欄"]
[]
[]
[]
["（第二面）",{"$nulls":44},"以下項目に着色がある箇所に\nついてチェック又は記入"]
[]
[]
["【１．着工及び工事完了の予定期日】",{"$nulls":43},"カウント"]
[null,"イ．着工予定期日",{"$nulls":13},"年",{"$nulls":3},"月",{"$nulls":3},"日",{"$nulls":14},{"$f":"IF(OR(L60=\"\",Q60=\"\",U60=\"\"),\"未入力\",\"\")","v":"未入力"},{"$nulls":6},{"$f":"IF(OR(L60=\"\",Q60=\"\",U60=\"\"),\"未入力です。\",\"\")","v":"未入力です。"}]
[null,"ロ．工事完了予定期日",{"$nulls":13},"年",{"$nulls":3},"月",{"$nulls":3},"日",{"$nulls":14},{"$f":"IF(OR(L61=\"\",Q61=\"\",U61=\"\"),\"未入力\",\"\")","v":"未入力"},{"$nulls":6},{"$f":"IF(OR(L61=\"\",Q61=\"\",U61=\"\"),\"未入力です。\",\"\")","v":"未入力です。"}]
[]
[]
["【２．建築主】"]
[null,"イ．建築主の種別",{"$nulls":8},"(1)国",{"$nulls":7},"(2)都道府県",{"$nulls":9},"(3)市区町村",{"$nulls":9},{"$f":"IF(COUNTIF(AN65:AP66,TRUE)>1,\"複数選択\",IF(COUNTIF(AN65:AP66,TRUE)=0,\"未入力\",\"\"))","v":"未入力"},false,false,false,null,null,{"$f":"COUNTIF(AN65:AP66, TRUE)","v":0},{"$f":"IFERROR(IF(AS65>=2,\"選択は1つまでです。\",IF(COUNTIF(AN65:AP66,TRUE)=0,\"未入力です。\",\"\")),\"\")","v":"未入力です。"}]
[{"$nulls":10},"(4)会社",{"$nulls":7},"(5)会社でない団体",{"$nulls":9},"(6)個人",{"$nulls":10},false,false,false]
[null,"ロ．資本の額又は\n    出資の総額",{"$nulls":8},"(1)1,000万円以下",{"$nulls":10},"(2)1,000万円超～3,000万円以下",{"$nulls":16},{"$f":"IF(AN66=FALSE,\"\",IF(COUNTIF(AN67:AP68,TRUE)>1,\"複数選択\",IF(COUNTIF(AN67:AP68,TRUE)=0,\"未入力\",\"\")))","v":""},false,false,{"$nulls":3},{"$f":"COUNTIF(AN67:AP68, TRUE)","v":0},{"$f":"IF(AND(COUNTIF(AN67:AP68,TRUE)>0,AN66<>TRUE),\"（４）を選んだ場合に回答してください。\",IF(AND(COUNTIF(AN67:AP68,TRUE)=0,AN66=TRUE),\"（４）を選んだ場合は回答が必要です。\",\"\"))","v":""}]
[{"$nulls":10},"(3)3,000万円超～1億円以下",{"$nulls":10},"(4)1億円超～10億円以下",{"$nulls":9},"(5)10億円超",{"$nulls":7},false,false,false,{"$nulls":3},{"$f":"IFERROR(IF(AS67>=2,\"選択は1つまでです。\",\"\"),\"\")","v":""}]
[]
[]
["【３．敷地の位置】"]
[null,"イ．地名地番",{"$nulls":36},{"$f":"IF(OR(J72=\"\",O72=\"\",U72=\"\"),\"未入力（地番まで）\",\"\")","v":"未入力（地番まで）"},{"$nulls":6},{"$f":"IF(OR(J72=\"\",O72=\"\",U72=\"\"),\"未入力があります（都道府県名から地番までご記入ください）。\",\"\")","v":"未入力があります（都道府県名から地番までご記入ください）。"}]
[null,"ロ．都市計画",{"$nulls":8},"(1)市街化区域",{"$nulls":15},"(2)市街化調整区域",{"$nulls":11},{"$f":"IF(COUNTIF(AN73:AP75,TRUE)>1,\"複数選択\",IF(COUNTIF(AN73:AP75,TRUE)=0,\"未入力\",\"\"))","v":"未入力"},false,false,{"$nulls":3},{"$f":"COUNTIF(AN73:AO75, TRUE)","v":0},{"$f":"IFERROR(IF(AS73>=2,\"選択は1つまでです。\",IF(COUNTIF(AN73:AO75,TRUE)>1,\"複数選択\",IF(COUNTIF(AN73:AO75,TRUE)=0,\"未入力です。\",\"\"))),\"\")","v":"未入力です。"}]
[{"$nulls":10},"(3)区域区分非設定都市計画区域",{"$nulls":15},"(4)準都市計画区域",{"$nulls":12},false,false]
[{"$nulls":10},"(5)都市計画区域及び準都市計画区域外",{"$nulls":28},false]
[]
[]
["【４．工事種別】",{"$nulls":9},"(1)新築",{"$nulls":4},"(2)増築",{"$nulls":4},"(3)改築",{"$nulls":4},"(4)移転",{"$nulls":12},{"$f":"IF(COUNTIF(AN78:AQ78,TRUE)>1,\"複数選択\",IF(COUNTIF(AN78:AQ78,TRUE)=0,\"未入力\",\"\"))","v":"未入力"},false,false,false,false,null,{"$f":"COUNTIF(AN78:AQ78, TRUE)","v":0},{"$f":"IF(AS78>=2, \"選択は1つまでです。\",IF(COUNTIF(AN78:AQ78,TRUE)=0,\"未入力です。\",\"\"))","v":"未入力です。"}]
[]
[]
["【５．主要用途】",{"$nulls":17},"（注意欄に記載の記号を記入してください）",{"$nulls":19},{"$f":"IF(COUNTA(J81)=0,\"未入力\",\"\")","v":"未入力"},{"$nulls":6},{"$f":"IF(COUNTA(J81)=0,\"未入力です。\",\"\")","v":"未入力です。"},null,"01～44の記号で記入（下記注意欄参照）"]
[]
["【６．一の建築物ごとの内容】"]
[null,"イ．番号",{"$nulls":36},{"$f":"IF(COUNTA(J84,S84,AB84)=0,\"未入力\",\"\")","v":"未入力"},{"$f":"IF(T84<>\"\",\"1\"&TEXT(T84,\"00\"),\nIF(T85<>\"\",\"2\"&TEXT(T85,\"00\"),\nIF(T86<>\"\",\"3\"&TEXT(T86,\"00\"),\"\")))","v":""},{"$nulls":5},{"$f":"IF(COUNTA(J84,S84,AB84)=0,\"未入力です。\",\"\")","v":"未入力です。"}]
[null,"ロ．物件名",{"$nulls":37},{"$f":"IFERROR(IF(AND($J$84<>\"\",J85=\"\"),\"未入力があります（1列目）。\",IF(AND($J$84=\"\",J85<>\"\"),\"棟番号を入力してください（1列目）。\",\"\")),\"\")","v":""},{"$f":"IFERROR(IF(AND($S$84<>\"\",S85=\"\"),\"未入力があります（2列目）。\",IF(AND($S$84=\"\",S85<>\"\"),\"棟番号を入力してください（2列目）。\",\"\")),\"\")","v":""},{"$f":"IFERROR(IF(AND($AB$84<>\"\",AB85=\"\"),\"未入力があります（3列目）。\",IF(AND($AB$84=\"\",AB85<>\"\"),\"棟番号を入力してください（3列目）。\",\"\")),\"\")","v":""},{"$nulls":3},{"$f":"IF(OR(AND(J$84<>\"\",COUNTA(J85)=0),\nAND(S$84<>\"\",COUNTA(S85)=0),\nAND(AB$84<>\"\",COUNTA(AB85)=0)),\"未入力があります。\",\nIF(OR(AND(J$84=\"\",COUNTA(J85)=1),AND(S$84=\"\",COUNTA(S85)=1),\nAND(AB$84=\"\",COUNTA(AB85)=1)),\"棟番号を入力してください。\",\"\")\n\n)","v":""}]
[null,"ハ．用途\n（注意欄に記載の記号を\n　記入してください）",{"$nulls":43},{"$f":"IF(OR(AND(J$84<>\"\",COUNTA(J86)=0),\nAND(S$84<>\"\",COUNTA(S86)=0),\nAND(AB$84<>\"\",COUNTA(AB86)=0)),\"未入力があります。\",\nIF(OR(AND(J$84=\"\",COUNTA(J86)=1),AND(S$84=\"\",COUNTA(S86)=1),\nAND(AB$84=\"\",COUNTA(AB86)=1)),\"棟番号を入力してください。\",\"\")\n\n)","v":""}]
[{"$nulls":9},"多用途",{"$nulls":8},"多用途",{"$nulls":8},"多用途",{"$nulls":11},false,false,false,{"$nulls":3},"確認申請の区分番号と同じ"]
[null,"ニ．工事部分の構造\n（注意欄に記載の記号を\n　記入してください）",{"$nulls":43},{"$f":"IF(OR(AND(J$84<>\"\",COUNTA(J88)=0),\nAND(S$84<>\"\",COUNTA(S88)=0),\nAND(AB$84<>\"\",COUNTA(AB88)=0)),\"未入力があります。\",\nIF(OR(AND(J$84=\"\",COUNTA(J88)=1),AND(S$84=\"\",COUNTA(S88)=1),\nAND(AB$84=\"\",COUNTA(AB88)=1)),\"棟番号を入力してください。\",\"\")\n\n)","v":""}]
[{"$nulls":45},"01～06の記号で記入（下記注意欄参照）"]
[null,"ホ．工事の予定期間",{"$nulls":13},"月間",{"$nulls":8},"月間",{"$nulls":8},"月間",{"$nulls":4},{"$f":"IF(COUNTA(K90,T90,AC90)=0,\"未入力\",\"\")","v":"未入力"},{"$nulls":6},{"$f":"IF(OR(AND(J$84<>\"\",COUNTA(K90)=0),\nAND(S$84<>\"\",COUNTA(T90)=0),\nAND(AB$84<>\"\",COUNTA(AC90)=0)),\"未入力があります。\",\nIF(OR(AND(J$84=\"\",COUNTA(K90)=1),AND(S$84=\"\",COUNTA(T90)=1),\nAND(AB$84=\"\",COUNTA(AC90)=1)),\"棟番号を入力してください。\",\"\")\n\n)","v":""}]
[null,"ヘ．工事部分の\n　　  床面積の合計",{"$nulls":42},{"$f":"COUNTIF(AN91:AN97, TRUE)","v":0}]
[{"$nulls":15},"㎡",{"$nulls":8},"㎡",{"$nulls":8},"㎡",{"$nulls":10},{"$f":"COUNTIF(AO91:AO97, TRUE)","v":0},{"$f":"IF(OR(AND(J$84<>\"\",COUNTA(K92)=0),\nAND(S$84<>\"\",COUNTA(T92)=0),\nAND(AB$84<>\"\",COUNTA(AC92)=0)),\"未入力があります。\",\nIF(OR(AND(J$84=\"\",COUNTA(K92)=1),AND(S$84=\"\",COUNTA(T92)=1),\nAND(AB$84=\"\",COUNTA(AC92)=1)),\"棟番号を入力してください。\",IF(AND(K92<>\"\",K92<10),\"10㎡未満の場合は届出不要です。\",IF(AND(T92<>\"\",T92<10),\"10㎡未満の場合は届出不要です。\",IF(AND(AC92<>\"\",AC92<10),\"10㎡以下の場合は届出不要です。\",\"\")))\n\n))","v":""}]
[{"$nulls":39},false,false,false,null,null,{"$f":"COUNTIF(AP91:AP97, TRUE)","v":0},{"$f":"IF(OR(AND(J$84<>\"\",COUNTA(K93)=0),\nAND(S$84<>\"\",COUNTA(T93)=0),\nAND(AB$84<>\"\",COUNTA(AC93)=0)),\"未入力があります。\",\nIF(OR(AND(J$84=\"\",COUNTA(K93)=1),AND(S$84=\"\",COUNTA(T93)=1),\nAND(AB$84=\"\",COUNTA(AC93)=1)),\"棟番号を入力してください。\",\"\")\n\n)","v":""}]
[null,"ト．用途ごとの工事部\n　　分の床面積\n（工事部分の用途が１種類\n　のみであり、ハの用途と\n　同一である場合は、記入\n　不要です。）",{"$nulls":7},"①","用途",{"$nulls":7},"①","用途",{"$nulls":7},"①","用途",{"$nulls":9},{"$f":"AT94&AT95&AT96&AT97&AT98&AT99","v":""},{"$nulls":6},{"$f":"IF(OR(AND(N94=\"\",COUNTA(N95)=1),\nAND(W94=\"\",COUNTA(W95)=1),\nAND(AF94=\"\",COUNTA(AF95)=1)),\"未入力です。\",\nIF(OR(AND(J$84=\"\",COUNTA(N94)=1),AND(S$84=\"\",COUNTA(W94)=1),\nAND(AB$84=\"\",COUNTA(AF94)=1)),\"棟番号を入力してください。\",\"\"))","v":""}]
[{"$nulls":10},"床面積",{"$nulls":6},"㎡",null,"床面積",{"$nulls":6},"㎡",null,"床面積",{"$nulls":6},"㎡",{"$nulls":9},{"$f":"IF(OR(AND(N$94<>\"\",COUNTA(N95)=0),\nAND(W$94<>\"\",COUNTA(W95)=0),\nAND(AF$94<>\"\",COUNTA(AF95)=0)),\"未入力があります。\",\nIF(OR(AND(J$84=\"\",N94=\"\",COUNTA(N95)=1),AND(S$84=\"\",W94=\"\",COUNTA(W95)=1),\nAND(AB$84=\"\",AF94=\"\",COUNTA(AF95)=1)),\"棟番号及び用途を入力してください。\",\nIF(OR(AND(J$84<>\"\",N94=\"\",COUNTA(N95)=1),AND(S$84<>\"\",W94=\"\",COUNTA(W95)=1),\nAND(AB$84<>\"\",AF94=\"\",COUNTA(AF95)=1)),\"用途を入力してください。\",\nIF(OR(AND(J$84=\"\",COUNTA(N95)=1),AND(S$84=\"\",COUNTA(W95)=1),\nAND(AB$84=\"\",COUNTA(AF95)=1)),\"棟番号を入力してください。\",\"\"))))","v":""}]
[{"$nulls":9},"②","用途",{"$nulls":7},"②","用途",{"$nulls":7},"②","用途",{"$nulls":16},{"$f":"IF(OR(AND(N96=\"\",COUNTA(N97)=1),\nAND(W96=\"\",COUNTA(W97)=1),\nAND(AF96=\"\",COUNTA(AF97)=1)),\"未入力です。\",\nIF(OR(AND(J$84=\"\",COUNTA(N96)=1),AND(S$84=\"\",COUNTA(W96)=1),\nAND(AB$84=\"\",COUNTA(AF96)=1)),\"棟番号を入力してください。\",\"\"))","v":""}]
[{"$nulls":10},"床面積",{"$nulls":6},"㎡",null,"床面積",{"$nulls":6},"㎡",null,"床面積",{"$nulls":6},"㎡",{"$nulls":9},{"$f":"IF(OR(AND(N$96<>\"\",COUNTA(N97)=0),\nAND(W$96<>\"\",COUNTA(W97)=0),\nAND(AF$96<>\"\",COUNTA(AF97)=0)),\"未入力があります。\",\nIF(OR(AND(J$84=\"\",N96=\"\",COUNTA(N97)=1),AND(S$84=\"\",W96=\"\",COUNTA(W97)=1),\nAND(AB$84=\"\",AF96=\"\",COUNTA(AF97)=1)),\"棟番号及び用途を入力してください。\",\nIF(OR(AND(J$84<>\"\",N96=\"\",COUNTA(N97)=1),AND(S$84<>\"\",W96=\"\",COUNTA(W97)=1),\nAND(AB$84<>\"\",AF96=\"\",COUNTA(AF97)=1)),\"用途を入力してください。\",\nIF(OR(AND(J$84=\"\",COUNTA(N97)=1),AND(S$84=\"\",COUNTA(W97)=1),\nAND(AB$84=\"\",COUNTA(AF97)=1)),\"棟番号を入力してください。\",\"\"))))","v":""}]
[{"$nulls":9},"③","用途",{"$nulls":7},"③","用途",{"$nulls":7},"③","用途",{"$nulls":16},{"$f":"IF(OR(AND(N98=\"\",COUNTA(N99)=1),\nAND(W98=\"\",COUNTA(W99)=1),\nAND(AF98=\"\",COUNTA(AF99)=1)),\"未入力です。\",\nIF(OR(AND(J$84=\"\",COUNTA(N98)=1),AND(S$84=\"\",COUNTA(W98)=1),\nAND(AB$84=\"\",COUNTA(AF98)=1)),\"棟番号を入力してください。\",\"\"))","v":""}]
[{"$nulls":10},"床面積",{"$nulls":6},"㎡",null,"床面積",{"$nulls":6},"㎡",null,"床面積",{"$nulls":6},"㎡",{"$nulls":9},{"$f":"IF(OR(AND(N$98<>\"\",COUNTA(N99)=0),\nAND(W$98<>\"\",COUNTA(W99)=0),\nAND(AF$98<>\"\",COUNTA(AF99)=0)),\"未入力があります。\",\nIF(OR(AND(J$84=\"\",N98=\"\",COUNTA(N99)=1),AND(S$84=\"\",W98=\"\",COUNTA(W99)=1),\nAND(AB$84=\"\",AF98=\"\",COUNTA(AF99)=1)),\"棟番号及び用途を入力してください。\",\nIF(OR(AND(J$84<>\"\",N98=\"\",COUNTA(N99)=1),AND(S$84<>\"\",W98=\"\",COUNTA(W99)=1),\nAND(AB$84<>\"\",AF98=\"\",COUNTA(AF99)=1)),\"用途を入力してください。\",\nIF(OR(AND(J$84=\"\",COUNTA(N99)=1),AND(S$84=\"\",COUNTA(W99)=1),\nAND(AB$84=\"\",COUNTA(AF99)=1)),\"棟番号を入力してください。\",\"\"))))","v":""}]
[null,"チ．建築工事費予定額",{"$nulls":13},"万円",{"$nulls":8},"万円",{"$nulls":8},"万円",{"$nulls":10},{"$f":"COUNTIF(AN99:AN104, TRUE)","v":0},{"$f":"IF(OR(AND(J$84<>\"\",COUNTA(K100)=0),\nAND(S$84<>\"\",COUNTA(T100)=0),\nAND(AB$84<>\"\",COUNTA(AC100)=0)),\"未入力があります。\",\nIF(OR(AND(J$84=\"\",COUNTA(K100)=1),AND(S$84=\"\",COUNTA(T100)=1),\nAND(AB$84=\"\",COUNTA(AC100)=1)),\"棟番号を入力してください。\",\"\")\n\n)","v":""}]
[{"$nulls":44},{"$f":"COUNTIF(AO99:AO104, TRUE)","v":0},{"$f":"IFERROR(IF(AND($T$96<>\"\",AS101>=2),\"選択は1つまでです（2列目）。\",IF(AND($T$96<>\"\",AS101=0),\"未入力があります（2列目）。\",IF(AND($T$96=\"\",AS101>0),\"棟番号を入力してください（2列目）。\",\"\"))),\"\")","v":"未入力があります（2列目）。"}]
[{"$nulls":13},"消費税込み",{"$nulls":8},"消費税込み",{"$nulls":8},"消費税込み",{"$nulls":7},false,false,false]
[null,"リ．新築工事の場合に\n　　おける地上の階数"]
[{"$nulls":15},"階",{"$nulls":8},"階",{"$nulls":8},"階",{"$nulls":11},{"$f":"IF(OR(AND(J$84=\"\",COUNTA(K104)=1),AND(S$84=\"\",COUNTA(T104)=1),\nAND(AB$84=\"\",COUNTA(AC104)=1)),\"棟番号を入力してください。\",\"\")","v":""}]
[null,"ヌ．新築工事の場合に\n　　おける地下の階数",{"$nulls":36},{"$f":"AT105","v":0}]
[{"$nulls":10},"地下",{"$nulls":4},"階",{"$nulls":3},"地下",{"$nulls":4},"階",{"$nulls":3},"地下",{"$nulls":4},"階",{"$nulls":11},{"$f":"IF(OR(AND(J$84=\"\",COUNTA(M106)=1),AND(S$84=\"\",COUNTA(V106)=1),\nAND(AB$84=\"\",COUNTA(AE106)=1)),\"棟番号を入力してください。\",\"\")","v":""}]
[]
[]
["【７．新築工事の場合における敷地面積】",{"$nulls":25},"㎡",{"$nulls":18},{"$f":"IF(AND($AN$78=TRUE,R109=\"\"),\"未入力です。\",IF(AND($AN$78=FALSE,R109<>\"\"),\"【４．工事種別】が新築以外の場合は回答は不要です。\",\"\"))","v":""}]
[]
[]
["（第三面）"]
[{"$nulls":38},{"$f":"IF(AND($AL$87=TRUE,R113=\"\"),\"未入力\",IF(AND($AL$87=FALSE,R113<>\"\"),\"入力不要\",\"\"))","v":""}]
[]
["【１．住宅部分の概要】"]
[null,"イ．番号"]
[null,"ロ．新設又は\n　　　その他の別",{"$nulls":8},"(1)新設",{"$nulls":5},"(2)その他",{"$nulls":22},false,false,{"$nulls":3},{"$f":"COUNTIF(AN117:AO117, TRUE)","v":0},{"$f":"IF(AND($J116<>\"\",COUNTIF(AN117:AP117,TRUE)=0),\"未入力です。\",\n  IF(AND($J116<>\"\",COUNTIF(AN117:AP117,TRUE)>1),\"選択は1つまでです。\",\"\"))","v":""}]
[null,"ハ．新設住宅の資金",{"$nulls":8},"(1)民間資金住宅",{"$nulls":7},"(2)公営住宅",{"$nulls":6},"(3)住宅金融支援機構住宅",{"$nulls":12},{"$f":"IF(AND($I120<>\"\",COUNTIF(AN118:AP119,TRUE)=0),\"未入力\",\n  IF(AND($I120<>\"\",COUNTIF(AN118:AP119,TRUE)>1),\"複数選択\",\"\"))","v":""},false,false,true,null,null,{"$f":"COUNTIF(AN118:AP118, TRUE)","v":1},{"$f":"IF(AND($J$116<>\"\",AN117=TRUE,COUNTIF(AN118:AP119,TRUE)=0),\"ロで新設を選んだ場合は回答が必要です。\",\n  IF(AND($J$116<>\"\",AN117<>TRUE,COUNTIF(AN118:AP119,TRUE)>0),\"ロで新設を選んだ場合に回答してください。\",\"\"))","v":""}]
[{"$nulls":10},"(4)都市再生機構住宅",{"$nulls":9},"(5)その他",{"$nulls":18},false,false,{"$nulls":3},{"$f":"COUNTIF(AN119:AO119, TRUE)","v":0},{"$f":"IF(AND($J$116<>\"\",COUNTIF(AN118:AP119,TRUE)>1),\"選択は1つまでです。\",\"\")","v":""}]
[null,"ニ．住宅の建築工法",{"$nulls":8},"(1)在来工法",{"$nulls":6},"(2)プレハブ工法",{"$nulls":6},"(3)枠組壁工法",{"$nulls":13},{"$f":"IF(AND($I120<>\"\",COUNTIF(AN120:AP121,TRUE)=0),\"未入力\",\n  IF(AND($I120<>\"\",COUNTIF(AN120:AP121,TRUE)>1),\"複数選択\",\"\"))","v":""},false,false,false,null,null,{"$f":"COUNTIF(AN120:AP120, TRUE)","v":0},{"$f":"IF(AND($J$116<>\"\",COUNTIF(AN120:AP120,TRUE)=0),\"未入力です。\",\n  IF(AND($J$116<>\"\",COUNTIF(AN120:AP120,TRUE)>1),\"選択は1つまでです。\",\"\"))","v":""}]
[null,"ホ．住宅の種類",{"$nulls":8},"(1)専用住宅",{"$nulls":6},"(2)併用住宅",{"$nulls":6},"(3)その他の住宅",{"$nulls":14},false,false,false,null,null,{"$f":"COUNTIF(AN121:AP121, TRUE)","v":0},{"$f":"IF(AND(AND(J81>=30,J81<>\"01\",J81<>\"02\"),AP121=FALSE,J116<>\"\"),\"【５．主要用途】が産業専用建築物の場合、住宅の種類は（３）のみです\",\nIF(AND($J$116<>\"\",COUNTIF(AN121:AP121,TRUE)=0),\"未入力です。\",\n  IF(AND($J$116<>\"\",COUNTIF(AN121:AP121,TRUE)>1),\"選択は1つまでです。\",\"\")))","v":""}]
[null,"ヘ．住宅の建て方",{"$nulls":8},"(1)一戸建住宅",{"$nulls":6},"(2)長屋建住宅",{"$nulls":6},"(3)共同住宅",{"$nulls":13},{"$f":"IF(AND($I120<>\"\",COUNTIF(AN122:AP122,TRUE)=0),\"未入力\",\n  IF(AND($I120<>\"\",COUNTIF(AN122:AP122,TRUE)>1),\"複数選択\",\"\"))","v":""},false,false,false,null,null,{"$f":"COUNTIF(AN122:AP122, TRUE)","v":0},{"$f":"IF(AND($J$116<>\"\",COUNTIF(AN122:AP122,TRUE)=0),\"未入力です。\",\n  IF(AND($J$116<>\"\",COUNTIF(AN122:AP122,TRUE)>1),\"選択は1つまでです。\",\"\"))","v":""}]
[null,"ト．利用関係",{"$nulls":8},"(1)持家　",{"$nulls":6},"(2)貸家　　",{"$nulls":6},"(3)給与住宅",{"$nulls":6},"(4)分譲住宅",{"$nulls":7},false,false,false,false,null,{"$f":"COUNTIF(AN123:AQ123, TRUE)","v":0},{"$f":"IF(AND($J116<>\"\",COUNTIF(AN123:AQ123,TRUE)=0),\"未入力です。\",\"\")","v":""}]
[null,"チ．住宅の戸数",{"$nulls":12},"戸",{"$nulls":6},"戸",{"$nulls":6},"戸",{"$nulls":6},"戸",null,null,{"$f":"IF(AND($I120<>\"\",COUNTIF(AN124:AP124,TRUE)=0),\"未入力\",\n  IF(AND($I120<>\"\",COUNTIF(AN124:AP124,TRUE)>1),\"複数選択\",\"\"))","v":""},{"$nulls":6},{"$f":"IF(AND($J116<>\"\",OR($J$81=\"01\",$J$81=\"02\",$J$81<=24)),\n  IF(AND($J116<>\"\",COUNTA(J124,Q124,X124,AE124)=0),\"未入力です。\",\"\"),\"\")","v":""}]
[null,"リ．工事部分の\n　　床面積の合計",{"$nulls":12},"㎡",{"$nulls":6},"㎡",{"$nulls":6},"㎡",{"$nulls":6},"㎡",null,null,{"$f":"IF(AND($I120<>\"\",COUNTIF(AN125:AQ125,TRUE)=0),\"未入力\",\"\")","v":""},{"$nulls":5},{"$f":"COUNTIF(AN122:AP122, TRUE)","v":0},{"$f":"IF(AND($J116<>\"\",COUNTA(J125,Q125,X125,AE125)=0),\"未入力です。\",\"\")","v":""}]
[{"$nulls":38},{"$f":"IF(AND($I120=\"\",COUNTA(M129,S129,Z129,AG129)>0),\"回答不要\",\n  IF(AND($I120<>\"\",OR($R$90<>\"\",$R$91<>\"\"),COUNTIF(AN118:AP118,TRUE)>0),\n  IF(AND($I120<>\"\",COUNTA(M129,S129,Z129,AG129)=0),\"未入力\",\"\"),\"\"))","v":""}]
[{"$nulls":38},{"$f":"IF(AND($I120<>\"\",COUNTA(M130,S130,Z130,AG130)=0),\"未入力\",\"\")","v":""}]
[null,"イ．番号"]
[null,"ロ．新設又は\n　　　その他の別",{"$nulls":8},"(1)新設",{"$nulls":5},"(2)その他",{"$nulls":22},false,false]
[null,"ハ．新設住宅の資金",{"$nulls":8},"(1)民間資金住宅",{"$nulls":7},"(2)公営住宅",{"$nulls":6},"(3)住宅金融支援機構住宅",{"$nulls":13},false,false,false]
[{"$nulls":10},"(4)都市再生機構住宅",{"$nulls":9},"(5)その他",{"$nulls":18},false,false]
[null,"ニ．住宅の建築工法",{"$nulls":8},"(1)在来工法",{"$nulls":6},"(2)プレハブ工法",{"$nulls":6},"(3)枠組壁工法",{"$nulls":14},false,false,false]
[null,"ホ．住宅の種類",{"$nulls":8},"(1)専用住宅",{"$nulls":6},"(2)併用住宅",{"$nulls":6},"(3)その他の住宅",{"$nulls":14},false,false,false]
[null,"ヘ．住宅の建て方",{"$nulls":8},"(1)一戸建住宅",{"$nulls":6},"(2)長屋建住宅",{"$nulls":6},"(3)共同住宅",{"$nulls":14},false,false,false]
[null,"ト．利用関係",{"$nulls":8},"(1)持家　",{"$nulls":6},"(2)貸家　　",{"$nulls":6},"(3)給与住宅",{"$nulls":6},"(4)分譲住宅",{"$nulls":7},false,false,false,false]
[null,"チ．住宅の戸数",{"$nulls":12},"戸",{"$nulls":6},"戸",{"$nulls":6},"戸",{"$nulls":6},"戸"]
[null,"リ．工事部分の\n　　床面積の合計",{"$nulls":12},"㎡",{"$nulls":6},"㎡",{"$nulls":6},"㎡",{"$nulls":6},"㎡"]
[{"$nulls":38},{"$f":"IF(AND($AN$87=TRUE,COUNTA(T138:V140)=0),\"未入力\",\nIF(COUNTA(T138:V140)>1,\"複数選択\",\"\"))","v":""}]
[]
[null,"イ．番号"]
[null,"ロ．新設又は\n　　　その他の別",{"$nulls":8},"(1)新設",{"$nulls":5},"(2)その他",{"$nulls":21},{"$f":"IF(AND($AN$87=TRUE,COUNTIF(AN141:AP141,TRUE)=0),\"未入力\",IF(COUNTIF(AN141:AP141,TRUE)=2,\"複数選択\",\"\"))","v":""},false,false]
[null,"ハ．新設住宅の資金",{"$nulls":8},"(1)民間資金住宅",{"$nulls":7},"(2)公営住宅",{"$nulls":6},"(3)住宅金融支援機構住宅",{"$nulls":12},{"$f":"IF(AND($AN$87=TRUE,COUNTIF(AN142:AP142,TRUE)=0),\"未入力\",IF(COUNTIF(AN142:AP142,TRUE)=2,\"複数選択\",\"\"))","v":""},false,false,false]
[{"$nulls":10},"(4)都市再生機構住宅",{"$nulls":9},"(5)その他",{"$nulls":17},{"$f":"IF(AND($AN$87=TRUE,K143=\"\"),\"未入力\",\"\")","v":""},false,false]
[null,"ニ．住宅の建築工法",{"$nulls":8},"(1)在来工法",{"$nulls":6},"(2)プレハブ工法",{"$nulls":6},"(3)枠組壁工法",{"$nulls":13},{"$f":"IF(AND($AN$87=TRUE,M144=\"\"),\"未入力\",\"\")","v":""},false,false,false]
[null,"ホ．住宅の種類",{"$nulls":8},"(1)専用住宅",{"$nulls":6},"(2)併用住宅",{"$nulls":6},"(3)その他の住宅",{"$nulls":13},{"$f":"IF(AND($AN$87=TRUE,COUNTIF(AN145:AP145,TRUE)=0),\"未入力\",\"\")","v":""},false,false,false]
[null,"ヘ．住宅の建て方",{"$nulls":8},"(1)一戸建住宅",{"$nulls":6},"(2)長屋建住宅",{"$nulls":6},"(3)共同住宅",{"$nulls":13},{"$f":"IF(AND($AN$87=TRUE,N146=\"\"),\"未入力\",\"\")","v":""},false,false,false]
[null,"ト．利用関係",{"$nulls":8},"(1)持家　",{"$nulls":6},"(2)貸家　　",{"$nulls":6},"(3)給与住宅",{"$nulls":6},"(4)分譲住宅",{"$nulls":6},{"$f":"IF(AND($AN$87=TRUE,N147=\"\"),\"未入力\",\"\")","v":""},false,false,false,false]
[null,"チ．住宅の戸数",{"$nulls":12},"戸",{"$nulls":6},"戸",{"$nulls":6},"戸",{"$nulls":6},"戸"]
[null,"リ．工事部分の\n　　床面積の合計",{"$nulls":12},"㎡",{"$nulls":6},"㎡",{"$nulls":6},"㎡",{"$nulls":6},"㎡"]
[]
[]
["【２．除却建築物の概要】"]
["　イ．産業分類","イ．主要用途",{"$nulls":17},"（注意欄に記載の記号を記入してください）",{"$nulls":25},{"$f":"IF(AND($AP$78=TRUE,COUNTA(L153)=0),\"【４．工事種別】で改築の場合は回答は必須です。\",\"\")","v":""}]
["  ロ．除却原因","ロ．除却原因",{"$nulls":10},"(1)老朽して危険があるため",{"$nulls":11},"(2)その他",{"$nulls":14},false,false,{"$nulls":3},{"$f":"COUNTIF(AN154:AO154, TRUE)","v":0},{"$f":"IFERROR(IF(AS154>=2,\"選択は1つまでです。\",IF(AND($AP$78=TRUE,COUNTIF(AN154:AO154,TRUE)=0),\"【４．工事種別】で改築の場合は回答は必須です。\",\"\")),\"\")","v":""}]
["　ハ．構造","ハ．構造",{"$nulls":10},"(1)木造",{"$nulls":11},"(2)その他",{"$nulls":14},false,false,{"$nulls":3},{"$f":"COUNTIF(AN155:AO155, TRUE)","v":0},{"$f":"IFERROR(IF(AS155>=2,\"選択は1つまでです。\",IF(AND($AP$78=TRUE,COUNTIF(AN155:AO155,TRUE)=0),\"【４．工事種別】で改築の場合は回答は必須です。\",\"\")),\"\")","v":""}]
["　ニ．建築物の数","ニ．建築物の数",{"$nulls":14},"棟",{"$nulls":28},{"$f":"IF(AND($AP$78=TRUE,L156=\"\"),\"【４．工事種別】で改築の場合は回答は必須です。\",\"\")","v":""}]
["　ホ．住宅の戸数","ホ．住宅の戸数",{"$nulls":14},"戸",{"$nulls":28},{"$f":"IF(AND($AP$78=TRUE,L157=\"\"),\"【４．工事種別】で改築の場合は回答は必須です。\",\"\")","v":""}]
["　チ．住宅の利用関係","ヘ．住宅の利用関係",{"$nulls":10},"(1)持家",{"$nulls":4},"(2)貸家",{"$nulls":4},"(3)給与住宅",{"$nulls":16},false,false,false,null,null,{"$f":"COUNTIF(AN158:AP158, TRUE)","v":0},{"$f":"IF(AND($AP$78=TRUE,COUNTIF(AN158:AP158,TRUE)=0),\"【４．工事種別】で改築の場合は回答は必須です。\",\"\")","v":""}]
[null,"ト．建築物の床面積の合計",{"$nulls":14},"㎡",{"$nulls":28},{"$f":"IF(AND($AP$78=TRUE,L159=\"\"),\"【４．工事種別】で改築の場合は回答は必須です。\",\"\")","v":""}]
["　ヌ．建築物の評価額","チ．建築物の評価額",{"$nulls":14},"万円",{"$nulls":28},{"$f":"IF(AND($AP$78=TRUE,L160=\"\"),\"【４．工事種別】で改築の場合は回答は必須です。\",\"\")","v":""}]
[]
[]
["（注意）\n１．各面共通関係\n　　数字は算用数字を、単位はメートル法を用いてください。また、小数点以下の数値は四捨五入してくだ\n　さい。\n２．第一面関係\n  ①　工事施工者及び除却工事施工者の担当者の氏名欄及び担当者の電話番号欄並びに工事監理者の氏名欄\n　　及び電話番号欄には、受付経由機関等が工事内容について確認を行う際に回答ができる担当者の氏名及\n　　び電話番号を記入してください。\n　②　※印のある欄は記入しないでください。\n　③　除却工事施工者欄は、既存の建築物を除却し、引き続き、当該敷地内において建築物を建築しようと\n    する場合に記入してください。\n３．第二面関係\n　①　２欄の「イ」及び「ロ」、３欄の「ロ」、４欄並びに６欄の「ニ」は、該当するチェックボックスに\n    「レ」マークを入れてください。\n　②　２欄の「イ」において、「会社」とは、株式会社、合名会社、合資会社及び合同会社をいい、特別の\n    法律により設立された法人で会社であるものを含みます。\n　③　２欄の「ロ」は、建築主が会社であるときのみ記入してください。\n　④　３欄の「ロ」において、「区域区分非設定都市計画区域」とは、区域区分が定められていない都市計\n    画区域をいいます。\n　⑤　増築と改築とを同時に行うときは、４欄は床面積の大きい方の工事によつて区分してください。\n　⑥　５欄は、居住専用建築物の場合は、次の表の記号の中から該当するものを選んで記入してください。\n "]
{"$rows_empty":18}
["　"]
[null,"主要用途の区分",{"$nulls":29},"記号"]
[null,"居住専用住宅",{"$nulls":7},"住宅、住宅附属建築物（物置、車庫等）",{"$nulls":21},"01"]
[null,"居住専用準住宅",{"$nulls":7},"寮、合宿所、寄宿舎、準住宅附属建築物（物置、車庫等）",{"$nulls":21},"02"]
["  ⑦　５欄は、居住産業併用建築物又は産業専用建築物の場合は、産業の用に供する部分について、次の表\n    の記号の中から該当するものを選んで記入してください。また、一敷地内に既存の建築物があるとき\n    は、記入に際しては、その部分と新たに建築する部分とを総合して判断してください。"]
[]
[null,"主要用途の区分",{"$nulls":29},"記号"]
[{"$nulls":31},"居住\n産業\n併用",null,null,"産業\n専用"]
[null,"農林水産業",{"$nulls":7},"農業、林業、漁業、水産養殖業",{"$nulls":21},10,null,null,30]
[null,"鉱業、採石業、砂利採取業、建設業",{"$nulls":29},11,null,null,31]
[null,"製造業",{"$nulls":7},"食料品製造業、飲料・たばこ・飼料製造業、繊維工業、木材・木製品製造業、家具・装備品製造業、パルプ・紙・紙加工品製造業、印刷・同関連業、化学工業、石油製品・石炭製品製造業、プラスチック製品製造業、ゴム製品製造業、なめし革・同製品・毛皮製造業、窯業・土石製品製造業、鉄鋼業、非鉄金属製造業、金属製品製造業、はん用機械器具製造業、生産用機械器具製造業、業務用機械器具製造業、電子部品・デバイス・電子回路製造業、電気機械器具製造業、情報通信機械器具製造業、輸送用機械器具製造業、その他の製造業",{"$nulls":21},12,null,null,32]
[null,"電気・ガス・熱供給・水道業",{"$nulls":29},13,null,null,33]
[null,"情報通信業",{"$nulls":7},"通信業、放送業、情報サービス業、インターネット附随サービス業、映像・音声・文字情報制作業",{"$nulls":21},14,null,null,34]
[null,"運輸業",{"$nulls":7},"鉄道業、道路旅客運送業、道路貨物運送業、水運業、航空運輸業、倉庫業、運輸に附帯するサービス業",{"$nulls":21},15,null,null,35]
[null,"卸売業、小売業",{"$nulls":29},16,null,null,36]
[null,"金融業、保険業",{"$nulls":29},17,null,null,37]
[null,"不動産業",{"$nulls":7},"不動産取引業、不動産賃貸業・管理業",{"$nulls":21},18,null,null,38]
[null,"宿泊業、飲食サービス業",{"$nulls":7},"宿泊業、飲食店、持ち帰り・配達飲食サービス業",{"$nulls":21},19,null,null,39]
[null,"教育、学習支援業",{"$nulls":7},"学校教育、その他の教育、学習支援業（社会教育、学習塾及び教養・技能教授業ほか）",{"$nulls":21},20,null,null,40]
[null,"医療、福祉",{"$nulls":7},"医療業、保健衛生、社会保険・社会福祉・介護事業",{"$nulls":21},21,null,null,41]
[null,"その他のサービス業",{"$nulls":7},"郵便業（信書便事業を含む。）、郵便局、学術・開発研究機関、政治・経済・文化団体、旅行業、娯楽業、宗教、物品賃貸業、専門サービス業、広告業、技術サービス業、洗濯・理容・美容・浴場業、その他の生活関連サービス業、協同組合、サービス業",{"$nulls":21},22,null,null,42]
[null,"国家公務、地方公務",{"$nulls":29},23,null,null,43]
[null,"他に分類されないもの",{"$nulls":29},24,null,null,44]
[]
["　⑧　６欄は、一の建築物（１棟）ごとに各列に記入してください。\n　⑨　６欄の「イ」は、建築物の数が１のときは「１」と記入し、建築物の数が２以上のときは、一の建築　\n　　物（１棟）ごとに通し番号を付し、その番号を記入してください。\n　⑩　６欄の「ロ」は、届出時点の物件名を記入してください。\n  ⑪　６欄の「ハ」は、居住専用建築物の場合は、次の表の記号の中から該当するものを選んで記入してく\n　　ださい。\n"]
[]
[]
[]
[]
[]
[null,"用途の分類",{"$nulls":31},"記号"]
[null,"一戸建ての住宅",{"$nulls":31},"08010"]
[null,"長屋",{"$nulls":31},"08020"]
[null,"共同住宅 ",{"$nulls":31},"08030"]
[null,"寄宿舎",{"$nulls":31},"08040"]
[null,"下宿",{"$nulls":31},"08050"]
[]
["　⑫　６欄の「ハ」は、居住産業併用建築物又は産業専用建築物の場合は、産業の用に供する部分につい\n    て、次の表の記号の中から該当するものを選んで記入してください。一の建築物に、２種類以上の用途\n    （既存部分があるときは、その用途を含む。）があるときは、一番大きい床面積の用途について記入\n　　し、３種類以上の用途（既存部分があるときは、その用途を含む。）があるときは、「多用途」のチェ\n　　ックボックスに「レ」マークを入れてください。　"]
[]
[]
[]
[]
[]
[null,"用途の分類",{"$nulls":31},"記号"]
[null,"一戸建ての住宅",{"$nulls":29},"08010",null,"08010"]
[null,"長屋",{"$nulls":29},"08020",null,"08020"]
[null,"共同住宅",{"$nulls":29},"08030",null,"08030"]
[null,"寄宿舎",{"$nulls":29},"08040",null,"08040"]
[null,"下宿",{"$nulls":29},"08050",null,"08050"]
[null,"住宅で事務所、店舗その他これらに類する用途を兼ねるもの",{"$nulls":29},"08060",null,"08060"]
[null,"幼稚園",{"$nulls":31},"08070"]
[null,"小学校",{"$nulls":31},"08080"]
[null,"義務教育学校 ",{"$nulls":31},"08082"]
[null,"中学校、高等学校又は中等教育学校",{"$nulls":31},"08090"]
[null,"特別支援学校",{"$nulls":31},"08100"]
[null,"大学又は高等専門学校",{"$nulls":31},"08110"]
[null,"専修学校",{"$nulls":31},"08120"]
[null,"各種学校",{"$nulls":31},"08130"]
[null,"幼保連携型認定こども園 ",{"$nulls":31},"08132"]
[null,"図書館その他これに類するもの",{"$nulls":31},"08140"]
[null,"博物館その他これに類するもの",{"$nulls":31},"08150"]
[null,"美術館その他これに類するもの",{"$nulls":31},"08152"]
[null,"神社、寺院、教会その他これらに類するもの",{"$nulls":31},"08160"]
[null,"老人ホーム、福祉ホームその他これに類するもの",{"$nulls":31},"08170"]
[null,"保育所その他これに類するもの",{"$nulls":31},"08180"]
[null,"助産所（入所する者の寝室があるものに限る。）",{"$nulls":31},"08190"]
[null,"助産所（入所する者の寝室がないものに限る。）",{"$nulls":31},"08192"]
[null,"児童福祉施設等（建築基準法施行令第19条第１項に規定する児童福祉施設等をいい、前４項に掲げるものを除く。次項において同じ。）（入所する者の寝室があるものに限る。）",{"$nulls":31},"08210"]
[null,"児童福祉施設等（入所する者の寝室がないものに限る。）",{"$nulls":31},"08220"]
[null,"公衆浴場（個室付浴場業に係る公衆浴場を除く。）",{"$nulls":31},"08230"]
[null,"診療所（患者の収容施設のあるものに限る。）",{"$nulls":31},"08240"]
[null,"診療所（患者の収容施設のないものに限る。）",{"$nulls":31},"08250"]
[null,"病院",{"$nulls":31},"08260"]
[null,"巡査派出所",{"$nulls":31},"08270"]
[null,"公衆電話所",{"$nulls":31},"08280"]
[null,"郵便法（昭和22年法律第165号）の規定により行う郵便の業務の用に供する施設",{"$nulls":31},"08290"]
[null,"地方公共団体の支庁又は支所",{"$nulls":31},"08300"]
[null,"公衆便所、休憩所又は路線バスの停留所の上家",{"$nulls":31},"08310"]
[null,"建築基準法施行令第130条の４第５号に基づき国土交通大臣が指定する施設",{"$nulls":31},"08320"]
[null,"税務署、警察署、保健所又は消防署その他これらに類するもの",{"$nulls":31},"08330"]
[null,"工場（自動車修理工場を除く。）",{"$nulls":31},"08340"]
[null,"自動車修理工場",{"$nulls":31},"08350"]
[null,"危険物の貯蔵又は処理に供するもの",{"$nulls":31},"08360"]
[null,"ボーリング場、スケート場、水泳場、スキー場、ゴルフ練習場又はバッティング練習場",{"$nulls":31},"08370"]
[null,"体育館又はスポーツの練習場（前項に掲げるものを除く。）",{"$nulls":31},"08380"]
[null,"マージャン屋、ぱちんこ屋、射的場、勝馬投票券発売所、場外車券売場その他これらに類するもの又はカラオケボックスその他これらに類するもの",{"$nulls":31},"08390"]
[null,"ホテル又は旅館",{"$nulls":31},"08400"]
[null,"自動車教習所",{"$nulls":31},"08410"]
[null,"畜舎",{"$nulls":31},"08420"]
[null,"堆肥舎又は水産物の増殖場若しくは養殖場",{"$nulls":31},"08430"]
[null,"日用品の販売を主たる目的とする店舗",{"$nulls":31},"08438"]
[null,"百貨店、マーケットその他の物品販売業を営む店舗（前項に掲げるもの、専ら性的好奇心をそそる写真その他の物品の販売を行うもの並びに田園住居地域及びその周辺の地域で生産された農産物の販売を主たる目的とするものを除く。）",{"$nulls":31},"08440"]
[null,"飲食店（次項に掲げるもの並びに田園住居地域及びその周辺の地域で生産された農産物を材料とする料理の提供を主たる目的とするものを除く。）",{"$nulls":31},"08450"]
[null,"食堂又は喫茶店",{"$nulls":31},"08452"]
[null,"理髪店、美容院、クリーニング取次店、質屋、貸衣装屋、貸本屋その他これらに類するサービス業を営む店舗、洋服店、畳屋、建具屋、自転車店、家庭電気器具店その他これらに類するサービス業を営む店舗で作業場の床面積の合計が50平方メートル以内のもの（原動機を使用する場合にあっては、その出力の合計が0.75キロワット以下のものに限る。）、自家販売のために食品製造業を営むパン屋、米屋、豆腐屋、菓子屋その他これらに類するもの（田園住居地域及びその周辺の地域で生産された農産物を原材料とする食品の製造又は加工を主たる目的とするものを除く。）で作業場の床面積の合計が50平方メートル以内のもの（原動機を使用する場合にあっては、その出力の合計が0.75キロワット以下のものに限る。）又は学習塾、華道教室、囲碁教室その他これらに類する施設",{"$nulls":31},"08456"]
[null,"銀行の支店、損害保険代理店、宅地建物取引業を営む店舗その他これらに類するサービス業を営む店舗",{"$nulls":31},"08458"]
[null,"物品販売業を営む店舗以外の店舗（前２項に掲げるものを除く。）",{"$nulls":31},"08460"]
[null,"事務所",{"$nulls":31},"08470"]
[null,"映画スタジオ又はテレビスタジオ",{"$nulls":31},"08480"]
[null,"自動車車庫",{"$nulls":31},"08490"]
[null,"自転車駐車場",{"$nulls":31},"08500"]
[null,"倉庫業を営む倉庫",{"$nulls":31},"08510"]
[null,"倉庫業を営まない倉庫",{"$nulls":31},"08520"]
[null,"劇場、映画館又は演芸場",{"$nulls":31},"08530"]
[null,"観覧場",{"$nulls":31},"08540"]
[null,"公会堂又は集会場",{"$nulls":31},"08550"]
[null,"展示場",{"$nulls":31},"08560"]
[null,"料理店",{"$nulls":31},"08570"]
[null,"キャバレー、カフェー、ナイトクラブ又はバー",{"$nulls":31},"08580"]
[null,"ダンスホール",{"$nulls":31},"08590"]
[null,"個室付浴場業に係る公衆浴場、ヌードスタジオ、のぞき劇場、ストリップ劇場、専ら異性を同伴する客の休憩の用に供する施設、専ら性的好奇心をそそる写真その他の物品の販売を目的とする店舗その他これらに類するもの",{"$nulls":31},"08600"]
[null,"卸売市場",{"$nulls":31},"08610"]
[null,"火葬場又はと畜場、汚物処理場、ごみ焼却場その他の処理施設",{"$nulls":31},"08620"]
[null,"農産物の生産、集荷、処理又は貯蔵に供するもの",{"$nulls":31},"08630"]
[null,"農業の生産資材の貯蔵に供するもの",{"$nulls":31},"08640"]
[null,"田園住居地域及びその周辺の地域で生産された農産物の販売を主たる目的とする店舗、当該農産物を材料とする料理の提供を主たる目的とする飲食店又は自家販売のために食品製造業を営むパン屋、米屋、豆腐屋、菓子屋その他これらに類するもの（当該農産物を原材料とする食品の製造又は加工を主たる目的とするものに限る。）で作業場の床面積の合計が50平方メートル以内のもの（原動機を使用する場合にあっては、その出力の合計が0.75キロワット以下のものに限る。）",{"$nulls":31},"08650"]
[null,"その他",{"$nulls":31},"08990"]
[]
["　⑬　６欄の「ニ」は、次の表の記号の中から該当するものを選んで記入してください。工事部分が２種類\n    以上の構造からなるときは、床面積が最も大きい部分の構造について記入してください。\n　"]
[]
[null,"構造の区分",{"$nulls":31},"記号"]
[null,"木造",{"$nulls":31},"01"]
[null,"鉄骨鉄筋コンクリート造",{"$nulls":31},"02"]
[null,"鉄筋コンクリート造",{"$nulls":31},"03"]
[null,"鉄骨造",{"$nulls":31},"04"]
[null,"コンクリートブロック造",{"$nulls":31},"05"]
[null,"その他",{"$nulls":31},"06"]
[]
["　⑭　６欄の「ホ」は、その建築物の規模に見合った月数を記入してください。\n　⑮　６欄の「ト」は、床面積が大きい順に３種類までの用途について、（注意）３．⑫に準じて該当する\n　　記号を記入してください。\n  ⑯　６欄の「チ」は、建築設備費を含んだ額を記入してください。消費税込みの金額である場合は、チェ\n    ックボックスに「レ」マークを入れてください。"]
[]
[]
[]
[]
["４．第三面関係\n　①　１欄は、建築物が居住専用住宅又は居住産業併用建築物（工事部分が産業の用のみに供する部分であ\n　　る場合を除く。）である場合に記入してください。当該建築物の数が２以上のときは、一の建築物（１\n　　棟）ごとに記入してください。\n　②　２欄は、既存の建築物を除却し、引き続き、当該敷地内において建築物を建築しようとする場合にお\n    いて、当該除却しようとする建築物について記入してください。\n  ③　１欄の「イ」は、第二面の６欄の「イ」に記入した番号と同じ番号を記入してください。\n　④　１欄の「ロ」から「ト」までは、該当するチェックボックスに「レ」マークを入れてください。ただ\n　　し、建築物が住宅の附属建築物の場合においては、「ニ」から「ト」までは、当該建築物が附属する住\n　　宅が該当するチェックボックスに「レ」マークを入れてください。\n　⑤　１欄の「ロ」において、「新設」とは、新築、増築又は改築によって居室、台所及び便所のある独立\n    して居住し得る住宅が新たに造られるものをいいます。例えば、既存住宅の棟続きであっても、居室、\n    台所又は便所を整えて独立して居住し得るものは「新設」に含まれます。「その他」とは、住宅の附属\n　　建築物又は増築若しくは改築によって造られる住宅で新設に該当しないものをいいます。例えば、一敷\n　　地内に既存住宅があって、別棟に50平方メートルの居室だけを建築しても、新たに造られた部分だけで\n　　は独立して居住し得ないから「その他」に含まれます。"]
{"$rows_empty":14}
["　⑥　１欄の「ハ」は、当該住宅が新設のときのみ記入してください。「民間資金住宅」とは、国、地方公\n    共団体、独立行政法人住宅金融支援機構等の公的な機関の資金に全くよらず、民間資金のみで建てる住\n    宅をいいます。「住宅金融支援機構住宅」とは、独立行政法人住宅金融支援機構から建設資金の融資を\n    受けた住宅をいい、融資額の大小は問いません。「都市再生機構住宅」とは、独立行政法人都市再生機\n    構が分譲又は賃貸を目的として建てた住宅をいいます。\n　⑦　１欄の「ニ」において、「在来工法」とは、プレハブ工法及び枠組壁工法以外の工法をいいます。\n　　「プレハブ工法」とは、住宅の壁、柱、床、はり、屋根又は階段等の主要構造部材を工場で生産し、現\n    場で組立建築する工法をいいます。「枠組壁工法」とは、木材で組まれた枠組に構造用合板その他これ\n    に類するものを打ち付けた床及び壁により建築物を建築する工法で、一般には、ツーバイフォー工法と\n    いわれるものです。\n　⑧　１欄の「ホ」において、「専用住宅」とは、専ら居住の目的だけのために建築するもので、住宅内に\n    店舗、事務所、作業場等の業務の用に供する部分がないものをいいます。「併用住宅」とは、住宅内に\n    店舗、事務所、作業場等の業務の用に供する部分があつて居住部分と機能的に結合して戸をなしている\n    もので、居住部分の床面積の合計が建築物の床面積の合計の５分の１以上のものをいいます。「その他\n    の住宅」とは、主に工場、学校、官公署、旅館、下宿屋、浴場、社寺等の建築物に付属して、これと結\n    合している住宅をいいます。\n　"]
{"$rows_empty":14}
["　⑨　１欄の「ヘ」において、「長屋建住宅」とは、廊下、階段等を共用しない２戸以上の住宅を連続する\n    建て方の住宅（連続建）をいい、廊下、階段等を共用しないで２戸以上の住宅を重ねたもの（重ね建）\n    を含みます。「共同住宅」とは、長屋建住宅以外の住宅で、一の建築物内に２戸以上の住宅があるもの\n    をいい、一般的には、アパート又はマンションといわれるものです。　\n　⑩　一件の建築工事で１欄の「ト」の(1)から(4)までに掲げる住宅の利用関係が２種類以上となる場合\n　　は、１欄の「チ」及び「リ」は当該住宅の利用関係の種類ごとに記入してください。\n　⑪　２欄の「イ」において居住専用建築物の場合は、（注意）３．⑥に準じて該当する記号を記入してく\n    ださい。\n　⑫　２欄の「イ」において居住産業併用建築物又は産業専用建築物の場合は、（注意）３．⑦に準じて該\n    当する記号を記入してください。また、一敷地内に除却しようとする建築物以外に既存の建築物がある\n    ときは、記入に際しては、その部分と除却しようとする部分とを総合して判断してください。\n　⑬　２欄の「ロ」、「ハ」及び「ヘ」は、該当するチェックボックスに「レ」マークを入れてください。\n※この届は国の統計調査において利用される場合があります。"]

{"sheet":"注意欄再掲（参照用）","index":14,"n_rows":183,"n_cols":35,"rows_kept":183,"merged":[[0,0,18,37],[20,1,20,30],[20,31,20,36],[21,1,21,8],[21,9,21,30],[21,31,21,36],[22,1,22,8],[22,9,22,30],[22,31,22,36],[23,0,24,37],[25,1,26,30],[25,31,25,36],[26,31,26,33],[26,34,26,36],[27,1,27,8],[27,9,27,30],[27,31,27,33],[27,34,27,36],[28,1,28,30],[28,31,28,33],[28,34,28,36],[29,1,29,8],[29,9,29,30],[29,31,29,33],[29,34,29,36],[30,1,30,30],[30,31,30,33],[30,34,30,36],[31,1,31,8],[31,9,31,30],[31,31,31,33],[31,34,31,36],[32,1,32,8],[32,9,32,30],[32,31,32,33],[32,34,32,36],[33,1,33,30],[33,31,33,33],[33,34,33,36],[34,1,34,30],[34,31,34,33],[34,34,34,36],[35,1,35,8],[35,9,35,30],[35,31,35,33],[35,34,35,36],[36,1,36,8],[36,9,36,30],[36,31,36,33],[36,34,36,36],[37,1,37,8],[37,9,37,30],[37,31,37,33],[37,34,37,36],[38,1,38,8],[38,9,38,30],[38,31,38,33],[38,34,38,36],[39,1,39,8],[39,9,39,30],[39,31,39,33],[39,34,39,36],[40,1,40,30],[40,31,40,33],[40,34,40,36],[41,1,41,30],[41,31,41,33],[41,34,41,36],[43,0,48,37],[49,1,49,32],[49,33,49,36],[50,1,50,32],[50,33,50,36],[51,1,51,32],[51,33,51,36],[52,1,52,32],[52,33,52,36],[53,1,53,32],[53,33,53,36],[54,1,54,32],[54,33,54,36],[56,0,61,37],[62,1,62,32],[62,33,62,36],[63,1,63,30],[64,1,64,30],[65,1,65,30],[66,1,66,30],[67,1,67,30],[68,1,68,30],[69,1,69,32],[69,33,69,36],[70,1,70,32],[70,33,70,36],[71,1,71,32],[71,33,71,36],[72,1,72,32],[72,33,72,36],[73,1,73,32],[73,33,73,36],[74,1,74,32],[74,33,74,36],[75,1,75,32],[75,33,75,36],[76,1,76,32],[76,33,76,36],[77,1,77,32],[77,33,77,36],[78,1,78,32],[78,33,78,36],[79,1,79,32],[79,33,79,36],[80,1,80,32],[80,33,80,36],[81,1,81,32],[81,33,81,36],[82,1,82,32],[82,33,82,36],[83,1,83,32],[83,33,83,36],[84,1,84,32],[84,33,84,36],[85,1,85,32],[85,33,85,36],[86,1,86,32],[86,33,86,36],[87,1,87,32],[87,33,87,36],[88,1,88,32],[88,33,88,36],[89,1,89,32],[89,33,89,36],[90,1,90,32],[90,33,90,36],[91,1,91,32],[91,33,91,36],[92,1,92,32],[92,33,92,36],[93,1,93,32],[93,33,93,36],[94,1,94,32],[94,33,94,36],[95,1,95,32],[95,33,95,36],[96,1,96,32],[96,33,96,36],[97,1,97,32],[97,33,97,36],[98,1,98,32],[98,33,98,36],[99,1,99,32],[99,33,99,36],[100,1,100,32],[100,33,100,36],[101,1,101,32],[101,33,101,36],[102,1,102,32],[102,33,102,36],[103,1,103,32],[103,33,103,36],[104,1,104,32],[104,33,104,36],[105,1,105,32],[105,33,105,36],[106,1,106,32],[106,33,106,36],[107,1,107,32],[107,33,107,36],[108,1,108,32],[108,33,108,36],[109,1,109,32],[109,33,109,36],[110,1,110,32],[110,33,110,36],[111,1,111,32],[111,33,111,36],[112,1,112,32],[112,33,112,36],[113,1,113,32],[113,33,113,36],[114,1,114,32],[114,33,114,36],[115,1,115,32],[115,33,115,36],[116,1,116,32],[116,33,116,36],[117,1,117,32],[117,33,117,36],[118,1,118,32],[118,33,118,36],[119,1,119,32],[119,33,119,36],[120,1,120,32],[120,33,120,36],[121,1,121,32],[121,33,121,36],[122,1,122,32],[122,33,122,36],[123,1,123,32],[123,33,123,36],[124,1,124,32],[124,33,124,36],[125,1,125,32],[125,33,125,36],[126,1,126,32],[126,33,126,36],[127,1,127,32],[127,33,127,36],[128,1,128,32],[128,33,128,36],[129,1,129,32],[129,33,129,36],[130,1,130,32],[130,33,130,36],[131,1,131,32],[131,33,131,36],[132,1,132,32],[132,33,132,36],[133,1,133,32],[133,33,133,36],[134,1,134,32],[134,33,134,36],[135,1,135,32],[135,33,135,36],[137,0,138,37],[139,1,139,32],[139,33,139,36],[140,1,140,32],[140,33,140,36],[141,1,141,32],[141,33,141,36],[142,1,142,32],[142,33,142,36],[143,1,143,32],[143,33,143,36],[144,1,144,32],[144,33,144,36],[145,1,145,32],[145,33,145,36],[147,0,151,37],[152,0,166,37],[167,0,181,37],[182,0,194,37]]}
["（注意）\n１．各面共通関係\n　　数字は算用数字を、単位はメートル法を用いてください。また、小数点以下の数値は四捨五入してくだ\n　さい。\n２．第一面関係\n  ①　工事施工者及び除却工事施工者の担当者の氏名欄及び担当者の電話番号欄並びに工事監理者の氏名欄\n　　及び電話番号欄には、受付経由機関等が工事内容について確認を行う際に回答ができる担当者の氏名及\n　　び電話番号を記入してください。\n　②　※印のある欄は記入しないでください。\n　③　除却工事施工者欄は、既存の建築物を除却し、引き続き、当該敷地内において建築物を建築しようと\n    する場合に記入してください。\n３．第二面関係\n　①　２欄の「イ」及び「ロ」、３欄の「ロ」、４欄並びに６欄の「ニ」は、該当するチェックボックスに\n    「レ」マークを入れてください。\n　②　２欄の「イ」において、「会社」とは、株式会社、合名会社、合資会社及び合同会社をいい、特別の\n    法律により設立された法人で会社であるものを含みます。\n　③　２欄の「ロ」は、建築主が会社であるときのみ記入してください。\n　④　３欄の「ロ」において、「区域区分非設定都市計画区域」とは、区域区分が定められていない都市計\n    画区域をいいます。\n　⑤　増築と改築とを同時に行うときは、４欄は床面積の大きい方の工事によつて区分してください。\n　⑥　５欄は、居住専用建築物の場合は、次の表の記号の中から該当するものを選んで記入してください。\n "]
{"$rows_empty":18}
["　"]
[null,"主要用途の区分",{"$nulls":29},"記号"]
[null,"居住専用住宅",{"$nulls":7},"住宅、住宅附属建築物（物置、車庫等）",{"$nulls":21},"01"]
[null,"居住専用準住宅",{"$nulls":7},"寮、合宿所、寄宿舎、準住宅附属建築物（物置、車庫等）",{"$nulls":21},"02"]
["  ⑦　５欄は、居住産業併用建築物又は産業専用建築物の場合は、産業の用に供する部分について、次の表\n    の記号の中から該当するものを選んで記入してください。また、一敷地内に既存の建築物があるとき\n    は、記入に際しては、その部分と新たに建築する部分とを総合して判断してください。"]
[]
[null,"主要用途の区分",{"$nulls":29},"記号"]
[{"$nulls":31},"居住\n産業\n併用",null,null,"産業\n専用"]
[null,"農林水産業",{"$nulls":7},"農業、林業、漁業、水産養殖業",{"$nulls":21},10,null,null,30]
[null,"鉱業、採石業、砂利採取業、建設業",{"$nulls":29},11,null,null,31]
[null,"製造業",{"$nulls":7},"食料品製造業、飲料・たばこ・飼料製造業、繊維工業、木材・木製品製造業、家具・装備品製造業、パルプ・紙・紙加工品製造業、印刷・同関連業、化学工業、石油製品・石炭製品製造業、プラスチック製品製造業、ゴム製品製造業、なめし革・同製品・毛皮製造業、窯業・土石製品製造業、鉄鋼業、非鉄金属製造業、金属製品製造業、はん用機械器具製造業、生産用機械器具製造業、業務用機械器具製造業、電子部品・デバイス・電子回路製造業、電気機械器具製造業、情報通信機械器具製造業、輸送用機械器具製造業、その他の製造業",{"$nulls":21},12,null,null,32]
[null,"電気・ガス・熱供給・水道業",{"$nulls":29},13,null,null,33]
[null,"情報通信業",{"$nulls":7},"通信業、放送業、情報サービス業、インターネット附随サービス業、映像・音声・文字情報制作業",{"$nulls":21},14,null,null,34]
[null,"運輸業",{"$nulls":7},"鉄道業、道路旅客運送業、道路貨物運送業、水運業、航空運輸業、倉庫業、運輸に附帯するサービス業",{"$nulls":21},15,null,null,35]
[null,"卸売業、小売業",{"$nulls":29},16,null,null,36]
[null,"金融業、保険業",{"$nulls":29},17,null,null,37]
[null,"不動産業",{"$nulls":7},"不動産取引業、不動産賃貸業・管理業",{"$nulls":21},18,null,null,38]
[null,"宿泊業、飲食サービス業",{"$nulls":7},"宿泊業、飲食店、持ち帰り・配達飲食サービス業",{"$nulls":21},19,null,null,39]
[null,"教育、学習支援業",{"$nulls":7},"学校教育、その他の教育、学習支援業（社会教育、学習塾及び教養・技能教授業ほか）",{"$nulls":21},20,null,null,40]
[null,"医療、福祉",{"$nulls":7},"医療業、保健衛生、社会保険・社会福祉・介護事業",{"$nulls":21},21,null,null,41]
[null,"その他のサービス業",{"$nulls":7},"郵便業（信書便事業を含む。）、郵便局、学術・開発研究機関、政治・経済・文化団体、旅行業、娯楽業、宗教、物品賃貸業、専門サービス業、広告業、技術サービス業、洗濯・理容・美容・浴場業、その他の生活関連サービス業、協同組合、サービス業",{"$nulls":21},22,null,null,42]
[null,"国家公務、地方公務",{"$nulls":29},23,null,null,43]
[null,"他に分類されないもの",{"$nulls":29},24,null,null,44]
[]
["　⑧　６欄は、一の建築物（１棟）ごとに各列に記入してください。\n　⑨　６欄の「イ」は、建築物の数が１のときは「１」と記入し、建築物の数が２以上のときは、一の建築　\n　　物（１棟）ごとに通し番号を付し、その番号を記入してください。\n　⑩　６欄の「ロ」は、届出時点の物件名を記入してください。\n  ⑪　６欄の「ハ」は、居住専用建築物の場合は、次の表の記号の中から該当するものを選んで記入してく\n　　ださい。\n"]
[]
[]
[]
[]
[]
[null,"用途の分類",{"$nulls":31},"記号"]
[null,"一戸建ての住宅",{"$nulls":31},"08010"]
[null,"長屋",{"$nulls":31},"08020"]
[null,"共同住宅 ",{"$nulls":31},"08030"]
[null,"寄宿舎",{"$nulls":31},"08040"]
[null,"下宿",{"$nulls":31},"08050"]
[]
["　⑫　６欄の「ハ」は、居住産業併用建築物又は産業専用建築物の場合は、産業の用に供する部分につい\n    て、次の表の記号の中から該当するものを選んで記入してください。一の建築物に、２種類以上の用途\n    （既存部分があるときは、その用途を含む。）があるときは、一番大きい床面積の用途について記入\n　　し、３種類以上の用途（既存部分があるときは、その用途を含む。）があるときは、「多用途」のチェ\n　　ックボックスに「レ」マークを入れてください。　"]
[]
[]
[]
[]
[]
[null,"用途の分類",{"$nulls":31},"記号"]
[null,"一戸建ての住宅",{"$nulls":29},"08010",null,"08010"]
[null,"長屋",{"$nulls":29},"08020",null,"08020"]
[null,"共同住宅",{"$nulls":29},"08030",null,"08030"]
[null,"寄宿舎",{"$nulls":29},"08040",null,"08040"]
[null,"下宿",{"$nulls":29},"08050",null,"08050"]
[null,"住宅で事務所、店舗その他これらに類する用途を兼ねるもの",{"$nulls":29},"08060",null,"08060"]
[null,"幼稚園",{"$nulls":31},"08070"]
[null,"小学校",{"$nulls":31},"08080"]
[null,"義務教育学校 ",{"$nulls":31},"08082"]
[null,"中学校、高等学校又は中等教育学校",{"$nulls":31},"08090"]
[null,"特別支援学校",{"$nulls":31},"08100"]
[null,"大学又は高等専門学校",{"$nulls":31},"08110"]
[null,"専修学校",{"$nulls":31},"08120"]
[null,"各種学校",{"$nulls":31},"08130"]
[null,"幼保連携型認定こども園 ",{"$nulls":31},"08132"]
[null,"図書館その他これに類するもの",{"$nulls":31},"08140"]
[null,"博物館その他これに類するもの",{"$nulls":31},"08150"]
[null,"美術館その他これに類するもの",{"$nulls":31},"08152"]
[null,"神社、寺院、教会その他これらに類するもの",{"$nulls":31},"08160"]
[null,"老人ホーム、福祉ホームその他これに類するもの",{"$nulls":31},"08170"]
[null,"保育所その他これに類するもの",{"$nulls":31},"08180"]
[null,"助産所（入所する者の寝室があるものに限る。）",{"$nulls":31},"08190"]
[null,"助産所（入所する者の寝室がないものに限る。）",{"$nulls":31},"08192"]
[null,"児童福祉施設等（建築基準法施行令第19条第１項に規定する児童福祉施設等をいい、前４項に掲げるものを除く。次項において同じ。）（入所する者の寝室があるものに限る。）",{"$nulls":31},"08210"]
[null,"児童福祉施設等（入所する者の寝室がないものに限る。）",{"$nulls":31},"08220"]
[null,"公衆浴場（個室付浴場業に係る公衆浴場を除く。）",{"$nulls":31},"08230"]
[null,"診療所（患者の収容施設のあるものに限る。）",{"$nulls":31},"08240"]
[null,"診療所（患者の収容施設のないものに限る。）",{"$nulls":31},"08250"]
[null,"病院",{"$nulls":31},"08260"]
[null,"巡査派出所",{"$nulls":31},"08270"]
[null,"公衆電話所",{"$nulls":31},"08280"]
[null,"郵便法（昭和22年法律第165号）の規定により行う郵便の業務の用に供する施設",{"$nulls":31},"08290"]
[null,"地方公共団体の支庁又は支所",{"$nulls":31},"08300"]
[null,"公衆便所、休憩所又は路線バスの停留所の上家",{"$nulls":31},"08310"]
[null,"建築基準法施行令第130条の４第５号に基づき国土交通大臣が指定する施設",{"$nulls":31},"08320"]
[null,"税務署、警察署、保健所又は消防署その他これらに類するもの",{"$nulls":31},"08330"]
[null,"工場（自動車修理工場を除く。）",{"$nulls":31},"08340"]
[null,"自動車修理工場",{"$nulls":31},"08350"]
[null,"危険物の貯蔵又は処理に供するもの",{"$nulls":31},"08360"]
[null,"ボーリング場、スケート場、水泳場、スキー場、ゴルフ練習場又はバッティング練習場",{"$nulls":31},"08370"]
[null,"体育館又はスポーツの練習場（前項に掲げるものを除く。）",{"$nulls":31},"08380"]
[null,"マージャン屋、ぱちんこ屋、射的場、勝馬投票券発売所、場外車券売場その他これらに類するもの又はカラオケボックスその他これらに類するもの",{"$nulls":31},"08390"]
[null,"ホテル又は旅館",{"$nulls":31},"08400"]
[null,"自動車教習所",{"$nulls":31},"08410"]
[null,"畜舎",{"$nulls":31},"08420"]
[null,"堆肥舎又は水産物の増殖場若しくは養殖場",{"$nulls":31},"08430"]
[null,"日用品の販売を主たる目的とする店舗",{"$nulls":31},"08438"]
[null,"百貨店、マーケットその他の物品販売業を営む店舗（前項に掲げるもの、専ら性的好奇心をそそる写真その他の物品の販売を行うもの並びに田園住居地域及びその周辺の地域で生産された農産物の販売を主たる目的とするものを除く。）",{"$nulls":31},"08440"]
[null,"飲食店（次項に掲げるもの並びに田園住居地域及びその周辺の地域で生産された農産物を材料とする料理の提供を主たる目的とするものを除く。）",{"$nulls":31},"08450"]
[null,"食堂又は喫茶店",{"$nulls":31},"08452"]
[null,"理髪店、美容院、クリーニング取次店、質屋、貸衣装屋、貸本屋その他これらに類するサービス業を営む店舗、洋服店、畳屋、建具屋、自転車店、家庭電気器具店その他これらに類するサービス業を営む店舗で作業場の床面積の合計が50平方メートル以内のもの（原動機を使用する場合にあっては、その出力の合計が0.75キロワット以下のものに限る。）、自家販売のために食品製造業を営むパン屋、米屋、豆腐屋、菓子屋その他これらに類するもの（田園住居地域及びその周辺の地域で生産された農産物を原材料とする食品の製造又は加工を主たる目的とするものを除く。）で作業場の床面積の合計が50平方メートル以内のもの（原動機を使用する場合にあっては、その出力の合計が0.75キロワット以下のものに限る。）又は学習塾、華道教室、囲碁教室その他これらに類する施設",{"$nulls":31},"08456"]
[null,"銀行の支店、損害保険代理店、宅地建物取引業を営む店舗その他これらに類するサービス業を営む店舗",{"$nulls":31},"08458"]
[null,"物品販売業を営む店舗以外の店舗（前２項に掲げるものを除く。）",{"$nulls":31},"08460"]
[null,"事務所",{"$nulls":31},"08470"]
[null,"映画スタジオ又はテレビスタジオ",{"$nulls":31},"08480"]
[null,"自動車車庫",{"$nulls":31},"08490"]
[null,"自転車駐車場",{"$nulls":31},"08500"]
[null,"倉庫業を営む倉庫",{"$nulls":31},"08510"]
[null,"倉庫業を営まない倉庫",{"$nulls":31},"08520"]
[null,"劇場、映画館又は演芸場",{"$nulls":31},"08530"]
[null,"観覧場",{"$nulls":31},"08540"]
[null,"公会堂又は集会場",{"$nulls":31},"08550"]
[null,"展示場",{"$nulls":31},"08560"]
[null,"料理店",{"$nulls":31},"08570"]
[null,"キャバレー、カフェー、ナイトクラブ又はバー",{"$nulls":31},"08580"]
[null,"ダンスホール",{"$nulls":31},"08590"]
[null,"個室付浴場業に係る公衆浴場、ヌードスタジオ、のぞき劇場、ストリップ劇場、専ら異性を同伴する客の休憩の用に供する施設、専ら性的好奇心をそそる写真その他の物品の販売を目的とする店舗その他これらに類するもの",{"$nulls":31},"08600"]
[null,"卸売市場",{"$nulls":31},"08610"]
[null,"火葬場又はと畜場、汚物処理場、ごみ焼却場その他の処理施設",{"$nulls":31},"08620"]
[null,"農産物の生産、集荷、処理又は貯蔵に供するもの",{"$nulls":31},"08630"]
[null,"農業の生産資材の貯蔵に供するもの",{"$nulls":31},"08640"]
[null,"田園住居地域及びその周辺の地域で生産された農産物の販売を主たる目的とする店舗、当該農産物を材料とする料理の提供を主たる目的とする飲食店又は自家販売のために食品製造業を営むパン屋、米屋、豆腐屋、菓子屋その他これらに類するもの（当該農産物を原材料とする食品の製造又は加工を主たる目的とするものに限る。）で作業場の床面積の合計が50平方メートル以内のもの（原動機を使用する場合にあっては、その出力の合計が0.75キロワット以下のものに限る。）",{"$nulls":31},"08650"]
[null,"その他",{"$nulls":31},"08990"]
[]
["　⑬　６欄の「ニ」は、次の表の記号の中から該当するものを選んで記入してください。工事部分が２種類\n    以上の構造からなるときは、床面積が最も大きい部分の構造について記入してください。\n　"]
[]
[null,"構造の区分",{"$nulls":31},"記号"]
[null,"木造",{"$nulls":31},"01"]
[null,"鉄骨鉄筋コンクリート造",{"$nulls":31},"02"]
[null,"鉄筋コンクリート造",{"$nulls":31},"03"]
[null,"鉄骨造",{"$nulls":31},"04"]
[null,"コンクリートブロック造",{"$nulls":31},"05"]
[null,"その他",{"$nulls":31},"06"]
[]
["　⑭　６欄の「ホ」は、その建築物の規模に見合った月数を記入してください。\n　⑮　６欄の「ト」は、床面積が大きい順に３種類までの用途について、（注意）３．⑫に準じて該当する\n　　記号を記入してください。\n  ⑯　６欄の「チ」は、建築設備費を含んだ額を記入してください。消費税込みの金額である場合は、チェ\n    ックボックスに「レ」マークを入れてください。"]
[]
[]
[]
[]
["４．第三面関係\n　①　１欄は、建築物が居住専用住宅又は居住産業併用建築物（工事部分が産業の用のみに供する部分であ\n　　る場合を除く。）である場合に記入してください。当該建築物の数が２以上のときは、一の建築物（１\n　　棟）ごとに記入してください。\n　②　２欄は、既存の建築物を除却し、引き続き、当該敷地内において建築物を建築しようとする場合にお\n    いて、当該除却しようとする建築物について記入してください。\n  ③　１欄の「イ」は、第二面の６欄の「イ」に記入した番号と同じ番号を記入してください。\n　④　１欄の「ロ」から「ト」までは、該当するチェックボックスに「レ」マークを入れてください。ただ\n　　し、建築物が住宅の附属建築物の場合においては、「ニ」から「ト」までは、当該建築物が附属する住\n　　宅が該当するチェックボックスに「レ」マークを入れてください。\n　⑤　１欄の「ロ」において、「新設」とは、新築、増築又は改築によって居室、台所及び便所のある独立\n    して居住し得る住宅が新たに造られるものをいいます。例えば、既存住宅の棟続きであっても、居室、\n    台所又は便所を整えて独立して居住し得るものは「新設」に含まれます。「その他」とは、住宅の附属\n　　建築物又は増築若しくは改築によって造られる住宅で新設に該当しないものをいいます。例えば、一敷\n　　地内に既存住宅があって、別棟に50平方メートルの居室だけを建築しても、新たに造られた部分だけで\n　　は独立して居住し得ないから「その他」に含まれます。"]
{"$rows_empty":14}
["　⑥　１欄の「ハ」は、当該住宅が新設のときのみ記入してください。「民間資金住宅」とは、国、地方公\n    共団体、独立行政法人住宅金融支援機構等の公的な機関の資金に全くよらず、民間資金のみで建てる住\n    宅をいいます。「住宅金融支援機構住宅」とは、独立行政法人住宅金融支援機構から建設資金の融資を\n    受けた住宅をいい、融資額の大小は問いません。「都市再生機構住宅」とは、独立行政法人都市再生機\n    構が分譲又は賃貸を目的として建てた住宅をいいます。\n　⑦　１欄の「ニ」において、「在来工法」とは、プレハブ工法及び枠組壁工法以外の工法をいいます。\n　　「プレハブ工法」とは、住宅の壁、柱、床、はり、屋根又は階段等の主要構造部材を工場で生産し、現\n    場で組立建築する工法をいいます。「枠組壁工法」とは、木材で組まれた枠組に構造用合板その他これ\n    に類するものを打ち付けた床及び壁により建築物を建築する工法で、一般には、ツーバイフォー工法と\n    いわれるものです。\n　⑧　１欄の「ホ」において、「専用住宅」とは、専ら居住の目的だけのために建築するもので、住宅内に\n    店舗、事務所、作業場等の業務の用に供する部分がないものをいいます。「併用住宅」とは、住宅内に\n    店舗、事務所、作業場等の業務の用に供する部分があつて居住部分と機能的に結合して戸をなしている\n    もので、居住部分の床面積の合計が建築物の床面積の合計の５分の１以上のものをいいます。「その他\n    の住宅」とは、主に工場、学校、官公署、旅館、下宿屋、浴場、社寺等の建築物に付属して、これと結\n    合している住宅をいいます。\n　"]
{"$rows_empty":14}
["　⑨　１欄の「ヘ」において、「長屋建住宅」とは、廊下、階段等を共用しない２戸以上の住宅を連続する\n    建て方の住宅（連続建）をいい、廊下、階段等を共用しないで２戸以上の住宅を重ねたもの（重ね建）\n    を含みます。「共同住宅」とは、長屋建住宅以外の住宅で、一の建築物内に２戸以上の住宅があるもの\n    をいい、一般的には、アパート又はマンションといわれるものです。　\n　⑩　一件の建築工事で１欄の「ト」の(1)から(4)までに掲げる住宅の利用関係が２種類以上となる場合\n　　は、１欄の「チ」及び「リ」は当該住宅の利用関係の種類ごとに記入してください。\n　⑪　２欄の「イ」において居住専用建築物の場合は、（注意）３．⑥に準じて該当する記号を記入してく\n    ださい。\n　⑫　２欄の「イ」において居住産業併用建築物又は産業専用建築物の場合は、（注意）３．⑦に準じて該\n    当する記号を記入してください。また、一敷地内に除却しようとする建築物以外に既存の建築物がある\n    ときは、記入に際しては、その部分と除却しようとする部分とを総合して判断してください。\n　⑬　２欄の「ロ」、「ハ」及び「ヘ」は、該当するチェックボックスに「レ」マークを入れてください。\n※この届は国の統計調査において利用される場合があります。"]

{"sheet":"追加記入欄","index":15,"n_rows":74,"n_cols":199,"rows_kept":74,"merged":[[0,3,0,34],[0,55,0,86],[0,107,0,138],[0,159,0,190],[6,0,6,8],[6,9,6,17],[6,52,6,60],[6,61,6,69],[6,104,6,112],[6,113,6,121],[6,156,6,164],[6,165,6,173],[8,0,8,10],[8,52,8,62],[8,104,8,114],[8,156,8,166],[9,1,9,8],[9,9,9,17],[9,18,9,26],[9,27,9,35],[9,53,9,60],[9,61,9,69],[9,70,9,78],[9,79,9,87],[9,105,9,112],[9,113,9,121],[9,122,9,130],[9,131,9,139],[9,157,9,164],[9,165,9,173],[9,174,9,182],[9,183,9,191],[10,1,10,8],[10,9,10,17],[10,18,10,26],[10,27,10,35],[10,53,10,60],[10,61,10,69],[10,70,10,78],[10,79,10,87],[10,105,10,112],[10,113,10,121],[10,122,10,130],[10,131,10,139],[10,157,10,164],[10,165,10,173],[10,174,10,182],[10,183,10,191],[11,1,12,8],[11,9,11,17],[11,18,11,26],[11,27,11,35],[11,53,12,60],[11,61,11,69],[11,70,11,78],[11,79,11,87],[11,105,12,112],[11,113,11,121],[11,122,11,130],[11,131,11,139],[11,157,12,164],[11,165,11,173],[11,174,11,182],[11,183,11,191],[12,9,12,17],[12,18,12,26],[12,27,12,35],[12,61,12,69],[12,70,12,78],[12,79,12,87],[12,113,12,121],[12,122,12,130],[12,131,12,139],[12,165,12,173],[12,174,12,182],[12,183,12,191],[13,1,14,8],[13,9,14,17],[13,18,14,26],[13,27,14,35],[13,53,14,60],[13,61,14,69],[13,70,14,78],[13,79,14,87],[13,105,14,112],[13,113,14,121],[13,122,14,130],[13,131,14,139],[13,157,14,164],[13,165,14,173],[13,174,14,182],[13,183,14,191],[15,1,15,8],[15,10,15,14],[15,15,15,16],[15,19,15,23],[15,24,15,25],[15,28,15,32],[15,33,15,34],[15,53,15,60],[15,62,15,66],[15,67,15,68],[15,71,15,75],[15,76,15,77],[15,80,15,84],[15,85,15,86],[15,105,15,112],[15,114,15,118],[15,119,15,120],[15,123,15,127],[15,128,15,129],[15,132,15,136],[15,137,15,138],[15,157,15,164],[15,166,15,170],[15,171,15,172],[15,175,15,179],[15,180,15,181],[15,184,15,188],[15,189,15,190],[16,1,17,8],[16,19,16,23],[16,53,17,60],[16,71,16,75],[16,105,17,112],[16,123,16,127],[16,157,17,164],[16,175,16,179],[17,10,17,14],[17,15,17,16],[17,19,17,23],[17,24,17,25],[17,28,17,32],[17,33,17,34],[17,62,17,66],[17,67,17,68],[17,71,17,75],[17,76,17,77],[17,80,17,84],[17,85,17,86],[17,114,17,118],[17,119,17,120],[17,123,17,127],[17,128,17,129],[17,132,17,136],[17,137,17,138],[17,166,17,170],[17,171,17,172],[17,175,17,179],[17,180,17,181],[17,184,17,188],[17,189,17,190],[19,1,24,8],[19,10,19,12],[19,13,19,17],[19,19,19,21],[19,22,19,26],[19,28,19,30],[19,31,19,35],[19,53,24,60],[19,62,19,64],[19,65,19,69],[19,71,19,73],[19,74,19,78],[19,80,19,82],[19,83,19,87],[19,105,24,112],[19,114,19,116],[19,117,19,121],[19,123,19,125],[19,126,19,130],[19,132,19,134],[19,135,19,139],[19,157,24,164],[19,166,19,168],[19,169,19,173],[19,175,19,177],[19,178,19,182],[19,184,19,186],[19,187,19,191],[20,10,20,12],[20,13,20,16],[20,19,20,21],[20,22,20,25],[20,28,20,30],[20,31,20,34],[20,62,20,64],[20,65,20,68],[20,71,20,73],[20,74,20,77],[20,80,20,82],[20,83,20,86],[20,114,20,116],[20,117,20,120],[20,123,20,125],[20,126,20,129],[20,132,20,134],[20,135,20,138],[20,166,20,168],[20,169,20,172],[20,175,20,177],[20,178,20,181],[20,184,20,186],[20,187,20,190],[21,10,21,12],[21,13,21,17],[21,19,21,21],[21,22,21,26],[21,28,21,30],[21,31,21,35],[21,62,21,64],[21,65,21,69],[21,71,21,73],[21,74,21,78],[21,80,21,82],[21,83,21,87],[21,114,21,116],[21,117,21,121],[21,123,21,125],[21,126,21,130],[21,132,21,134],[21,135,21,139],[21,166,21,168],[21,169,21,173],[21,175,21,177],[21,178,21,182],[21,184,21,186],[21,187,21,191],[22,10,22,12],[22,13,22,16],[22,19,22,21],[22,22,22,25],[22,28,22,30],[22,31,22,34],[22,62,22,64],[22,65,22,68],[22,71,22,73],[22,74,22,77],[22,80,22,82],[22,83,22,86],[22,114,22,116],[22,117,22,120],[22,123,22,125],[22,126,22,129],[22,132,22,134],[22,135,22,138],[22,166,22,168],[22,169,22,172],[22,175,22,177],[22,178,22,181],[22,184,22,186],[22,187,22,190],[23,10,23,12],[23,13,23,17],[23,19,23,21],[23,22,23,26],[23,28,23,30],[23,31,23,35],[23,62,23,64],[23,65,23,69],[23,71,23,73],[23,74,23,78],[23,80,23,82],[23,83,23,87],[23,114,23,116],[23,117,23,121],[23,123,23,125],[23,126,23,130],[23,132,23,134],[23,135,23,139],[23,166,23,168],[23,169,23,173],[23,175,23,177],[23,178,23,182],[23,184,23,186],[23,187,23,191],[24,10,24,12],[24,13,24,16],[24,19,24,21],[24,22,24,25],[24,28,24,30],[24,31,24,34],[24,62,24,64],[24,65,24,68],[24,71,24,73],[24,74,24,77],[24,80,24,82],[24,83,24,86],[24,114,24,116],[24,117,24,120],[24,123,24,125],[24,126,24,129],[24,132,24,134],[24,135,24,138],[24,166,24,168],[24,169,24,172],[24,175,24,177],[24,178,24,181],[24,184,24,186],[24,187,24,190],[25,1,27,8],[25,10,25,14],[25,15,25,16],[25,19,25,23],[25,24,25,25],[25,28,25,32],[25,33,25,34],[25,53,27,60],[25,62,25,66],[25,67,25,68],[25,71,25,75],[25,76,25,77],[25,80,25,84],[25,85,25,86],[25,105,27,112],[25,114,25,118],[25,119,25,120],[25,123,25,127],[25,128,25,129],[25,132,25,136],[25,137,25,138],[25,157,27,164],[25,166,25,170],[25,171,25,172],[25,175,25,179],[25,180,25,181],[25,184,25,188],[25,189,25,190],[28,1,29,8],[28,53,29,60],[28,105,29,112],[28,157,29,164],[29,10,29,14],[29,15,29,16],[29,19,29,23],[29,24,29,25],[29,28,29,32],[29,33,29,34],[29,62,29,66],[29,67,29,68],[29,71,29,75],[29,76,29,77],[29,80,29,84],[29,85,29,86],[29,114,29,118],[29,119,29,120],[29,123,29,127],[29,128,29,129],[29,132,29,136],[29,137,29,138],[29,166,29,170],[29,171,29,172],[29,175,29,179],[29,180,29,181],[29,184,29,188],[29,189,29,190],[30,1,31,8],[30,10,30,15],[30,19,30,24],[30,28,30,33],[30,53,31,60],[30,62,30,67],[30,71,30,76],[30,80,30,85],[30,105,31,112],[30,114,30,119],[30,123,30,128],[30,132,30,137],[30,157,31,164],[30,166,30,171],[30,175,30,180],[30,184,30,189],[31,12,31,14],[31,15,31,16],[31,21,31,23],[31,24,31,25],[31,30,31,32],[31,33,31,34],[31,64,31,66],[31,67,31,68],[31,73,31,75],[31,76,31,77],[31,82,31,84],[31,85,31,86],[31,116,31,118],[31,119,31,120],[31,125,31,127],[31,128,31,129],[31,134,31,136],[31,137,31,138],[31,168,31,170],[31,171,31,172],[31,177,31,179],[31,180,31,181],[31,186,31,188],[31,189,31,190],[36,0,36,35],[36,52,36,87],[36,104,36,139],[36,156,36,191],[40,1,40,8],[40,9,40,15],[40,53,40,60],[40,61,40,67],[40,105,40,112],[40,113,40,119],[40,157,40,164],[40,165,40,171],[41,1,41,8],[41,53,41,60],[41,105,41,112],[41,157,41,164],[42,1,43,8],[42,18,42,22],[42,25,42,34],[42,53,43,60],[42,70,42,74],[42,77,42,86],[42,105,43,112],[42,122,42,126],[42,129,42,138],[42,157,43,164],[42,174,42,178],[42,181,42,190],[43,10,43,17],[43,20,43,23],[43,62,43,69],[43,72,43,75],[43,114,43,121],[43,124,43,127],[43,166,43,173],[43,176,43,179],[44,1,44,8],[44,10,44,14],[44,17,44,22],[44,24,44,29],[44,53,44,60],[44,62,44,66],[44,69,44,74],[44,76,44,81],[44,105,44,112],[44,114,44,118],[44,121,44,126],[44,128,44,133],[44,157,44,164],[44,166,44,170],[44,173,44,178],[44,180,44,185],[45,1,45,8],[45,10,45,14],[45,17,45,22],[45,24,45,29],[45,53,45,60],[45,62,45,66],[45,69,45,74],[45,76,45,81],[45,105,45,112],[45,114,45,118],[45,121,45,126],[45,128,45,133],[45,157,45,164],[45,166,45,170],[45,173,45,178],[45,180,45,185],[46,1,46,8],[46,10,46,15],[46,17,46,22],[46,24,46,28],[46,30,46,34],[46,53,46,60],[46,62,46,67],[46,69,46,74],[46,76,46,80],[46,82,46,86],[46,105,46,112],[46,114,46,119],[46,121,46,126],[46,128,46,132],[46,134,46,138],[46,157,46,164],[46,166,46,171],[46,173,46,178],[46,180,46,184],[46,186,46,190],[47,1,47,8],[47,10,47,15],[47,17,47,21],[47,24,47,28],[47,31,47,35],[47,53,47,60],[47,62,47,67],[47,69,47,73],[47,76,47,80],[47,83,47,87],[47,105,47,112],[47,114,47,119],[47,121,47,125],[47,128,47,132],[47,135,47,139],[47,157,47,164],[47,166,47,171],[47,173,47,177],[47,180,47,184],[47,187,47,191],[48,1,48,8],[48,9,48,13],[48,16,48,20],[48,23,48,27],[48,30,48,34],[48,53,48,60],[48,61,48,65],[48,68,48,72],[48,75,48,79],[48,82,48,86],[48,105,48,112],[48,113,48,117],[48,120,48,124],[48,127,48,131],[48,134,48,138],[48,157,48,164],[48,165,48,169],[48,172,48,176],[48,179,48,183],[48,186,48,190],[49,1,49,8],[49,9,49,13],[49,16,49,20],[49,23,49,27],[49,30,49,34],[49,53,49,60],[49,61,49,65],[49,68,49,72],[49,75,49,79],[49,82,49,86],[49,105,49,112],[49,113,49,117],[49,120,49,124],[49,127,49,131],[49,134,49,138],[49,157,49,164],[49,165,49,169],[49,172,49,176],[49,179,49,183],[49,186,49,190],[52,1,52,8],[52,9,52,15],[52,53,52,60],[52,61,52,67],[52,105,52,112],[52,113,52,119],[52,157,52,164],[52,165,52,171],[53,1,53,8],[53,53,53,60],[53,105,53,112],[53,157,53,164],[54,1,55,8],[54,18,54,22],[54,25,54,34],[54,53,55,60],[54,70,54,74],[54,77,54,86],[54,105,55,112],[54,122,54,126],[54,129,54,138],[54,157,55,164],[54,174,54,178],[54,181,54,190],[55,10,55,17],[55,20,55,23],[55,62,55,69],[55,72,55,75],[55,114,55,121],[55,124,55,127],[55,166,55,173],[55,176,55,179],[56,1,56,8],[56,10,56,14],[56,17,56,22],[56,24,56,29],[56,53,56,60],[56,62,56,66],[56,69,56,74],[56,76,56,81],[56,105,56,112],[56,114,56,118],[56,121,56,126],[56,128,56,133],[56,157,56,164],[56,166,56,170],[56,173,56,178],[56,180,56,185],[57,1,57,8],[57,10,57,14],[57,17,57,22],[57,24,57,29],[57,53,57,60],[57,62,57,66],[57,69,57,74],[57,76,57,81],[57,105,57,112],[57,114,57,118],[57,121,57,126],[57,128,57,133],[57,157,57,164],[57,166,57,170],[57,173,57,178],[57,180,57,185],[58,1,58,8],[58,10,58,15],[58,17,58,22],[58,24,58,28],[58,30,58,34],[58,53,58,60],[58,62,58,67],[58,69,58,74],[58,76,58,80],[58,82,58,86],[58,105,58,112],[58,114,58,119],[58,121,58,126],[58,128,58,132],[58,134,58,138],[58,157,58,164],[58,166,58,171],[58,173,58,178],[58,180,58,184],[58,186,58,190],[59,1,59,8],[59,10,59,15],[59,17,59,21],[59,24,59,28],[59,31,59,35],[59,53,59,60],[59,62,59,67],[59,69,59,73],[59,76,59,80],[59,83,59,87],[59,105,59,112],[59,114,59,119],[59,121,59,125],[59,128,59,132],[59,135,59,139],[59,157,59,164],[59,166,59,171],[59,173,59,177],[59,180,59,184],[59,187,59,191],[60,1,60,8],[60,9,60,13],[60,16,60,20],[60,23,60,27],[60,30,60,34],[60,53,60,60],[60,61,60,65],[60,68,60,72],[60,75,60,79],[60,82,60,86],[60,105,60,112],[60,113,60,117],[60,120,60,124],[60,127,60,131],[60,134,60,138],[60,157,60,164],[60,165,60,169],[60,172,60,176],[60,179,60,183],[60,186,60,190],[61,1,61,8],[61,9,61,13],[61,16,61,20],[61,23,61,27],[61,30,61,34],[61,53,61,60],[61,61,61,65],[61,68,61,72],[61,75,61,79],[61,82,61,86],[61,105,61,112],[61,113,61,117],[61,120,61,124],[61,127,61,131],[61,134,61,138],[61,157,61,164],[61,165,61,169],[61,172,61,176],[61,179,61,183],[61,186,61,190],[64,1,64,8],[64,9,64,15],[64,53,64,60],[64,61,64,67],[64,105,64,112],[64,113,64,119],[64,157,64,164],[64,165,64,171],[65,1,65,8],[65,53,65,60],[65,105,65,112],[65,157,65,164],[66,1,67,8],[66,18,66,22],[66,25,66,34],[66,53,67,60],[66,70,66,74],[66,77,66,86],[66,105,67,112],[66,122,66,126],[66,129,66,138],[66,157,67,164],[66,174,66,178],[66,181,66,190],[67,10,67,17],[67,20,67,23],[67,62,67,69],[67,72,67,75],[67,114,67,121],[67,124,67,127],[67,166,67,173],[67,176,67,179],[68,1,68,8],[68,10,68,14],[68,17,68,22],[68,24,68,29],[68,53,68,60],[68,62,68,66],[68,69,68,74],[68,76,68,81],[68,105,68,112],[68,114,68,118],[68,121,68,126],[68,128,68,133],[68,157,68,164],[68,166,68,170],[68,173,68,178],[68,180,68,185],[69,1,69,8],[69,10,69,14],[69,17,69,22],[69,24,69,29],[69,53,69,60],[69,62,69,66],[69,69,69,74],[69,76,69,81],[69,105,69,112],[69,114,69,118],[69,121,69,126],[69,128,69,133],[69,157,69,164],[69,166,69,170],[69,173,69,178],[69,180,69,185],[70,1,70,8],[70,10,70,15],[70,17,70,22],[70,24,70,28],[70,30,70,34],[70,53,70,60],[70,62,70,67],[70,69,70,74],[70,76,70,80],[70,82,70,86],[70,105,70,112],[70,114,70,119],[70,121,70,126],[70,128,70,132],[70,134,70,138],[70,157,70,164],[70,166,70,171],[70,173,70,178],[70,180,70,184],[70,186,70,190],[71,1,71,8],[71,10,71,15],[71,17,71,21],[71,24,71,28],[71,31,71,35],[71,53,71,60],[71,62,71,67],[71,69,71,73],[71,76,71,80],[71,83,71,87],[71,105,71,112],[71,114,71,119],[71,121,71,125],[71,128,71,132],[71,135,71,139],[71,157,71,164],[71,166,71,171],[71,173,71,177],[71,180,71,184],[71,187,71,191],[72,1,72,8],[72,9,72,13],[72,16,72,20],[72,23,72,27],[72,30,72,34],[72,53,72,60],[72,61,72,65],[72,68,72,72],[72,75,72,79],[72,82,72,86],[72,105,72,112],[72,113,72,117],[72,120,72,124],[72,127,72,131],[72,134,72,138],[72,157,72,164],[72,165,72,169],[72,172,72,176],[72,179,72,183],[72,186,72,190],[73,1,73,8],[73,9,73,13],[73,16,73,20],[73,23,73,27],[73,30,73,34],[73,53,73,60],[73,61,73,65],[73,68,73,72],[73,75,73,79],[73,82,73,86],[73,105,73,112],[73,113,73,117],[73,120,73,124],[73,127,73,131],[73,134,73,138],[73,157,73,164],[73,165,73,169],[73,172,73,176],[73,179,73,183],[73,186,73,190]]}
["No.2",null,null,"（第二面）",{"$nulls":48},"No.3",null,null,"（第二面）",{"$nulls":48},"No.4",null,null,"（第二面）",{"$nulls":48},"No.5",null,null,"（第二面）"]
[]
[]
["【４．工事種別】",{"$nulls":9},"(1)新築",{"$nulls":4},"(2)増築",{"$nulls":4},"(3)改築",{"$nulls":4},"(4)移転",{"$nulls":12},{"$f":"IF(COUNTIF(AN4:AQ4,TRUE)>1,\"複数選択\",IF(COUNTIF(AN4:AQ4,TRUE)=0,\"未入力\",\"\"))","v":"未入力"},false,false,false,false,null,{"$f":"COUNTIF(AN4:AQ4, TRUE)","v":0},{"$f":"IF(AS4>=2, \"選択は1つまでです。\",IF(COUNTIF(AN4:AQ4,TRUE)=0,\"未入力です。\",\"\"))","v":"未入力です。"},{"$nulls":6},"【４．工事種別】",{"$nulls":9},"(1)新築",{"$nulls":4},"(2)増築",{"$nulls":4},"(3)改築",{"$nulls":4},"(4)移転",{"$nulls":12},{"$f":"IF(COUNTIF(CN4:CQ4,TRUE)>1,\"複数選択\",IF(COUNTIF(CN4:CQ4,TRUE)=0,\"未入力\",\"\"))","v":"未入力"},false,false,false,false,null,{"$f":"COUNTIF(CN4:CQ4, TRUE)","v":0},{"$f":"IF(CS4>=2, \"選択は1つまでです。\",IF(COUNTIF(CN4:CQ4,TRUE)=0,\"未入力です。\",\"\"))","v":"未入力です。"},{"$nulls":6},"【４．工事種別】",{"$nulls":9},"(1)新築",{"$nulls":4},"(2)増築",{"$nulls":4},"(3)改築",{"$nulls":4},"(4)移転",{"$nulls":12},{"$f":"IF(COUNTIF(EN4:EQ4,TRUE)>1,\"複数選択\",IF(COUNTIF(EN4:EQ4,TRUE)=0,\"未入力\",\"\"))","v":"未入力"},false,false,false,false,null,{"$f":"COUNTIF(EN4:EQ4, TRUE)","v":0},{"$f":"IF(ES4>=2, \"選択は1つまでです。\",IF(COUNTIF(EN4:EQ4,TRUE)=0,\"未入力です。\",\"\"))","v":"未入力です。"},{"$nulls":6},"【４．工事種別】",{"$nulls":9},"(1)新築",{"$nulls":4},"(2)増築",{"$nulls":4},"(3)改築",{"$nulls":4},"(4)移転",{"$nulls":12},{"$f":"IF(COUNTIF(GN4:GQ4,TRUE)>1,\"複数選択\",IF(COUNTIF(GN4:GQ4,TRUE)=0,\"未入力\",\"\"))","v":"未入力"},false,false,false,false]
[]
[]
["【５．主要用途】",{"$nulls":17},"（注意欄に記載の記号を記入してください）",{"$nulls":19},{"$f":"IF(COUNTA(J7)=0,\"未入力\",\"\")","v":"未入力"},{"$nulls":6},{"$f":"IF(COUNTA(J7)=0,\"未入力です。\",\"\")","v":"未入力です。"},{"$nulls":6},"【５．主要用途】",{"$nulls":17},"（注意欄に記載の記号を記入してください）",{"$nulls":19},{"$f":"IF(COUNTA(BJ7)=0,\"未入力\",\"\")","v":"未入力"},{"$nulls":6},{"$f":"IF(COUNTA(BJ7)=0,\"未入力です。\",\"\")","v":"未入力です。"},{"$nulls":6},"【５．主要用途】",{"$nulls":17},"（注意欄に記載の記号を記入してください）",{"$nulls":19},{"$f":"IF(COUNTA(DJ7)=0,\"未入力\",\"\")","v":"未入力"},{"$nulls":6},{"$f":"IF(COUNTA(DJ7)=0,\"未入力です。\",\"\")","v":"未入力です。"},{"$nulls":6},"【５．主要用途】",{"$nulls":17},"（注意欄に記載の記号を記入してください）",{"$nulls":19},{"$f":"IF(COUNTA(FJ7)=0,\"未入力\",\"\")","v":"未入力"}]
[]
["【６．一の建築物ごとの内容】",{"$nulls":51},"【６．一の建築物ごとの内容】",{"$nulls":51},"【６．一の建築物ごとの内容】",{"$nulls":51},"【６．一の建築物ごとの内容】"]
[null,"イ．番号",{"$nulls":36},{"$f":"IF(COUNTA(J10,S10,AB10)=0,\"未入力\",\"\")","v":"未入力"},{"$f":"IF(T10<>\"\",\"1\"&TEXT(T10,\"00\"),\nIF(T11<>\"\",\"2\"&TEXT(T11,\"00\"),\nIF(T12<>\"\",\"3\"&TEXT(T12,\"00\"),\"\")))","v":""},{"$nulls":5},{"$f":"IF(COUNTA(J10,S10,AB10)=0,\"未入力です。\",\"\")","v":"未入力です。"},{"$nulls":7},"イ．番号",{"$nulls":36},{"$f":"IF(COUNTA(BJ10,BS10,CB10)=0,\"未入力\",\"\")","v":"未入力"},{"$f":"IF(BT10<>\"\",\"1\"&TEXT(BT10,\"00\"),\nIF(BT11<>\"\",\"2\"&TEXT(BT11,\"00\"),\nIF(BT12<>\"\",\"3\"&TEXT(BT12,\"00\"),\"\")))","v":""},{"$nulls":5},{"$f":"IF(COUNTA(BJ10,BS10,CB10)=0,\"未入力です。\",\"\")","v":"未入力です。"},{"$nulls":7},"イ．番号",{"$nulls":36},{"$f":"IF(COUNTA(DJ10,DS10,EB10)=0,\"未入力\",\"\")","v":"未入力"},{"$f":"IF(DT10<>\"\",\"1\"&TEXT(DT10,\"00\"),\nIF(DT11<>\"\",\"2\"&TEXT(DT11,\"00\"),\nIF(DT12<>\"\",\"3\"&TEXT(DT12,\"00\"),\"\")))","v":""},{"$nulls":5},{"$f":"IF(COUNTA(DJ10,DS10,EB10)=0,\"未入力です。\",\"\")","v":"未入力です。"},{"$nulls":7},"イ．番号",{"$nulls":36},{"$f":"IF(COUNTA(FJ10,FS10,GB10)=0,\"未入力\",\"\")","v":"未入力"},{"$f":"IF(FT10<>\"\",\"1\"&TEXT(FT10,\"00\"),\nIF(FT11<>\"\",\"2\"&TEXT(FT11,\"00\"),\nIF(FT12<>\"\",\"3\"&TEXT(FT12,\"00\"),\"\")))","v":""}]
[null,"ロ．物件名",{"$nulls":37},{"$f":"IFERROR(IF(AND($J$10<>\"\",J11=\"\"),\"未入力があります（1列目）。\",IF(AND($J$10=\"\",J11<>\"\"),\"棟番号を入力してください（1列目）。\",\"\")),\"\")","v":""},{"$f":"IFERROR(IF(AND($S$10<>\"\",S11=\"\"),\"未入力があります（2列目）。\",IF(AND($S$10=\"\",S11<>\"\"),\"棟番号を入力してください（2列目）。\",\"\")),\"\")","v":""},{"$f":"IFERROR(IF(AND($AB$10<>\"\",AB11=\"\"),\"未入力があります（3列目）。\",IF(AND($AB$10=\"\",AB11<>\"\"),\"棟番号を入力してください（3列目）。\",\"\")),\"\")","v":""},{"$nulls":3},{"$f":"IF(OR(AND(J$10<>\"\",COUNTA(J11)=0),\nAND(S$10<>\"\",COUNTA(S11)=0),\nAND(AB$10<>\"\",COUNTA(AB11)=0)),\"未入力があります。\",\nIF(OR(AND(J$10=\"\",COUNTA(J11)=1),AND(S$10=\"\",COUNTA(S11)=1),\nAND(AB$10=\"\",COUNTA(AB11)=1)),\"棟番号を入力してください。\",\"\")\n\n)","v":""},{"$nulls":7},"ロ．物件名",{"$nulls":37},{"$f":"IFERROR(IF(AND($J$10<>\"\",BJ11=\"\"),\"未入力があります（1列目）。\",IF(AND($J$10=\"\",BJ11<>\"\"),\"棟番号を入力してください（1列目）。\",\"\")),\"\")","v":""},{"$f":"IFERROR(IF(AND($S$10<>\"\",BS11=\"\"),\"未入力があります（2列目）。\",IF(AND($S$10=\"\",BS11<>\"\"),\"棟番号を入力してください（2列目）。\",\"\")),\"\")","v":""},{"$f":"IFERROR(IF(AND($AB$10<>\"\",CB11=\"\"),\"未入力があります（3列目）。\",IF(AND($AB$10=\"\",CB11<>\"\"),\"棟番号を入力してください（3列目）。\",\"\")),\"\")","v":""},{"$nulls":3},{"$f":"IF(OR(AND(BJ$10<>\"\",COUNTA(BJ11)=0),\nAND(BS$10<>\"\",COUNTA(BS11)=0),\nAND(CB$10<>\"\",COUNTA(CB11)=0)),\"未入力があります。\",\nIF(OR(AND(BJ$10=\"\",COUNTA(BJ11)=1),AND(BS$10=\"\",COUNTA(BS11)=1),\nAND(CB$10=\"\",COUNTA(CB11)=1)),\"棟番号を入力してください。\",\"\")\n\n)","v":""},{"$nulls":7},"ロ．物件名",{"$nulls":37},{"$f":"IFERROR(IF(AND($J$10<>\"\",DJ11=\"\"),\"未入力があります（1列目）。\",IF(AND($J$10=\"\",DJ11<>\"\"),\"棟番号を入力してください（1列目）。\",\"\")),\"\")","v":""},{"$f":"IFERROR(IF(AND($S$10<>\"\",DS11=\"\"),\"未入力があります（2列目）。\",IF(AND($S$10=\"\",DS11<>\"\"),\"棟番号を入力してください（2列目）。\",\"\")),\"\")","v":""},{"$f":"IFERROR(IF(AND($AB$10<>\"\",EB11=\"\"),\"未入力があります（3列目）。\",IF(AND($AB$10=\"\",EB11<>\"\"),\"棟番号を入力してください（3列目）。\",\"\")),\"\")","v":""},{"$nulls":3},{"$f":"IF(OR(AND(DJ$10<>\"\",COUNTA(DJ11)=0),\nAND(DS$10<>\"\",COUNTA(DS11)=0),\nAND(EB$10<>\"\",COUNTA(EB11)=0)),\"未入力があります。\",\nIF(OR(AND(DJ$10=\"\",COUNTA(DJ11)=1),AND(DS$10=\"\",COUNTA(DS11)=1),\nAND(EB$10=\"\",COUNTA(EB11)=1)),\"棟番号を入力してください。\",\"\")\n\n)","v":""},{"$nulls":7},"ロ．物件名",{"$nulls":37},{"$f":"IFERROR(IF(AND($J$10<>\"\",FJ11=\"\"),\"未入力があります（1列目）。\",IF(AND($J$10=\"\",FJ11<>\"\"),\"棟番号を入力してください（1列目）。\",\"\")),\"\")","v":""},{"$f":"IFERROR(IF(AND($S$10<>\"\",FS11=\"\"),\"未入力があります（2列目）。\",IF(AND($S$10=\"\",FS11<>\"\"),\"棟番号を入力してください（2列目）。\",\"\")),\"\")","v":""},{"$f":"IFERROR(IF(AND($AB$10<>\"\",GB11=\"\"),\"未入力があります（3列目）。\",IF(AND($AB$10=\"\",GB11<>\"\"),\"棟番号を入力してください（3列目）。\",\"\")),\"\")","v":""}]
[null,"ハ．用途\n（注意欄に記載の記号を\n　記入してください）",{"$nulls":43},{"$f":"IF(OR(AND(J$10<>\"\",COUNTA(J12)=0),\nAND(S$10<>\"\",COUNTA(S12)=0),\nAND(AB$10<>\"\",COUNTA(AB12)=0)),\"未入力があります。\",\nIF(OR(AND(J$10=\"\",COUNTA(J12)=1),AND(S$10=\"\",COUNTA(S12)=1),\nAND(AB$10=\"\",COUNTA(AB12)=1)),\"棟番号を入力してください。\",\"\")\n\n)","v":""},{"$nulls":7},"ハ．用途\n（注意欄に記載の記号を\n　記入してください）",{"$nulls":43},{"$f":"IF(OR(AND(BJ$10<>\"\",COUNTA(BJ12)=0),\nAND(BS$10<>\"\",COUNTA(BS12)=0),\nAND(CB$10<>\"\",COUNTA(CB12)=0)),\"未入力があります。\",\nIF(OR(AND(BJ$10=\"\",COUNTA(BJ12)=1),AND(BS$10=\"\",COUNTA(BS12)=1),\nAND(CB$10=\"\",COUNTA(CB12)=1)),\"棟番号を入力してください。\",\"\")\n\n)","v":""},{"$nulls":7},"ハ．用途\n（注意欄に記載の記号を\n　記入してください）",{"$nulls":43},{"$f":"IF(OR(AND(DJ$10<>\"\",COUNTA(DJ12)=0),\nAND(DS$10<>\"\",COUNTA(DS12)=0),\nAND(EB$10<>\"\",COUNTA(EB12)=0)),\"未入力があります。\",\nIF(OR(AND(DJ$10=\"\",COUNTA(DJ12)=1),AND(DS$10=\"\",COUNTA(DS12)=1),\nAND(EB$10=\"\",COUNTA(EB12)=1)),\"棟番号を入力してください。\",\"\")\n\n)","v":""},{"$nulls":7},"ハ．用途\n（注意欄に記載の記号を\n　記入してください）"]
[{"$nulls":9},"多用途",{"$nulls":8},"多用途",{"$nulls":8},"多用途",{"$nulls":11},false,false,false,{"$nulls":19},"多用途",{"$nulls":8},"多用途",{"$nulls":8},"多用途",{"$nulls":11},false,false,false,{"$nulls":19},"多用途",{"$nulls":8},"多用途",{"$nulls":8},"多用途",{"$nulls":11},false,false,false,{"$nulls":19},"多用途",{"$nulls":8},"多用途",{"$nulls":8},"多用途",{"$nulls":11},false,false,false]
[null,"ニ．工事部分の構造\n（注意欄に記載の記号を\n　記入してください）",{"$nulls":43},{"$f":"IF(OR(AND(J$10<>\"\",COUNTA(J14)=0),\nAND(S$10<>\"\",COUNTA(S14)=0),\nAND(AB$10<>\"\",COUNTA(AB14)=0)),\"未入力があります。\",\nIF(OR(AND(J$10=\"\",COUNTA(J14)=1),AND(S$10=\"\",COUNTA(S14)=1),\nAND(AB$10=\"\",COUNTA(AB14)=1)),\"棟番号を入力してください。\",\"\")\n\n)","v":""},{"$nulls":7},"ニ．工事部分の構造\n（注意欄に記載の記号を\n　記入してください）",{"$nulls":43},{"$f":"IF(OR(AND(BJ$10<>\"\",COUNTA(BJ14)=0),\nAND(BS$10<>\"\",COUNTA(BS14)=0),\nAND(CB$10<>\"\",COUNTA(CB14)=0)),\"未入力があります。\",\nIF(OR(AND(BJ$10=\"\",COUNTA(BJ14)=1),AND(BS$10=\"\",COUNTA(BS14)=1),\nAND(CB$10=\"\",COUNTA(CB14)=1)),\"棟番号を入力してください。\",\"\")\n\n)","v":""},{"$nulls":7},"ニ．工事部分の構造\n（注意欄に記載の記号を\n　記入してください）",{"$nulls":43},{"$f":"IF(OR(AND(DJ$10<>\"\",COUNTA(DJ14)=0),\nAND(DS$10<>\"\",COUNTA(DS14)=0),\nAND(EB$10<>\"\",COUNTA(EB14)=0)),\"未入力があります。\",\nIF(OR(AND(DJ$10=\"\",COUNTA(DJ14)=1),AND(DS$10=\"\",COUNTA(DS14)=1),\nAND(EB$10=\"\",COUNTA(EB14)=1)),\"棟番号を入力してください。\",\"\")\n\n)","v":""},{"$nulls":7},"ニ．工事部分の構造\n（注意欄に記載の記号を\n　記入してください）"]
[]
[null,"ホ．工事の予定期間",{"$nulls":13},"月間",{"$nulls":8},"月間",{"$nulls":8},"月間",{"$nulls":4},{"$f":"IF(COUNTA(K16,T16,AC16)=0,\"未入力\",\"\")","v":"未入力"},{"$nulls":6},{"$f":"IF(OR(AND(J$10<>\"\",COUNTA(K16)=0),\nAND(S$10<>\"\",COUNTA(T16)=0),\nAND(AB$10<>\"\",COUNTA(AC16)=0)),\"未入力があります。\",\nIF(OR(AND(J$10=\"\",COUNTA(K16)=1),AND(S$10=\"\",COUNTA(T16)=1),\nAND(AB$10=\"\",COUNTA(AC16)=1)),\"棟番号を入力してください。\",\"\")\n\n)","v":""},{"$nulls":7},"ホ．工事の予定期間",{"$nulls":13},"月間",{"$nulls":8},"月間",{"$nulls":8},"月間",{"$nulls":4},{"$f":"IF(COUNTA(BK16,BT16,CC16)=0,\"未入力\",\"\")","v":"未入力"},{"$nulls":6},{"$f":"IF(OR(AND(BJ$10<>\"\",COUNTA(BK16)=0),\nAND(BS$10<>\"\",COUNTA(BT16)=0),\nAND(CB$10<>\"\",COUNTA(CC16)=0)),\"未入力があります。\",\nIF(OR(AND(BJ$10=\"\",COUNTA(BK16)=1),AND(BS$10=\"\",COUNTA(BT16)=1),\nAND(CB$10=\"\",COUNTA(CC16)=1)),\"棟番号を入力してください。\",\"\")\n\n)","v":""},{"$nulls":7},"ホ．工事の予定期間",{"$nulls":13},"月間",{"$nulls":8},"月間",{"$nulls":8},"月間",{"$nulls":4},{"$f":"IF(COUNTA(DK16,DT16,EC16)=0,\"未入力\",\"\")","v":"未入力"},{"$nulls":6},{"$f":"IF(OR(AND(DJ$10<>\"\",COUNTA(DK16)=0),\nAND(DS$10<>\"\",COUNTA(DT16)=0),\nAND(EB$10<>\"\",COUNTA(EC16)=0)),\"未入力があります。\",\nIF(OR(AND(DJ$10=\"\",COUNTA(DK16)=1),AND(DS$10=\"\",COUNTA(DT16)=1),\nAND(EB$10=\"\",COUNTA(EC16)=1)),\"棟番号を入力してください。\",\"\")\n\n)","v":""},{"$nulls":7},"ホ．工事の予定期間",{"$nulls":13},"月間",{"$nulls":8},"月間",{"$nulls":8},"月間",{"$nulls":4},{"$f":"IF(COUNTA(FK16,FT16,GC16)=0,\"未入力\",\"\")","v":"未入力"}]
[null,"ヘ．工事部分の\n　　  床面積の合計",{"$nulls":42},{"$f":"COUNTIF(AN17:AN23, TRUE)","v":0},{"$nulls":8},"ヘ．工事部分の\n　　  床面積の合計",{"$nulls":42},{"$f":"COUNTIF(CN17:CN23, TRUE)","v":0},{"$nulls":8},"ヘ．工事部分の\n　　  床面積の合計",{"$nulls":42},{"$f":"COUNTIF(EN17:EN23, TRUE)","v":0},{"$nulls":8},"ヘ．工事部分の\n　　  床面積の合計"]
[{"$nulls":15},"㎡",{"$nulls":8},"㎡",{"$nulls":8},"㎡",{"$nulls":10},{"$f":"COUNTIF(AO17:AO23, TRUE)","v":0},{"$f":"IF(OR(AND(J$10<>\"\",COUNTA(K18)=0),\nAND(S$10<>\"\",COUNTA(T18)=0),\nAND(AB$10<>\"\",COUNTA(AC18)=0)),\"未入力があります。\",\nIF(OR(AND(J$10=\"\",COUNTA(K18)=1),AND(S$10=\"\",COUNTA(T18)=1),\nAND(AB$10=\"\",COUNTA(AC18)=1)),\"棟番号を入力してください。\",IF(AND(K18<>\"\",K18<10),\"10㎡未満の場合は届出不要です。\",IF(AND(T18<>\"\",T18<10),\"10㎡未満の場合は届出不要です。\",IF(AND(AC18<>\"\",AC18<10),\"10㎡以下の場合は届出不要です。\",\"\")))\n\n))","v":""},{"$nulls":21},"㎡",{"$nulls":8},"㎡",{"$nulls":8},"㎡",{"$nulls":10},{"$f":"COUNTIF(CO17:CO23, TRUE)","v":0},{"$f":"IF(OR(AND(BJ$10<>\"\",COUNTA(BK18)=0),\nAND(BS$10<>\"\",COUNTA(BT18)=0),\nAND(CB$10<>\"\",COUNTA(CC18)=0)),\"未入力があります。\",\nIF(OR(AND(BJ$10=\"\",COUNTA(BK18)=1),AND(BS$10=\"\",COUNTA(BT18)=1),\nAND(CB$10=\"\",COUNTA(CC18)=1)),\"棟番号を入力してください。\",IF(AND(BK18<>\"\",BK18<10),\"10㎡未満の場合は届出不要です。\",IF(AND(BT18<>\"\",BT18<10),\"10㎡未満の場合は届出不要です。\",IF(AND(CC18<>\"\",CC18<10),\"10㎡以下の場合は届出不要です。\",\"\")))\n\n))","v":""},{"$nulls":21},"㎡",{"$nulls":8},"㎡",{"$nulls":8},"㎡",{"$nulls":10},{"$f":"COUNTIF(EO17:EO23, TRUE)","v":0},{"$f":"IF(OR(AND(DJ$10<>\"\",COUNTA(DK18)=0),\nAND(DS$10<>\"\",COUNTA(DT18)=0),\nAND(EB$10<>\"\",COUNTA(EC18)=0)),\"未入力があります。\",\nIF(OR(AND(DJ$10=\"\",COUNTA(DK18)=1),AND(DS$10=\"\",COUNTA(DT18)=1),\nAND(EB$10=\"\",COUNTA(EC18)=1)),\"棟番号を入力してください。\",IF(AND(DK18<>\"\",DK18<10),\"10㎡未満の場合は届出不要です。\",IF(AND(DT18<>\"\",DT18<10),\"10㎡未満の場合は届出不要です。\",IF(AND(EC18<>\"\",EC18<10),\"10㎡以下の場合は届出不要です。\",\"\")))\n\n))","v":""},{"$nulls":21},"㎡",{"$nulls":8},"㎡",{"$nulls":8},"㎡"]
[{"$nulls":39},false,false,false,null,null,{"$f":"COUNTIF(AP17:AP23, TRUE)","v":0},{"$f":"IF(OR(AND(J$10<>\"\",COUNTA(K19)=0),\nAND(S$10<>\"\",COUNTA(T19)=0),\nAND(AB$10<>\"\",COUNTA(AC19)=0)),\"未入力があります。\",\nIF(OR(AND(J$10=\"\",COUNTA(K19)=1),AND(S$10=\"\",COUNTA(T19)=1),\nAND(AB$10=\"\",COUNTA(AC19)=1)),\"棟番号を入力してください。\",\"\")\n\n)","v":""},{"$nulls":45},false,false,false,null,null,{"$f":"COUNTIF(CP17:CP23, TRUE)","v":0},{"$f":"IF(OR(AND(BJ$10<>\"\",COUNTA(BK19)=0),\nAND(BS$10<>\"\",COUNTA(BT19)=0),\nAND(CB$10<>\"\",COUNTA(CC19)=0)),\"未入力があります。\",\nIF(OR(AND(BJ$10=\"\",COUNTA(BK19)=1),AND(BS$10=\"\",COUNTA(BT19)=1),\nAND(CB$10=\"\",COUNTA(CC19)=1)),\"棟番号を入力してください。\",\"\")\n\n)","v":""},{"$nulls":45},false,false,false,null,null,{"$f":"COUNTIF(EP17:EP23, TRUE)","v":0},{"$f":"IF(OR(AND(DJ$10<>\"\",COUNTA(DK19)=0),\nAND(DS$10<>\"\",COUNTA(DT19)=0),\nAND(EB$10<>\"\",COUNTA(EC19)=0)),\"未入力があります。\",\nIF(OR(AND(DJ$10=\"\",COUNTA(DK19)=1),AND(DS$10=\"\",COUNTA(DT19)=1),\nAND(EB$10=\"\",COUNTA(EC19)=1)),\"棟番号を入力してください。\",\"\")\n\n)","v":""},{"$nulls":45},false,false,false]
[null,"ト．用途ごとの工事部\n　　分の床面積\n（工事部分の用途が１種類\n　のみであり、ハの用途と\n　同一である場合は、記入\n　不要です。）",{"$nulls":7},"①","用途",{"$nulls":7},"①","用途",{"$nulls":7},"①","用途",{"$nulls":9},{"$f":"AT20&AT21&AT22&AT23&AT24&AT25","v":""},{"$nulls":6},{"$f":"IF(OR(AND(N20=\"\",COUNTA(N21)=1),\nAND(W20=\"\",COUNTA(W21)=1),\nAND(AF20=\"\",COUNTA(AF21)=1)),\"未入力です。\",\nIF(OR(AND(J$10=\"\",COUNTA(N20)=1),AND(S$10=\"\",COUNTA(W20)=1),\nAND(AB$10=\"\",COUNTA(AF20)=1)),\"棟番号を入力してください。\",\"\"))","v":""},{"$nulls":7},"ト．用途ごとの工事部\n　　分の床面積\n（工事部分の用途が１種類\n　のみであり、ハの用途と\n　同一である場合は、記入\n　不要です。）",{"$nulls":7},"①","用途",{"$nulls":7},"①","用途",{"$nulls":7},"①","用途",{"$nulls":9},{"$f":"CT20&CT21&CT22&CT23&CT24&CT25","v":""},{"$nulls":6},{"$f":"IF(OR(AND(BN20=\"\",COUNTA(BN21)=1),\nAND(BW20=\"\",COUNTA(BW21)=1),\nAND(CF20=\"\",COUNTA(CF21)=1)),\"未入力です。\",\nIF(OR(AND(BJ$10=\"\",COUNTA(BN20)=1),AND(BS$10=\"\",COUNTA(BW20)=1),\nAND(CB$10=\"\",COUNTA(CF20)=1)),\"棟番号を入力してください。\",\"\"))","v":""},{"$nulls":7},"ト．用途ごとの工事部\n　　分の床面積\n（工事部分の用途が１種類\n　のみであり、ハの用途と\n　同一である場合は、記入\n　不要です。）",{"$nulls":7},"①","用途",{"$nulls":7},"①","用途",{"$nulls":7},"①","用途",{"$nulls":9},{"$f":"ET20&ET21&ET22&ET23&ET24&ET25","v":""},{"$nulls":6},{"$f":"IF(OR(AND(DN20=\"\",COUNTA(DN21)=1),\nAND(DW20=\"\",COUNTA(DW21)=1),\nAND(EF20=\"\",COUNTA(EF21)=1)),\"未入力です。\",\nIF(OR(AND(DJ$10=\"\",COUNTA(DN20)=1),AND(DS$10=\"\",COUNTA(DW20)=1),\nAND(EB$10=\"\",COUNTA(EF20)=1)),\"棟番号を入力してください。\",\"\"))","v":""},{"$nulls":7},"ト．用途ごとの工事部\n　　分の床面積\n（工事部分の用途が１種類\n　のみであり、ハの用途と\n　同一である場合は、記入\n　不要です。）",{"$nulls":7},"①","用途",{"$nulls":7},"①","用途",{"$nulls":7},"①","用途",{"$nulls":9},{"$f":"GT20&GT21&GT22&GT23&GT24&GT25","v":""}]
[{"$nulls":10},"床面積",{"$nulls":6},"㎡",null,"床面積",{"$nulls":6},"㎡",null,"床面積",{"$nulls":6},"㎡",{"$nulls":9},{"$f":"IF(OR(AND(N$20<>\"\",COUNTA(N21)=0),\nAND(W$20<>\"\",COUNTA(W21)=0),\nAND(AF$20<>\"\",COUNTA(AF21)=0)),\"未入力があります。\",\nIF(OR(AND(J$10=\"\",N20=\"\",COUNTA(N21)=1),AND(S$10=\"\",W20=\"\",COUNTA(W21)=1),\nAND(AB$10=\"\",AF20=\"\",COUNTA(AF21)=1)),\"棟番号及び用途を入力してください。\",\nIF(OR(AND(J$10<>\"\",N20=\"\",COUNTA(N21)=1),AND(S$10<>\"\",W20=\"\",COUNTA(W21)=1),\nAND(AB$10<>\"\",AF20=\"\",COUNTA(AF21)=1)),\"用途を入力してください。\",\nIF(OR(AND(J$10=\"\",COUNTA(N21)=1),AND(S$10=\"\",COUNTA(W21)=1),\nAND(AB$10=\"\",COUNTA(AF21)=1)),\"棟番号を入力してください。\",\"\"))))","v":""},{"$nulls":16},"床面積",{"$nulls":6},"㎡",null,"床面積",{"$nulls":6},"㎡",null,"床面積",{"$nulls":6},"㎡",{"$nulls":9},{"$f":"IF(OR(AND(BN$20<>\"\",COUNTA(BN21)=0),\nAND(BW$20<>\"\",COUNTA(BW21)=0),\nAND(CF$20<>\"\",COUNTA(CF21)=0)),\"未入力があります。\",\nIF(OR(AND(BJ$10=\"\",BN20=\"\",COUNTA(BN21)=1),AND(BS$10=\"\",BW20=\"\",COUNTA(BW21)=1),\nAND(CB$10=\"\",CF20=\"\",COUNTA(CF21)=1)),\"棟番号及び用途を入力してください。\",\nIF(OR(AND(BJ$10<>\"\",BN20=\"\",COUNTA(BN21)=1),AND(BS$10<>\"\",BW20=\"\",COUNTA(BW21)=1),\nAND(CB$10<>\"\",CF20=\"\",COUNTA(CF21)=1)),\"用途を入力してください。\",\nIF(OR(AND(BJ$10=\"\",COUNTA(BN21)=1),AND(BS$10=\"\",COUNTA(BW21)=1),\nAND(CB$10=\"\",COUNTA(CF21)=1)),\"棟番号を入力してください。\",\"\"))))","v":""},{"$nulls":16},"床面積",{"$nulls":6},"㎡",null,"床面積",{"$nulls":6},"㎡",null,"床面積",{"$nulls":6},"㎡",{"$nulls":9},{"$f":"IF(OR(AND(DN$20<>\"\",COUNTA(DN21)=0),\nAND(DW$20<>\"\",COUNTA(DW21)=0),\nAND(EF$20<>\"\",COUNTA(EF21)=0)),\"未入力があります。\",\nIF(OR(AND(DJ$10=\"\",DN20=\"\",COUNTA(DN21)=1),AND(DS$10=\"\",DW20=\"\",COUNTA(DW21)=1),\nAND(EB$10=\"\",EF20=\"\",COUNTA(EF21)=1)),\"棟番号及び用途を入力してください。\",\nIF(OR(AND(DJ$10<>\"\",DN20=\"\",COUNTA(DN21)=1),AND(DS$10<>\"\",DW20=\"\",COUNTA(DW21)=1),\nAND(EB$10<>\"\",EF20=\"\",COUNTA(EF21)=1)),\"用途を入力してください。\",\nIF(OR(AND(DJ$10=\"\",COUNTA(DN21)=1),AND(DS$10=\"\",COUNTA(DW21)=1),\nAND(EB$10=\"\",COUNTA(EF21)=1)),\"棟番号を入力してください。\",\"\"))))","v":""},{"$nulls":16},"床面積",{"$nulls":6},"㎡",null,"床面積",{"$nulls":6},"㎡",null,"床面積",{"$nulls":6},"㎡"]
[{"$nulls":9},"②","用途",{"$nulls":7},"②","用途",{"$nulls":7},"②","用途",{"$nulls":16},{"$f":"IF(OR(AND(N22=\"\",COUNTA(N23)=1),\nAND(W22=\"\",COUNTA(W23)=1),\nAND(AF22=\"\",COUNTA(AF23)=1)),\"未入力です。\",\nIF(OR(AND(J$10=\"\",COUNTA(N22)=1),AND(S$10=\"\",COUNTA(W22)=1),\nAND(AB$10=\"\",COUNTA(AF22)=1)),\"棟番号を入力してください。\",\"\"))","v":""},{"$nulls":15},"②","用途",{"$nulls":7},"②","用途",{"$nulls":7},"②","用途",{"$nulls":16},{"$f":"IF(OR(AND(BN22=\"\",COUNTA(BN23)=1),\nAND(BW22=\"\",COUNTA(BW23)=1),\nAND(CF22=\"\",COUNTA(CF23)=1)),\"未入力です。\",\nIF(OR(AND(BJ$10=\"\",COUNTA(BN22)=1),AND(BS$10=\"\",COUNTA(BW22)=1),\nAND(CB$10=\"\",COUNTA(CF22)=1)),\"棟番号を入力してください。\",\"\"))","v":""},{"$nulls":15},"②","用途",{"$nulls":7},"②","用途",{"$nulls":7},"②","用途",{"$nulls":16},{"$f":"IF(OR(AND(DN22=\"\",COUNTA(DN23)=1),\nAND(DW22=\"\",COUNTA(DW23)=1),\nAND(EF22=\"\",COUNTA(EF23)=1)),\"未入力です。\",\nIF(OR(AND(DJ$10=\"\",COUNTA(DN22)=1),AND(DS$10=\"\",COUNTA(DW22)=1),\nAND(EB$10=\"\",COUNTA(EF22)=1)),\"棟番号を入力してください。\",\"\"))","v":""},{"$nulls":15},"②","用途",{"$nulls":7},"②","用途",{"$nulls":7},"②","用途"]
[{"$nulls":10},"床面積",{"$nulls":6},"㎡",null,"床面積",{"$nulls":6},"㎡",null,"床面積",{"$nulls":6},"㎡",{"$nulls":9},{"$f":"IF(OR(AND(N$22<>\"\",COUNTA(N23)=0),\nAND(W$22<>\"\",COUNTA(W23)=0),\nAND(AF$22<>\"\",COUNTA(AF23)=0)),\"未入力があります。\",\nIF(OR(AND(J$10=\"\",N22=\"\",COUNTA(N23)=1),AND(S$10=\"\",W22=\"\",COUNTA(W23)=1),\nAND(AB$10=\"\",AF22=\"\",COUNTA(AF23)=1)),\"棟番号及び用途を入力してください。\",\nIF(OR(AND(J$10<>\"\",N22=\"\",COUNTA(N23)=1),AND(S$10<>\"\",W22=\"\",COUNTA(W23)=1),\nAND(AB$10<>\"\",AF22=\"\",COUNTA(AF23)=1)),\"用途を入力してください。\",\nIF(OR(AND(J$10=\"\",COUNTA(N23)=1),AND(S$10=\"\",COUNTA(W23)=1),\nAND(AB$10=\"\",COUNTA(AF23)=1)),\"棟番号を入力してください。\",\"\"))))","v":""},{"$nulls":16},"床面積",{"$nulls":6},"㎡",null,"床面積",{"$nulls":6},"㎡",null,"床面積",{"$nulls":6},"㎡",{"$nulls":9},{"$f":"IF(OR(AND(BN$22<>\"\",COUNTA(BN23)=0),\nAND(BW$22<>\"\",COUNTA(BW23)=0),\nAND(CF$22<>\"\",COUNTA(CF23)=0)),\"未入力があります。\",\nIF(OR(AND(BJ$10=\"\",BN22=\"\",COUNTA(BN23)=1),AND(BS$10=\"\",BW22=\"\",COUNTA(BW23)=1),\nAND(CB$10=\"\",CF22=\"\",COUNTA(CF23)=1)),\"棟番号及び用途を入力してください。\",\nIF(OR(AND(BJ$10<>\"\",BN22=\"\",COUNTA(BN23)=1),AND(BS$10<>\"\",BW22=\"\",COUNTA(BW23)=1),\nAND(CB$10<>\"\",CF22=\"\",COUNTA(CF23)=1)),\"用途を入力してください。\",\nIF(OR(AND(BJ$10=\"\",COUNTA(BN23)=1),AND(BS$10=\"\",COUNTA(BW23)=1),\nAND(CB$10=\"\",COUNTA(CF23)=1)),\"棟番号を入力してください。\",\"\"))))","v":""},{"$nulls":16},"床面積",{"$nulls":6},"㎡",null,"床面積",{"$nulls":6},"㎡",null,"床面積",{"$nulls":6},"㎡",{"$nulls":9},{"$f":"IF(OR(AND(DN$22<>\"\",COUNTA(DN23)=0),\nAND(DW$22<>\"\",COUNTA(DW23)=0),\nAND(EF$22<>\"\",COUNTA(EF23)=0)),\"未入力があります。\",\nIF(OR(AND(DJ$10=\"\",DN22=\"\",COUNTA(DN23)=1),AND(DS$10=\"\",DW22=\"\",COUNTA(DW23)=1),\nAND(EB$10=\"\",EF22=\"\",COUNTA(EF23)=1)),\"棟番号及び用途を入力してください。\",\nIF(OR(AND(DJ$10<>\"\",DN22=\"\",COUNTA(DN23)=1),AND(DS$10<>\"\",DW22=\"\",COUNTA(DW23)=1),\nAND(EB$10<>\"\",EF22=\"\",COUNTA(EF23)=1)),\"用途を入力してください。\",\nIF(OR(AND(DJ$10=\"\",COUNTA(DN23)=1),AND(DS$10=\"\",COUNTA(DW23)=1),\nAND(EB$10=\"\",COUNTA(EF23)=1)),\"棟番号を入力してください。\",\"\"))))","v":""},{"$nulls":16},"床面積",{"$nulls":6},"㎡",null,"床面積",{"$nulls":6},"㎡",null,"床面積",{"$nulls":6},"㎡"]
[{"$nulls":9},"③","用途",{"$nulls":7},"③","用途",{"$nulls":7},"③","用途",{"$nulls":16},{"$f":"IF(OR(AND(N24=\"\",COUNTA(N25)=1),\nAND(W24=\"\",COUNTA(W25)=1),\nAND(AF24=\"\",COUNTA(AF25)=1)),\"未入力です。\",\nIF(OR(AND(J$10=\"\",COUNTA(N24)=1),AND(S$10=\"\",COUNTA(W24)=1),\nAND(AB$10=\"\",COUNTA(AF24)=1)),\"棟番号を入力してください。\",\"\"))","v":""},{"$nulls":15},"③","用途",{"$nulls":7},"③","用途",{"$nulls":7},"③","用途",{"$nulls":16},{"$f":"IF(OR(AND(BN24=\"\",COUNTA(BN25)=1),\nAND(BW24=\"\",COUNTA(BW25)=1),\nAND(CF24=\"\",COUNTA(CF25)=1)),\"未入力です。\",\nIF(OR(AND(BJ$10=\"\",COUNTA(BN24)=1),AND(BS$10=\"\",COUNTA(BW24)=1),\nAND(CB$10=\"\",COUNTA(CF24)=1)),\"棟番号を入力してください。\",\"\"))","v":""},{"$nulls":15},"③","用途",{"$nulls":7},"③","用途",{"$nulls":7},"③","用途",{"$nulls":16},{"$f":"IF(OR(AND(DN24=\"\",COUNTA(DN25)=1),\nAND(DW24=\"\",COUNTA(DW25)=1),\nAND(EF24=\"\",COUNTA(EF25)=1)),\"未入力です。\",\nIF(OR(AND(DJ$10=\"\",COUNTA(DN24)=1),AND(DS$10=\"\",COUNTA(DW24)=1),\nAND(EB$10=\"\",COUNTA(EF24)=1)),\"棟番号を入力してください。\",\"\"))","v":""},{"$nulls":15},"③","用途",{"$nulls":7},"③","用途",{"$nulls":7},"③","用途"]
[{"$nulls":10},"床面積",{"$nulls":6},"㎡",null,"床面積",{"$nulls":6},"㎡",null,"床面積",{"$nulls":6},"㎡",{"$nulls":9},{"$f":"IF(OR(AND(N$24<>\"\",COUNTA(N25)=0),\nAND(W$24<>\"\",COUNTA(W25)=0),\nAND(AF$24<>\"\",COUNTA(AF25)=0)),\"未入力があります。\",\nIF(OR(AND(J$10=\"\",N24=\"\",COUNTA(N25)=1),AND(S$10=\"\",W24=\"\",COUNTA(W25)=1),\nAND(AB$10=\"\",AF24=\"\",COUNTA(AF25)=1)),\"棟番号及び用途を入力してください。\",\nIF(OR(AND(J$10<>\"\",N24=\"\",COUNTA(N25)=1),AND(S$10<>\"\",W24=\"\",COUNTA(W25)=1),\nAND(AB$10<>\"\",AF24=\"\",COUNTA(AF25)=1)),\"用途を入力してください。\",\nIF(OR(AND(J$10=\"\",COUNTA(N25)=1),AND(S$10=\"\",COUNTA(W25)=1),\nAND(AB$10=\"\",COUNTA(AF25)=1)),\"棟番号を入力してください。\",\"\"))))","v":""},{"$nulls":16},"床面積",{"$nulls":6},"㎡",null,"床面積",{"$nulls":6},"㎡",null,"床面積",{"$nulls":6},"㎡",{"$nulls":9},{"$f":"IF(OR(AND(BN$24<>\"\",COUNTA(BN25)=0),\nAND(BW$24<>\"\",COUNTA(BW25)=0),\nAND(CF$24<>\"\",COUNTA(CF25)=0)),\"未入力があります。\",\nIF(OR(AND(BJ$10=\"\",BN24=\"\",COUNTA(BN25)=1),AND(BS$10=\"\",BW24=\"\",COUNTA(BW25)=1),\nAND(CB$10=\"\",CF24=\"\",COUNTA(CF25)=1)),\"棟番号及び用途を入力してください。\",\nIF(OR(AND(BJ$10<>\"\",BN24=\"\",COUNTA(BN25)=1),AND(BS$10<>\"\",BW24=\"\",COUNTA(BW25)=1),\nAND(CB$10<>\"\",CF24=\"\",COUNTA(CF25)=1)),\"用途を入力してください。\",\nIF(OR(AND(BJ$10=\"\",COUNTA(BN25)=1),AND(BS$10=\"\",COUNTA(BW25)=1),\nAND(CB$10=\"\",COUNTA(CF25)=1)),\"棟番号を入力してください。\",\"\"))))","v":""},{"$nulls":16},"床面積",{"$nulls":6},"㎡",null,"床面積",{"$nulls":6},"㎡",null,"床面積",{"$nulls":6},"㎡",{"$nulls":9},{"$f":"IF(OR(AND(DN$24<>\"\",COUNTA(DN25)=0),\nAND(DW$24<>\"\",COUNTA(DW25)=0),\nAND(EF$24<>\"\",COUNTA(EF25)=0)),\"未入力があります。\",\nIF(OR(AND(DJ$10=\"\",DN24=\"\",COUNTA(DN25)=1),AND(DS$10=\"\",DW24=\"\",COUNTA(DW25)=1),\nAND(EB$10=\"\",EF24=\"\",COUNTA(EF25)=1)),\"棟番号及び用途を入力してください。\",\nIF(OR(AND(DJ$10<>\"\",DN24=\"\",COUNTA(DN25)=1),AND(DS$10<>\"\",DW24=\"\",COUNTA(DW25)=1),\nAND(EB$10<>\"\",EF24=\"\",COUNTA(EF25)=1)),\"用途を入力してください。\",\nIF(OR(AND(DJ$10=\"\",COUNTA(DN25)=1),AND(DS$10=\"\",COUNTA(DW25)=1),\nAND(EB$10=\"\",COUNTA(EF25)=1)),\"棟番号を入力してください。\",\"\"))))","v":""},{"$nulls":16},"床面積",{"$nulls":6},"㎡",null,"床面積",{"$nulls":6},"㎡",null,"床面積",{"$nulls":6},"㎡"]
[null,"チ．建築工事費予定額",{"$nulls":13},"万円",{"$nulls":8},"万円",{"$nulls":8},"万円",{"$nulls":10},{"$f":"COUNTIF(AN25:AN30, TRUE)","v":0},{"$f":"IF(OR(AND(J$10<>\"\",COUNTA(K26)=0),\nAND(S$10<>\"\",COUNTA(T26)=0),\nAND(AB$10<>\"\",COUNTA(AC26)=0)),\"未入力があります。\",\nIF(OR(AND(J$10=\"\",COUNTA(K26)=1),AND(S$10=\"\",COUNTA(T26)=1),\nAND(AB$10=\"\",COUNTA(AC26)=1)),\"棟番号を入力してください。\",\"\")\n\n)","v":""},{"$nulls":7},"チ．建築工事費予定額",{"$nulls":13},"万円",{"$nulls":8},"万円",{"$nulls":8},"万円",{"$nulls":10},{"$f":"COUNTIF(CN25:CN30, TRUE)","v":0},{"$f":"IF(OR(AND(BJ$10<>\"\",COUNTA(BK26)=0),\nAND(BS$10<>\"\",COUNTA(BT26)=0),\nAND(CB$10<>\"\",COUNTA(CC26)=0)),\"未入力があります。\",\nIF(OR(AND(BJ$10=\"\",COUNTA(BK26)=1),AND(BS$10=\"\",COUNTA(BT26)=1),\nAND(CB$10=\"\",COUNTA(CC26)=1)),\"棟番号を入力してください。\",\"\")\n\n)","v":""},{"$nulls":7},"チ．建築工事費予定額",{"$nulls":13},"万円",{"$nulls":8},"万円",{"$nulls":8},"万円",{"$nulls":10},{"$f":"COUNTIF(EN25:EN30, TRUE)","v":0},{"$f":"IF(OR(AND(DJ$10<>\"\",COUNTA(DK26)=0),\nAND(DS$10<>\"\",COUNTA(DT26)=0),\nAND(EB$10<>\"\",COUNTA(EC26)=0)),\"未入力があります。\",\nIF(OR(AND(DJ$10=\"\",COUNTA(DK26)=1),AND(DS$10=\"\",COUNTA(DT26)=1),\nAND(EB$10=\"\",COUNTA(EC26)=1)),\"棟番号を入力してください。\",\"\")\n\n)","v":""},{"$nulls":7},"チ．建築工事費予定額",{"$nulls":13},"万円",{"$nulls":8},"万円",{"$nulls":8},"万円"]
[{"$nulls":44},{"$f":"COUNTIF(AO25:AO30, TRUE)","v":0},{"$f":"IFERROR(IF(AND($T$22<>\"\",AS27>=2),\"選択は1つまでです（2列目）。\",IF(AND($T$22<>\"\",AS27=0),\"未入力があります（2列目）。\",IF(AND($T$22=\"\",AS27>0),\"棟番号を入力してください（2列目）。\",\"\"))),\"\")","v":"未入力があります（2列目）。"},{"$nulls":50},{"$f":"COUNTIF(CO25:CO30, TRUE)","v":0},{"$f":"IFERROR(IF(AND($T$22<>\"\",CS27>=2),\"選択は1つまでです（2列目）。\",IF(AND($T$22<>\"\",CS27=0),\"未入力があります（2列目）。\",IF(AND($T$22=\"\",CS27>0),\"棟番号を入力してください（2列目）。\",\"\"))),\"\")","v":"未入力があります（2列目）。"},{"$nulls":50},{"$f":"COUNTIF(EO25:EO30, TRUE)","v":0},{"$f":"IFERROR(IF(AND($T$22<>\"\",ES27>=2),\"選択は1つまでです（2列目）。\",IF(AND($T$22<>\"\",ES27=0),\"未入力があります（2列目）。\",IF(AND($T$22=\"\",ES27>0),\"棟番号を入力してください（2列目）。\",\"\"))),\"\")","v":"未入力があります（2列目）。"}]
[{"$nulls":13},"消費税込み",{"$nulls":8},"消費税込み",{"$nulls":8},"消費税込み",{"$nulls":7},false,false,false,{"$nulls":23},"消費税込み",{"$nulls":8},"消費税込み",{"$nulls":8},"消費税込み",{"$nulls":7},false,false,false,{"$nulls":23},"消費税込み",{"$nulls":8},"消費税込み",{"$nulls":8},"消費税込み",{"$nulls":7},false,false,false,{"$nulls":23},"消費税込み",{"$nulls":8},"消費税込み",{"$nulls":8},"消費税込み",{"$nulls":7},false,false,false]
[null,"リ．新築工事の場合に\n　　おける地上の階数",{"$nulls":51},"リ．新築工事の場合に\n　　おける地上の階数",{"$nulls":51},"リ．新築工事の場合に\n　　おける地上の階数",{"$nulls":51},"リ．新築工事の場合に\n　　おける地上の階数"]
[{"$nulls":15},"階",{"$nulls":8},"階",{"$nulls":8},"階",{"$nulls":11},{"$f":"IF(OR(AND(J$10<>\"\",COUNTA(K30)=0),\nAND(S$10<>\"\",COUNTA(T30)=0),\nAND(AB$10<>\"\",COUNTA(AC30)=0)),\"未入力があります。\",\nIF(OR(AND(J$10=\"\",COUNTA(K30)=1),AND(S$10=\"\",COUNTA(T30)=1),\nAND(AB$10=\"\",COUNTA(AC30)=1)),\"棟番号を入力してください。\",\"\")\n\n)","v":""},{"$nulls":21},"階",{"$nulls":8},"階",{"$nulls":8},"階",{"$nulls":11},{"$f":"IF(OR(AND(BJ$10<>\"\",COUNTA(BK30)=0),\nAND(BS$10<>\"\",COUNTA(BT30)=0),\nAND(CB$10<>\"\",COUNTA(CC30)=0)),\"未入力があります。\",\nIF(OR(AND(BJ$10=\"\",COUNTA(BK30)=1),AND(BS$10=\"\",COUNTA(BT30)=1),\nAND(CB$10=\"\",COUNTA(CC30)=1)),\"棟番号を入力してください。\",\"\")\n\n)","v":""},{"$nulls":21},"階",{"$nulls":8},"階",{"$nulls":8},"階",{"$nulls":11},{"$f":"IF(OR(AND(DJ$10<>\"\",COUNTA(DK30)=0),\nAND(DS$10<>\"\",COUNTA(DT30)=0),\nAND(EB$10<>\"\",COUNTA(EC30)=0)),\"未入力があります。\",\nIF(OR(AND(DJ$10=\"\",COUNTA(DK30)=1),AND(DS$10=\"\",COUNTA(DT30)=1),\nAND(EB$10=\"\",COUNTA(EC30)=1)),\"棟番号を入力してください。\",\"\")\n\n)","v":""},{"$nulls":21},"階",{"$nulls":8},"階",{"$nulls":8},"階"]
[null,"ヌ．新築工事の場合に\n　　おける地下の階数",{"$nulls":36},{"$f":"AT31","v":0},{"$nulls":14},"ヌ．新築工事の場合に\n　　おける地下の階数",{"$nulls":36},{"$f":"CT31","v":0},{"$nulls":14},"ヌ．新築工事の場合に\n　　おける地下の階数",{"$nulls":36},{"$f":"ET31","v":0},{"$nulls":14},"ヌ．新築工事の場合に\n　　おける地下の階数",{"$nulls":36},{"$f":"GT31","v":0}]
[{"$nulls":10},"地下",{"$nulls":4},"階",{"$nulls":3},"地下",{"$nulls":4},"階",{"$nulls":3},"地下",{"$nulls":4},"階",{"$nulls":11},{"$f":"IF(OR(AND(J$10<>\"\",COUNTA(M32)=0),\nAND(S$10<>\"\",COUNTA(V32)=0),\nAND(AB$10<>\"\",COUNTA(AE32)=0)),\"未入力があります。\",\nIF(OR(AND(J$10=\"\",COUNTA(M32)=1),AND(S$10=\"\",COUNTA(V32)=1),\nAND(AB$10=\"\",COUNTA(AE32)=1)),\"棟番号を入力してください。\",\"\")\n\n)","v":""},{"$nulls":16},"地下",{"$nulls":4},"階",{"$nulls":3},"地下",{"$nulls":4},"階",{"$nulls":3},"地下",{"$nulls":4},"階",{"$nulls":11},{"$f":"IF(OR(AND(BJ$10<>\"\",COUNTA(BM32)=0),\nAND(BS$10<>\"\",COUNTA(BV32)=0),\nAND(CB$10<>\"\",COUNTA(CE32)=0)),\"未入力があります。\",\nIF(OR(AND(BJ$10=\"\",COUNTA(BM32)=1),AND(BS$10=\"\",COUNTA(BV32)=1),\nAND(CB$10=\"\",COUNTA(CE32)=1)),\"棟番号を入力してください。\",\"\")\n\n)","v":""},{"$nulls":16},"地下",{"$nulls":4},"階",{"$nulls":3},"地下",{"$nulls":4},"階",{"$nulls":3},"地下",{"$nulls":4},"階",{"$nulls":11},{"$f":"IF(OR(AND(DJ$10<>\"\",COUNTA(DM32)=0),\nAND(DS$10<>\"\",COUNTA(DV32)=0),\nAND(EB$10<>\"\",COUNTA(EE32)=0)),\"未入力があります。\",\nIF(OR(AND(DJ$10=\"\",COUNTA(DM32)=1),AND(DS$10=\"\",COUNTA(DV32)=1),\nAND(EB$10=\"\",COUNTA(EE32)=1)),\"棟番号を入力してください。\",\"\")\n\n)","v":""},{"$nulls":16},"地下",{"$nulls":4},"階",{"$nulls":3},"地下",{"$nulls":4},"階",{"$nulls":3},"地下",{"$nulls":4},"階"]
[]
[]
[]
[]
["（第三面）",{"$nulls":51},"（第三面）",{"$nulls":51},"（第三面）",{"$nulls":51},"（第三面）"]
[{"$nulls":38},{"$f":"IF(AND($AL$13=TRUE,R38=\"\"),\"未入力\",IF(AND($AL$13=FALSE,R38<>\"\"),\"入力不要\",\"\"))","v":""},{"$nulls":51},{"$f":"IF(AND($AL$13=TRUE,BR38=\"\"),\"未入力\",IF(AND($AL$13=FALSE,BR38<>\"\"),\"入力不要\",\"\"))","v":""},{"$nulls":51},{"$f":"IF(AND($AL$13=TRUE,DR38=\"\"),\"未入力\",IF(AND($AL$13=FALSE,DR38<>\"\"),\"入力不要\",\"\"))","v":""},{"$nulls":51},{"$f":"IF(AND($AL$13=TRUE,FR38=\"\"),\"未入力\",IF(AND($AL$13=FALSE,FR38<>\"\"),\"入力不要\",\"\"))","v":""}]
[]
["【１．住宅部分の概要】",{"$nulls":51},"【１．住宅部分の概要】",{"$nulls":51},"【１．住宅部分の概要】",{"$nulls":51},"【１．住宅部分の概要】"]
[null,"イ．番号",{"$nulls":51},"イ．番号",{"$nulls":51},"イ．番号",{"$nulls":51},"イ．番号"]
[null,"ロ．新設又は\n　　　その他の別",{"$nulls":8},"(1)新設",{"$nulls":5},"(2)その他",{"$nulls":22},false,false,{"$nulls":3},{"$f":"COUNTIF(AN42:AO42, TRUE)","v":0},{"$f":"IF(AND($J41<>\"\",COUNTIF(AN42:AP42,TRUE)=0),\"未入力です。\",\n  IF(AND($J41<>\"\",COUNTIF(AN42:AP42,TRUE)>1),\"選択は1つまでです。\",\"\"))","v":""},{"$nulls":7},"ロ．新設又は\n　　　その他の別",{"$nulls":8},"(1)新設",{"$nulls":5},"(2)その他",{"$nulls":22},false,false,{"$nulls":3},{"$f":"COUNTIF(CN42:CO42, TRUE)","v":0},{"$f":"IF(AND($J41<>\"\",COUNTIF(CN42:CP42,TRUE)=0),\"未入力です。\",\n  IF(AND($J41<>\"\",COUNTIF(CN42:CP42,TRUE)>1),\"選択は1つまでです。\",\"\"))","v":""},{"$nulls":7},"ロ．新設又は\n　　　その他の別",{"$nulls":8},"(1)新設",{"$nulls":5},"(2)その他",{"$nulls":22},false,false,{"$nulls":3},{"$f":"COUNTIF(EN42:EO42, TRUE)","v":0},{"$f":"IF(AND($J41<>\"\",COUNTIF(EN42:EP42,TRUE)=0),\"未入力です。\",\n  IF(AND($J41<>\"\",COUNTIF(EN42:EP42,TRUE)>1),\"選択は1つまでです。\",\"\"))","v":""},{"$nulls":7},"ロ．新設又は\n　　　その他の別",{"$nulls":8},"(1)新設",{"$nulls":5},"(2)その他",{"$nulls":22},false,false]
[null,"ハ．新設住宅の資金",{"$nulls":8},"(1)民間資金住宅",{"$nulls":7},"(2)公営住宅",{"$nulls":6},"(3)住宅金融支援機構住宅",{"$nulls":12},{"$f":"IF(AND($I45<>\"\",COUNTIF(AN43:AP44,TRUE)=0),\"未入力\",\n  IF(AND($I45<>\"\",COUNTIF(AN43:AP44,TRUE)>1),\"複数選択\",\"\"))","v":""},false,false,false,null,null,{"$f":"COUNTIF(AN43:AP43, TRUE)","v":0},{"$f":"IF(AND($J$41<>\"\",COUNTIF(AN43:AP44,TRUE)=0),\"未入力です。\",\n  IF(AND($J$41<>\"\",COUNTIF(AN43:AP44,TRUE)>1),\"選択は1つまでです。\",\"\"))","v":""},{"$nulls":7},"ハ．新設住宅の資金",{"$nulls":8},"(1)民間資金住宅",{"$nulls":7},"(2)公営住宅",{"$nulls":6},"(3)住宅金融支援機構住宅",{"$nulls":12},{"$f":"IF(AND($I45<>\"\",COUNTIF(CN43:CP44,TRUE)=0),\"未入力\",\n  IF(AND($I45<>\"\",COUNTIF(CN43:CP44,TRUE)>1),\"複数選択\",\"\"))","v":""},false,false,false,null,null,{"$f":"COUNTIF(CN43:CP43, TRUE)","v":0},{"$f":"IF(AND($J$41<>\"\",COUNTIF(CN43:CP44,TRUE)=0),\"未入力です。\",\n  IF(AND($J$41<>\"\",COUNTIF(CN43:CP44,TRUE)>1),\"選択は1つまでです。\",\"\"))","v":""},{"$nulls":7},"ハ．新設住宅の資金",{"$nulls":8},"(1)民間資金住宅",{"$nulls":7},"(2)公営住宅",{"$nulls":6},"(3)住宅金融支援機構住宅",{"$nulls":12},{"$f":"IF(AND($I45<>\"\",COUNTIF(EN43:EP44,TRUE)=0),\"未入力\",\n  IF(AND($I45<>\"\",COUNTIF(EN43:EP44,TRUE)>1),\"複数選択\",\"\"))","v":""},false,false,false,null,null,{"$f":"COUNTIF(EN43:EP43, TRUE)","v":0},{"$f":"IF(AND($J$41<>\"\",COUNTIF(EN43:EP44,TRUE)=0),\"未入力です。\",\n  IF(AND($J$41<>\"\",COUNTIF(EN43:EP44,TRUE)>1),\"選択は1つまでです。\",\"\"))","v":""},{"$nulls":7},"ハ．新設住宅の資金",{"$nulls":8},"(1)民間資金住宅",{"$nulls":7},"(2)公営住宅",{"$nulls":6},"(3)住宅金融支援機構住宅",{"$nulls":12},{"$f":"IF(AND($I45<>\"\",COUNTIF(GN43:GP44,TRUE)=0),\"未入力\",\n  IF(AND($I45<>\"\",COUNTIF(GN43:GP44,TRUE)>1),\"複数選択\",\"\"))","v":""},false,false,false]
[{"$nulls":10},"(4)都市再生機構住宅",{"$nulls":9},"(5)その他",{"$nulls":18},false,false,{"$nulls":3},{"$f":"COUNTIF(AN44:AO44, TRUE)","v":0},{"$nulls":17},"(4)都市再生機構住宅",{"$nulls":9},"(5)その他",{"$nulls":18},false,false,{"$nulls":3},{"$f":"COUNTIF(CN44:CO44, TRUE)","v":0},{"$nulls":17},"(4)都市再生機構住宅",{"$nulls":9},"(5)その他",{"$nulls":18},false,false,{"$nulls":3},{"$f":"COUNTIF(EN44:EO44, TRUE)","v":0},{"$nulls":17},"(4)都市再生機構住宅",{"$nulls":9},"(5)その他",{"$nulls":18},false,false]
[null,"ニ．住宅の建築工法",{"$nulls":8},"(1)在来工法",{"$nulls":6},"(2)プレハブ工法",{"$nulls":6},"(3)枠組壁工法",{"$nulls":13},{"$f":"IF(AND($I45<>\"\",COUNTIF(AN45:AP46,TRUE)=0),\"未入力\",\n  IF(AND($I45<>\"\",COUNTIF(AN45:AP46,TRUE)>1),\"複数選択\",\"\"))","v":""},false,false,false,null,null,{"$f":"COUNTIF(AN45:AP45, TRUE)","v":0},{"$f":"IF(AND($J$41<>\"\",COUNTIF(AN45:AP45,TRUE)=0),\"未入力です。\",\n  IF(AND($J$41<>\"\",COUNTIF(AN45:AP45,TRUE)>1),\"選択は1つまでです。\",\"\"))","v":""},{"$nulls":7},"ニ．住宅の建築工法",{"$nulls":8},"(1)在来工法",{"$nulls":6},"(2)プレハブ工法",{"$nulls":6},"(3)枠組壁工法",{"$nulls":13},{"$f":"IF(AND($I45<>\"\",COUNTIF(CN45:CP46,TRUE)=0),\"未入力\",\n  IF(AND($I45<>\"\",COUNTIF(CN45:CP46,TRUE)>1),\"複数選択\",\"\"))","v":""},false,false,false,null,null,{"$f":"COUNTIF(CN45:CP45, TRUE)","v":0},{"$f":"IF(AND($J$41<>\"\",COUNTIF(CN45:CP45,TRUE)=0),\"未入力です。\",\n  IF(AND($J$41<>\"\",COUNTIF(CN45:CP45,TRUE)>1),\"選択は1つまでです。\",\"\"))","v":""},{"$nulls":7},"ニ．住宅の建築工法",{"$nulls":8},"(1)在来工法",{"$nulls":6},"(2)プレハブ工法",{"$nulls":6},"(3)枠組壁工法",{"$nulls":13},{"$f":"IF(AND($I45<>\"\",COUNTIF(EN45:EP46,TRUE)=0),\"未入力\",\n  IF(AND($I45<>\"\",COUNTIF(EN45:EP46,TRUE)>1),\"複数選択\",\"\"))","v":""},false,false,false,null,null,{"$f":"COUNTIF(EN45:EP45, TRUE)","v":0},{"$f":"IF(AND($J$41<>\"\",COUNTIF(EN45:EP45,TRUE)=0),\"未入力です。\",\n  IF(AND($J$41<>\"\",COUNTIF(EN45:EP45,TRUE)>1),\"選択は1つまでです。\",\"\"))","v":""},{"$nulls":7},"ニ．住宅の建築工法",{"$nulls":8},"(1)在来工法",{"$nulls":6},"(2)プレハブ工法",{"$nulls":6},"(3)枠組壁工法",{"$nulls":13},{"$f":"IF(AND($I45<>\"\",COUNTIF(GN45:GP46,TRUE)=0),\"未入力\",\n  IF(AND($I45<>\"\",COUNTIF(GN45:GP46,TRUE)>1),\"複数選択\",\"\"))","v":""},false,false,false]
[null,"ホ．住宅の種類",{"$nulls":8},"(1)専用住宅",{"$nulls":6},"(2)併用住宅",{"$nulls":6},"(3)その他の住宅",{"$nulls":14},false,false,false,null,null,{"$f":"COUNTIF(AN46:AP46, TRUE)","v":0},{"$f":"IF(AND(AND(J7>=30,J7<>\"01\",J7<>\"02\"),AP46=FALSE,J41<>\"\"),\"【５．主要用途】が産業専用建築物の場合、住宅の種類は（３）のみです\",\nIF(AND($J$41<>\"\",COUNTIF(AN46:AP46,TRUE)=0),\"未入力です。\",\n  IF(AND($J$41<>\"\",COUNTIF(AN46:AP46,TRUE)>1),\"選択は1つまでです。\",\"\")))","v":""},{"$nulls":7},"ホ．住宅の種類",{"$nulls":8},"(1)専用住宅",{"$nulls":6},"(2)併用住宅",{"$nulls":6},"(3)その他の住宅",{"$nulls":14},false,false,false,null,null,{"$f":"COUNTIF(CN46:CP46, TRUE)","v":0},{"$f":"IF(AND(AND(BJ7>=30,BJ7<>\"01\",BJ7<>\"02\"),CP46=FALSE,BJ41<>\"\"),\"【５．主要用途】が産業専用建築物の場合、住宅の種類は（３）のみです\",\nIF(AND($J$41<>\"\",COUNTIF(CN46:CP46,TRUE)=0),\"未入力です。\",\n  IF(AND($J$41<>\"\",COUNTIF(CN46:CP46,TRUE)>1),\"選択は1つまでです。\",\"\")))","v":""},{"$nulls":7},"ホ．住宅の種類",{"$nulls":8},"(1)専用住宅",{"$nulls":6},"(2)併用住宅",{"$nulls":6},"(3)その他の住宅",{"$nulls":14},false,false,false,null,null,{"$f":"COUNTIF(EN46:EP46, TRUE)","v":0},{"$f":"IF(AND(AND(DJ7>=30,DJ7<>\"01\",DJ7<>\"02\"),EP46=FALSE,DJ41<>\"\"),\"【５．主要用途】が産業専用建築物の場合、住宅の種類は（３）のみです\",\nIF(AND($J$41<>\"\",COUNTIF(EN46:EP46,TRUE)=0),\"未入力です。\",\n  IF(AND($J$41<>\"\",COUNTIF(EN46:EP46,TRUE)>1),\"選択は1つまでです。\",\"\")))","v":""},{"$nulls":7},"ホ．住宅の種類",{"$nulls":8},"(1)専用住宅",{"$nulls":6},"(2)併用住宅",{"$nulls":6},"(3)その他の住宅",{"$nulls":14},false,false,false]
[null,"ヘ．住宅の建て方",{"$nulls":8},"(1)一戸建住宅",{"$nulls":6},"(2)長屋建住宅",{"$nulls":6},"(3)共同住宅",{"$nulls":13},{"$f":"IF(AND($I45<>\"\",COUNTIF(AN47:AP47,TRUE)=0),\"未入力\",\n  IF(AND($I45<>\"\",COUNTIF(AN47:AP47,TRUE)>1),\"複数選択\",\"\"))","v":""},false,false,false,null,null,{"$f":"COUNTIF(AN47:AP47, TRUE)","v":0},{"$f":"IF(AND($J$41<>\"\",COUNTIF(AN47:AP47,TRUE)=0),\"未入力です。\",\n  IF(AND($J$41<>\"\",COUNTIF(AN47:AP47,TRUE)>1),\"選択は1つまでです。\",\"\"))","v":""},{"$nulls":7},"ヘ．住宅の建て方",{"$nulls":8},"(1)一戸建住宅",{"$nulls":6},"(2)長屋建住宅",{"$nulls":6},"(3)共同住宅",{"$nulls":13},{"$f":"IF(AND($I45<>\"\",COUNTIF(CN47:CP47,TRUE)=0),\"未入力\",\n  IF(AND($I45<>\"\",COUNTIF(CN47:CP47,TRUE)>1),\"複数選択\",\"\"))","v":""},false,false,false,null,null,{"$f":"COUNTIF(CN47:CP47, TRUE)","v":0},{"$f":"IF(AND($J$41<>\"\",COUNTIF(CN47:CP47,TRUE)=0),\"未入力です。\",\n  IF(AND($J$41<>\"\",COUNTIF(CN47:CP47,TRUE)>1),\"選択は1つまでです。\",\"\"))","v":""},{"$nulls":7},"ヘ．住宅の建て方",{"$nulls":8},"(1)一戸建住宅",{"$nulls":6},"(2)長屋建住宅",{"$nulls":6},"(3)共同住宅",{"$nulls":13},{"$f":"IF(AND($I45<>\"\",COUNTIF(EN47:EP47,TRUE)=0),\"未入力\",\n  IF(AND($I45<>\"\",COUNTIF(EN47:EP47,TRUE)>1),\"複数選択\",\"\"))","v":""},false,false,false,null,null,{"$f":"COUNTIF(EN47:EP47, TRUE)","v":0},{"$f":"IF(AND($J$41<>\"\",COUNTIF(EN47:EP47,TRUE)=0),\"未入力です。\",\n  IF(AND($J$41<>\"\",COUNTIF(EN47:EP47,TRUE)>1),\"選択は1つまでです。\",\"\"))","v":""},{"$nulls":7},"ヘ．住宅の建て方",{"$nulls":8},"(1)一戸建住宅",{"$nulls":6},"(2)長屋建住宅",{"$nulls":6},"(3)共同住宅",{"$nulls":13},{"$f":"IF(AND($I45<>\"\",COUNTIF(GN47:GP47,TRUE)=0),\"未入力\",\n  IF(AND($I45<>\"\",COUNTIF(GN47:GP47,TRUE)>1),\"複数選択\",\"\"))","v":""},false,false,false]
[null,"ト．利用関係",{"$nulls":8},"(1)持家　",{"$nulls":6},"(2)貸家　　",{"$nulls":6},"(3)給与住宅",{"$nulls":6},"(4)分譲住宅",{"$nulls":7},false,false,false,false,null,{"$f":"COUNTIF(AN48:AQ48, TRUE)","v":0},{"$f":"IF(AND($J41<>\"\",COUNTIF(AN48:AQ48,TRUE)=0),\"未入力です。\",\"\")","v":""},{"$nulls":7},"ト．利用関係",{"$nulls":8},"(1)持家　",{"$nulls":6},"(2)貸家　　",{"$nulls":6},"(3)給与住宅",{"$nulls":6},"(4)分譲住宅",{"$nulls":7},false,false,false,false,null,{"$f":"COUNTIF(CN48:CQ48, TRUE)","v":0},{"$f":"IF(AND($J41<>\"\",COUNTIF(CN48:CQ48,TRUE)=0),\"未入力です。\",\"\")","v":""},{"$nulls":7},"ト．利用関係",{"$nulls":8},"(1)持家　",{"$nulls":6},"(2)貸家　　",{"$nulls":6},"(3)給与住宅",{"$nulls":6},"(4)分譲住宅",{"$nulls":7},false,false,false,false,null,{"$f":"COUNTIF(EN48:EQ48, TRUE)","v":0},{"$f":"IF(AND($J41<>\"\",COUNTIF(EN48:EQ48,TRUE)=0),\"未入力です。\",\"\")","v":""},{"$nulls":7},"ト．利用関係",{"$nulls":8},"(1)持家　",{"$nulls":6},"(2)貸家　　",{"$nulls":6},"(3)給与住宅",{"$nulls":6},"(4)分譲住宅",{"$nulls":7},false,false,false,false]
[null,"チ．住宅の戸数",{"$nulls":12},"戸",{"$nulls":6},"戸",{"$nulls":6},"戸",{"$nulls":6},"戸",null,null,{"$f":"IF(AND($I45<>\"\",COUNTIF(AN49:AP49,TRUE)=0),\"未入力\",\n  IF(AND($I45<>\"\",COUNTIF(AN49:AP49,TRUE)>1),\"複数選択\",\"\"))","v":""},{"$nulls":6},{"$f":"IF(AND($J41<>\"\",OR($J$7=\"01\",$J$7=\"02\",$J$7<=24)),\n  IF(AND($J41<>\"\",COUNTA(J49,Q49,X49,AE49)=0),\"未入力です。\",\"\"),\"\")","v":""},{"$nulls":7},"チ．住宅の戸数",{"$nulls":12},"戸",{"$nulls":6},"戸",{"$nulls":6},"戸",{"$nulls":6},"戸",null,null,{"$f":"IF(AND($I45<>\"\",COUNTIF(CN49:CP49,TRUE)=0),\"未入力\",\n  IF(AND($I45<>\"\",COUNTIF(CN49:CP49,TRUE)>1),\"複数選択\",\"\"))","v":""},{"$nulls":6},{"$f":"IF(AND($J41<>\"\",OR($J$7=\"01\",$J$7=\"02\",$J$7<=24)),\n  IF(AND($J41<>\"\",COUNTA(BJ49,BQ49,BX49,CE49)=0),\"未入力です。\",\"\"),\"\")","v":""},{"$nulls":7},"チ．住宅の戸数",{"$nulls":12},"戸",{"$nulls":6},"戸",{"$nulls":6},"戸",{"$nulls":6},"戸",null,null,{"$f":"IF(AND($I45<>\"\",COUNTIF(EN49:EP49,TRUE)=0),\"未入力\",\n  IF(AND($I45<>\"\",COUNTIF(EN49:EP49,TRUE)>1),\"複数選択\",\"\"))","v":""},{"$nulls":6},{"$f":"IF(AND($J41<>\"\",OR($J$7=\"01\",$J$7=\"02\",$J$7<=24)),\n  IF(AND($J41<>\"\",COUNTA(DJ49,DQ49,DX49,EE49)=0),\"未入力です。\",\"\"),\"\")","v":""},{"$nulls":7},"チ．住宅の戸数",{"$nulls":12},"戸",{"$nulls":6},"戸",{"$nulls":6},"戸",{"$nulls":6},"戸",null,null,{"$f":"IF(AND($I45<>\"\",COUNTIF(GN49:GP49,TRUE)=0),\"未入力\",\n  IF(AND($I45<>\"\",COUNTIF(GN49:GP49,TRUE)>1),\"複数選択\",\"\"))","v":""}]
[null,"リ．工事部分の\n　　床面積の合計",{"$nulls":12},"㎡",{"$nulls":6},"㎡",{"$nulls":6},"㎡",{"$nulls":6},"㎡",null,null,{"$f":"IF(AND($I45<>\"\",COUNTIF(AN50:AQ50,TRUE)=0),\"未入力\",\"\")","v":""},{"$nulls":5},{"$f":"COUNTIF(AN47:AP47, TRUE)","v":0},{"$f":"IF(AND($J41<>\"\",COUNTA(J50,Q50,X50,AE50)=0),\"未入力です。\",\"\")","v":""},{"$nulls":7},"リ．工事部分の\n　　床面積の合計",{"$nulls":12},"㎡",{"$nulls":6},"㎡",{"$nulls":6},"㎡",{"$nulls":6},"㎡",null,null,{"$f":"IF(AND($I45<>\"\",COUNTIF(CN50:CQ50,TRUE)=0),\"未入力\",\"\")","v":""},{"$nulls":5},{"$f":"COUNTIF(CN47:CP47, TRUE)","v":0},{"$f":"IF(AND($J41<>\"\",COUNTA(BJ50,BQ50,BX50,CE50)=0),\"未入力です。\",\"\")","v":""},{"$nulls":7},"リ．工事部分の\n　　床面積の合計",{"$nulls":12},"㎡",{"$nulls":6},"㎡",{"$nulls":6},"㎡",{"$nulls":6},"㎡",null,null,{"$f":"IF(AND($I45<>\"\",COUNTIF(EN50:EQ50,TRUE)=0),\"未入力\",\"\")","v":""},{"$nulls":5},{"$f":"COUNTIF(EN47:EP47, TRUE)","v":0},{"$f":"IF(AND($J41<>\"\",COUNTA(DJ50,DQ50,DX50,EE50)=0),\"未入力です。\",\"\")","v":""},{"$nulls":7},"リ．工事部分の\n　　床面積の合計",{"$nulls":12},"㎡",{"$nulls":6},"㎡",{"$nulls":6},"㎡",{"$nulls":6},"㎡",null,null,{"$f":"IF(AND($I45<>\"\",COUNTIF(GN50:GQ50,TRUE)=0),\"未入力\",\"\")","v":""}]
[{"$nulls":38},{"$f":"IF(AND($I45=\"\",COUNTA(M54,S54,Z54,AG54)>0),\"回答不要\",\n  IF(AND($I45<>\"\",OR($R$16<>\"\",$R$17<>\"\"),COUNTIF(AN43:AP43,TRUE)>0),\n  IF(AND($I45<>\"\",COUNTA(M54,S54,Z54,AG54)=0),\"未入力\",\"\"),\"\"))","v":""},{"$nulls":51},{"$f":"IF(AND($I45=\"\",COUNTA(BM54,BS54,BZ54,CG54)>0),\"回答不要\",\n  IF(AND($I45<>\"\",OR($R$16<>\"\",$R$17<>\"\"),COUNTIF(CN43:CP43,TRUE)>0),\n  IF(AND($I45<>\"\",COUNTA(BM54,BS54,BZ54,CG54)=0),\"未入力\",\"\"),\"\"))","v":""},{"$nulls":51},{"$f":"IF(AND($I45=\"\",COUNTA(DM54,DS54,DZ54,EG54)>0),\"回答不要\",\n  IF(AND($I45<>\"\",OR($R$16<>\"\",$R$17<>\"\"),COUNTIF(EN43:EP43,TRUE)>0),\n  IF(AND($I45<>\"\",COUNTA(DM54,DS54,DZ54,EG54)=0),\"未入力\",\"\"),\"\"))","v":""},{"$nulls":51},{"$f":"IF(AND($I45=\"\",COUNTA(FM54,FS54,FZ54,GG54)>0),\"回答不要\",\n  IF(AND($I45<>\"\",OR($R$16<>\"\",$R$17<>\"\"),COUNTIF(GN43:GP43,TRUE)>0),\n  IF(AND($I45<>\"\",COUNTA(FM54,FS54,FZ54,GG54)=0),\"未入力\",\"\"),\"\"))","v":""}]
[{"$nulls":38},{"$f":"IF(AND($I45<>\"\",COUNTA(M55,S55,Z55,AG55)=0),\"未入力\",\"\")","v":""},{"$nulls":51},{"$f":"IF(AND($I45<>\"\",COUNTA(BM55,BS55,BZ55,CG55)=0),\"未入力\",\"\")","v":""},{"$nulls":51},{"$f":"IF(AND($I45<>\"\",COUNTA(DM55,DS55,DZ55,EG55)=0),\"未入力\",\"\")","v":""},{"$nulls":51},{"$f":"IF(AND($I45<>\"\",COUNTA(FM55,FS55,FZ55,GG55)=0),\"未入力\",\"\")","v":""}]
[null,"イ．番号",{"$nulls":51},"イ．番号",{"$nulls":51},"イ．番号",{"$nulls":51},"イ．番号"]
[null,"ロ．新設又は\n　　　その他の別",{"$nulls":8},"(1)新設",{"$nulls":5},"(2)その他",{"$nulls":22},false,false,{"$nulls":12},"ロ．新設又は\n　　　その他の別",{"$nulls":8},"(1)新設",{"$nulls":5},"(2)その他",{"$nulls":22},false,false,{"$nulls":12},"ロ．新設又は\n　　　その他の別",{"$nulls":8},"(1)新設",{"$nulls":5},"(2)その他",{"$nulls":22},false,false,{"$nulls":12},"ロ．新設又は\n　　　その他の別",{"$nulls":8},"(1)新設",{"$nulls":5},"(2)その他",{"$nulls":22},false,false]
[null,"ハ．新設住宅の資金",{"$nulls":8},"(1)民間資金住宅",{"$nulls":7},"(2)公営住宅",{"$nulls":6},"(3)住宅金融支援機構住宅",{"$nulls":13},false,false,false,{"$nulls":11},"ハ．新設住宅の資金",{"$nulls":8},"(1)民間資金住宅",{"$nulls":7},"(2)公営住宅",{"$nulls":6},"(3)住宅金融支援機構住宅",{"$nulls":13},false,false,false,{"$nulls":11},"ハ．新設住宅の資金",{"$nulls":8},"(1)民間資金住宅",{"$nulls":7},"(2)公営住宅",{"$nulls":6},"(3)住宅金融支援機構住宅",{"$nulls":13},false,false,false,{"$nulls":11},"ハ．新設住宅の資金",{"$nulls":8},"(1)民間資金住宅",{"$nulls":7},"(2)公営住宅",{"$nulls":6},"(3)住宅金融支援機構住宅",{"$nulls":13},false,false,false]
[{"$nulls":10},"(4)都市再生機構住宅",{"$nulls":9},"(5)その他",{"$nulls":18},false,false,{"$nulls":21},"(4)都市再生機構住宅",{"$nulls":9},"(5)その他",{"$nulls":18},false,false,{"$nulls":21},"(4)都市再生機構住宅",{"$nulls":9},"(5)その他",{"$nulls":18},false,false,{"$nulls":21},"(4)都市再生機構住宅",{"$nulls":9},"(5)その他",{"$nulls":18},false,false]
[null,"ニ．住宅の建築工法",{"$nulls":8},"(1)在来工法",{"$nulls":6},"(2)プレハブ工法",{"$nulls":6},"(3)枠組壁工法",{"$nulls":14},false,false,false,{"$nulls":11},"ニ．住宅の建築工法",{"$nulls":8},"(1)在来工法",{"$nulls":6},"(2)プレハブ工法",{"$nulls":6},"(3)枠組壁工法",{"$nulls":14},false,false,false,{"$nulls":11},"ニ．住宅の建築工法",{"$nulls":8},"(1)在来工法",{"$nulls":6},"(2)プレハブ工法",{"$nulls":6},"(3)枠組壁工法",{"$nulls":14},false,false,false,{"$nulls":11},"ニ．住宅の建築工法",{"$nulls":8},"(1)在来工法",{"$nulls":6},"(2)プレハブ工法",{"$nulls":6},"(3)枠組壁工法",{"$nulls":14},false,false,false]
[null,"ホ．住宅の種類",{"$nulls":8},"(1)専用住宅",{"$nulls":6},"(2)併用住宅",{"$nulls":6},"(3)その他の住宅",{"$nulls":14},false,false,false,{"$nulls":11},"ホ．住宅の種類",{"$nulls":8},"(1)専用住宅",{"$nulls":6},"(2)併用住宅",{"$nulls":6},"(3)その他の住宅",{"$nulls":14},false,false,false,{"$nulls":11},"ホ．住宅の種類",{"$nulls":8},"(1)専用住宅",{"$nulls":6},"(2)併用住宅",{"$nulls":6},"(3)その他の住宅",{"$nulls":14},false,false,false,{"$nulls":11},"ホ．住宅の種類",{"$nulls":8},"(1)専用住宅",{"$nulls":6},"(2)併用住宅",{"$nulls":6},"(3)その他の住宅",{"$nulls":14},false,false,false]
[null,"ヘ．住宅の建て方",{"$nulls":8},"(1)一戸建住宅",{"$nulls":6},"(2)長屋建住宅",{"$nulls":6},"(3)共同住宅",{"$nulls":14},false,false,false,{"$nulls":11},"ヘ．住宅の建て方",{"$nulls":8},"(1)一戸建住宅",{"$nulls":6},"(2)長屋建住宅",{"$nulls":6},"(3)共同住宅",{"$nulls":14},false,false,false,{"$nulls":11},"ヘ．住宅の建て方",{"$nulls":8},"(1)一戸建住宅",{"$nulls":6},"(2)長屋建住宅",{"$nulls":6},"(3)共同住宅",{"$nulls":14},false,false,false,{"$nulls":11},"ヘ．住宅の建て方",{"$nulls":8},"(1)一戸建住宅",{"$nulls":6},"(2)長屋建住宅",{"$nulls":6},"(3)共同住宅",{"$nulls":14},false,false,false]
[null,"ト．利用関係",{"$nulls":8},"(1)持家　",{"$nulls":6},"(2)貸家　　",{"$nulls":6},"(3)給与住宅",{"$nulls":6},"(4)分譲住宅",{"$nulls":7},false,false,false,false,{"$nulls":10},"ト．利用関係",{"$nulls":8},"(1)持家　",{"$nulls":6},"(2)貸家　　",{"$nulls":6},"(3)給与住宅",{"$nulls":6},"(4)分譲住宅",{"$nulls":7},false,false,false,false,{"$nulls":10},"ト．利用関係",{"$nulls":8},"(1)持家　",{"$nulls":6},"(2)貸家　　",{"$nulls":6},"(3)給与住宅",{"$nulls":6},"(4)分譲住宅",{"$nulls":7},false,false,false,false,{"$nulls":10},"ト．利用関係",{"$nulls":8},"(1)持家　",{"$nulls":6},"(2)貸家　　",{"$nulls":6},"(3)給与住宅",{"$nulls":6},"(4)分譲住宅",{"$nulls":7},false,false,false,false]
[null,"チ．住宅の戸数",{"$nulls":12},"戸",{"$nulls":6},"戸",{"$nulls":6},"戸",{"$nulls":6},"戸",{"$nulls":17},"チ．住宅の戸数",{"$nulls":12},"戸",{"$nulls":6},"戸",{"$nulls":6},"戸",{"$nulls":6},"戸",{"$nulls":17},"チ．住宅の戸数",{"$nulls":12},"戸",{"$nulls":6},"戸",{"$nulls":6},"戸",{"$nulls":6},"戸",{"$nulls":17},"チ．住宅の戸数",{"$nulls":12},"戸",{"$nulls":6},"戸",{"$nulls":6},"戸",{"$nulls":6},"戸"]
[null,"リ．工事部分の\n　　床面積の合計",{"$nulls":12},"㎡",{"$nulls":6},"㎡",{"$nulls":6},"㎡",{"$nulls":6},"㎡",{"$nulls":17},"リ．工事部分の\n　　床面積の合計",{"$nulls":12},"㎡",{"$nulls":6},"㎡",{"$nulls":6},"㎡",{"$nulls":6},"㎡",{"$nulls":17},"リ．工事部分の\n　　床面積の合計",{"$nulls":12},"㎡",{"$nulls":6},"㎡",{"$nulls":6},"㎡",{"$nulls":6},"㎡",{"$nulls":17},"リ．工事部分の\n　　床面積の合計",{"$nulls":12},"㎡",{"$nulls":6},"㎡",{"$nulls":6},"㎡",{"$nulls":6},"㎡"]
[]
[]
[null,"イ．番号",{"$nulls":51},"イ．番号",{"$nulls":51},"イ．番号",{"$nulls":51},"イ．番号"]
[null,"ロ．新設又は\n　　　その他の別",{"$nulls":8},"(1)新設",{"$nulls":5},"(2)その他",{"$nulls":21},{"$f":"IF(AND($AN$13=TRUE,COUNTIF(AN66:AP66,TRUE)=0),\"未入力\",IF(COUNTIF(AN66:AP66,TRUE)=2,\"複数選択\",\"\"))","v":""},false,false,{"$nulls":12},"ロ．新設又は\n　　　その他の別",{"$nulls":8},"(1)新設",{"$nulls":5},"(2)その他",{"$nulls":21},{"$f":"IF(AND($AN$13=TRUE,COUNTIF(CN66:CP66,TRUE)=0),\"未入力\",IF(COUNTIF(CN66:CP66,TRUE)=2,\"複数選択\",\"\"))","v":""},false,false,{"$nulls":12},"ロ．新設又は\n　　　その他の別",{"$nulls":8},"(1)新設",{"$nulls":5},"(2)その他",{"$nulls":21},{"$f":"IF(AND($AN$13=TRUE,COUNTIF(EN66:EP66,TRUE)=0),\"未入力\",IF(COUNTIF(EN66:EP66,TRUE)=2,\"複数選択\",\"\"))","v":""},false,false,{"$nulls":12},"ロ．新設又は\n　　　その他の別",{"$nulls":8},"(1)新設",{"$nulls":5},"(2)その他",{"$nulls":21},{"$f":"IF(AND($AN$13=TRUE,COUNTIF(GN66:GP66,TRUE)=0),\"未入力\",IF(COUNTIF(GN66:GP66,TRUE)=2,\"複数選択\",\"\"))","v":""},false,false]
[null,"ハ．新設住宅の資金",{"$nulls":8},"(1)民間資金住宅",{"$nulls":7},"(2)公営住宅",{"$nulls":6},"(3)住宅金融支援機構住宅",{"$nulls":12},{"$f":"IF(AND($AN$13=TRUE,COUNTIF(AN67:AP67,TRUE)=0),\"未入力\",IF(COUNTIF(AN67:AP67,TRUE)=2,\"複数選択\",\"\"))","v":""},false,false,false,{"$nulls":11},"ハ．新設住宅の資金",{"$nulls":8},"(1)民間資金住宅",{"$nulls":7},"(2)公営住宅",{"$nulls":6},"(3)住宅金融支援機構住宅",{"$nulls":12},{"$f":"IF(AND($AN$13=TRUE,COUNTIF(CN67:CP67,TRUE)=0),\"未入力\",IF(COUNTIF(CN67:CP67,TRUE)=2,\"複数選択\",\"\"))","v":""},false,false,false,{"$nulls":11},"ハ．新設住宅の資金",{"$nulls":8},"(1)民間資金住宅",{"$nulls":7},"(2)公営住宅",{"$nulls":6},"(3)住宅金融支援機構住宅",{"$nulls":12},{"$f":"IF(AND($AN$13=TRUE,COUNTIF(EN67:EP67,TRUE)=0),\"未入力\",IF(COUNTIF(EN67:EP67,TRUE)=2,\"複数選択\",\"\"))","v":""},false,false,false,{"$nulls":11},"ハ．新設住宅の資金",{"$nulls":8},"(1)民間資金住宅",{"$nulls":7},"(2)公営住宅",{"$nulls":6},"(3)住宅金融支援機構住宅",{"$nulls":12},{"$f":"IF(AND($AN$13=TRUE,COUNTIF(GN67:GP67,TRUE)=0),\"未入力\",IF(COUNTIF(GN67:GP67,TRUE)=2,\"複数選択\",\"\"))","v":""},false,false,false]
[{"$nulls":10},"(4)都市再生機構住宅",{"$nulls":9},"(5)その他",{"$nulls":17},{"$f":"IF(AND($AN$13=TRUE,K68=\"\"),\"未入力\",\"\")","v":""},false,false,{"$nulls":21},"(4)都市再生機構住宅",{"$nulls":9},"(5)その他",{"$nulls":17},{"$f":"IF(AND($AN$13=TRUE,BK68=\"\"),\"未入力\",\"\")","v":""},false,false,{"$nulls":21},"(4)都市再生機構住宅",{"$nulls":9},"(5)その他",{"$nulls":17},{"$f":"IF(AND($AN$13=TRUE,DK68=\"\"),\"未入力\",\"\")","v":""},false,false,{"$nulls":21},"(4)都市再生機構住宅",{"$nulls":9},"(5)その他",{"$nulls":17},{"$f":"IF(AND($AN$13=TRUE,FK68=\"\"),\"未入力\",\"\")","v":""},false,false]
[null,"ニ．住宅の建築工法",{"$nulls":8},"(1)在来工法",{"$nulls":6},"(2)プレハブ工法",{"$nulls":6},"(3)枠組壁工法",{"$nulls":13},{"$f":"IF(AND($AN$13=TRUE,M69=\"\"),\"未入力\",\"\")","v":""},false,false,false,{"$nulls":11},"ニ．住宅の建築工法",{"$nulls":8},"(1)在来工法",{"$nulls":6},"(2)プレハブ工法",{"$nulls":6},"(3)枠組壁工法",{"$nulls":13},{"$f":"IF(AND($AN$13=TRUE,BM69=\"\"),\"未入力\",\"\")","v":""},false,false,false,{"$nulls":11},"ニ．住宅の建築工法",{"$nulls":8},"(1)在来工法",{"$nulls":6},"(2)プレハブ工法",{"$nulls":6},"(3)枠組壁工法",{"$nulls":13},{"$f":"IF(AND($AN$13=TRUE,DM69=\"\"),\"未入力\",\"\")","v":""},false,false,false,{"$nulls":11},"ニ．住宅の建築工法",{"$nulls":8},"(1)在来工法",{"$nulls":6},"(2)プレハブ工法",{"$nulls":6},"(3)枠組壁工法",{"$nulls":13},{"$f":"IF(AND($AN$13=TRUE,FM69=\"\"),\"未入力\",\"\")","v":""},false,false,false]
[null,"ホ．住宅の種類",{"$nulls":8},"(1)専用住宅",{"$nulls":6},"(2)併用住宅",{"$nulls":6},"(3)その他の住宅",{"$nulls":13},{"$f":"IF(AND($AN$13=TRUE,COUNTIF(AN70:AP70,TRUE)=0),\"未入力\",\"\")","v":""},false,false,false,{"$nulls":11},"ホ．住宅の種類",{"$nulls":8},"(1)専用住宅",{"$nulls":6},"(2)併用住宅",{"$nulls":6},"(3)その他の住宅",{"$nulls":13},{"$f":"IF(AND($AN$13=TRUE,COUNTIF(CN70:CP70,TRUE)=0),\"未入力\",\"\")","v":""},false,false,false,{"$nulls":11},"ホ．住宅の種類",{"$nulls":8},"(1)専用住宅",{"$nulls":6},"(2)併用住宅",{"$nulls":6},"(3)その他の住宅",{"$nulls":13},{"$f":"IF(AND($AN$13=TRUE,COUNTIF(EN70:EP70,TRUE)=0),\"未入力\",\"\")","v":""},false,false,false,{"$nulls":11},"ホ．住宅の種類",{"$nulls":8},"(1)専用住宅",{"$nulls":6},"(2)併用住宅",{"$nulls":6},"(3)その他の住宅",{"$nulls":13},{"$f":"IF(AND($AN$13=TRUE,COUNTIF(GN70:GP70,TRUE)=0),\"未入力\",\"\")","v":""},false,false,false]
[null,"ヘ．住宅の建て方",{"$nulls":8},"(1)一戸建住宅",{"$nulls":6},"(2)長屋建住宅",{"$nulls":6},"(3)共同住宅",{"$nulls":13},{"$f":"IF(AND($AN$13=TRUE,N71=\"\"),\"未入力\",\"\")","v":""},false,false,false,{"$nulls":11},"ヘ．住宅の建て方",{"$nulls":8},"(1)一戸建住宅",{"$nulls":6},"(2)長屋建住宅",{"$nulls":6},"(3)共同住宅",{"$nulls":13},{"$f":"IF(AND($AN$13=TRUE,BN71=\"\"),\"未入力\",\"\")","v":""},false,false,false,{"$nulls":11},"ヘ．住宅の建て方",{"$nulls":8},"(1)一戸建住宅",{"$nulls":6},"(2)長屋建住宅",{"$nulls":6},"(3)共同住宅",{"$nulls":13},{"$f":"IF(AND($AN$13=TRUE,DN71=\"\"),\"未入力\",\"\")","v":""},false,false,false,{"$nulls":11},"ヘ．住宅の建て方",{"$nulls":8},"(1)一戸建住宅",{"$nulls":6},"(2)長屋建住宅",{"$nulls":6},"(3)共同住宅",{"$nulls":13},{"$f":"IF(AND($AN$13=TRUE,FN71=\"\"),\"未入力\",\"\")","v":""},false,false,false]
[null,"ト．利用関係",{"$nulls":8},"(1)持家　",{"$nulls":6},"(2)貸家　　",{"$nulls":6},"(3)給与住宅",{"$nulls":6},"(4)分譲住宅",{"$nulls":6},{"$f":"IF(AND($AN$13=TRUE,N72=\"\"),\"未入力\",\"\")","v":""},false,false,false,false,{"$nulls":10},"ト．利用関係",{"$nulls":8},"(1)持家　",{"$nulls":6},"(2)貸家　　",{"$nulls":6},"(3)給与住宅",{"$nulls":6},"(4)分譲住宅",{"$nulls":6},{"$f":"IF(AND($AN$13=TRUE,BN72=\"\"),\"未入力\",\"\")","v":""},false,false,false,false,{"$nulls":10},"ト．利用関係",{"$nulls":8},"(1)持家　",{"$nulls":6},"(2)貸家　　",{"$nulls":6},"(3)給与住宅",{"$nulls":6},"(4)分譲住宅",{"$nulls":6},{"$f":"IF(AND($AN$13=TRUE,DN72=\"\"),\"未入力\",\"\")","v":""},false,false,false,false,{"$nulls":10},"ト．利用関係",{"$nulls":8},"(1)持家　",{"$nulls":6},"(2)貸家　　",{"$nulls":6},"(3)給与住宅",{"$nulls":6},"(4)分譲住宅",{"$nulls":6},{"$f":"IF(AND($AN$13=TRUE,FN72=\"\"),\"未入力\",\"\")","v":""},false,false,false,false]
[null,"チ．住宅の戸数",{"$nulls":12},"戸",{"$nulls":6},"戸",{"$nulls":6},"戸",{"$nulls":6},"戸",{"$nulls":17},"チ．住宅の戸数",{"$nulls":12},"戸",{"$nulls":6},"戸",{"$nulls":6},"戸",{"$nulls":6},"戸",{"$nulls":17},"チ．住宅の戸数",{"$nulls":12},"戸",{"$nulls":6},"戸",{"$nulls":6},"戸",{"$nulls":6},"戸",{"$nulls":17},"チ．住宅の戸数",{"$nulls":12},"戸",{"$nulls":6},"戸",{"$nulls":6},"戸",{"$nulls":6},"戸"]
[null,"リ．工事部分の\n　　床面積の合計",{"$nulls":12},"㎡",{"$nulls":6},"㎡",{"$nulls":6},"㎡",{"$nulls":6},"㎡",{"$nulls":17},"リ．工事部分の\n　　床面積の合計",{"$nulls":12},"㎡",{"$nulls":6},"㎡",{"$nulls":6},"㎡",{"$nulls":6},"㎡",{"$nulls":17},"リ．工事部分の\n　　床面積の合計",{"$nulls":12},"㎡",{"$nulls":6},"㎡",{"$nulls":6},"㎡",{"$nulls":6},"㎡",{"$nulls":17},"リ．工事部分の\n　　床面積の合計",{"$nulls":12},"㎡",{"$nulls":6},"㎡",{"$nulls":6},"㎡",{"$nulls":6},"㎡"]

{"sheet":"市町村コード","index":16,"n_rows":74,"n_cols":11,"rows_kept":74,"hidden":true}
[]
[null,"福井県","岐阜県","愛知県","三重県","滋賀県","京都府","大阪府","兵庫県","奈良県","和歌山県"]
["福井県","福井市","岐阜市","名古屋市千種区","津市","大津市","京都市北区","大阪市都島区","神戸市東灘区","奈良市","和歌山市"]
["岐阜県","敦賀市","大垣市","名古屋市東区","四日市市","彦根市","京都市上京区","大阪市福島区","神戸市灘区","大和高田市","海南市"]
["愛知県","小浜市","高山市","名古屋市北区","伊勢市","長浜市","京都市左京区","大阪市此花区","神戸市兵庫区","大和郡山市","橋本市"]
["三重県","大野市","多治見市","名古屋市西区","松阪市","近江八幡市","京都市中京区","大阪市西区","神戸市長田区","天理市","有田市"]
["滋賀県","勝山市","関市","名古屋市中村区","桑名市","草津市","京都市東山区","大阪市港区","神戸市須磨区","橿原市","御坊市"]
["京都府","鯖江市","中津川市","名古屋市中区","鈴鹿市","守山市","京都市下京区","大阪市大正区","神戸市垂水区","桜井市","田辺市"]
["大阪府","あわら市","美濃市","名古屋市昭和区","名張市","栗東市","京都市南区","大阪市天王寺区","神戸市北区","五條市","新宮市"]
["兵庫県","越前市","瑞浪市","名古屋市瑞穂区","尾鷲市","甲賀市","京都市右京区","大阪市浪速区","神戸市中央区","御所市","紀の川市"]
["奈良県","坂井市","羽島市","名古屋市熱田区","亀山市","野洲市","京都市伏見区","大阪市西淀川区","神戸市西区","生駒市","岩出市"]
["和歌山県","永平寺町","恵那市","名古屋市中川区","鳥羽市","湖南市","京都市山科区","大阪市東淀川区","姫路市","香芝市","紀美野町"]
[null,"池田町","美濃加茂市","名古屋市港区","熊野市","高島市","京都市西京区","大阪市東成区","尼崎市","葛城市","かつらぎ町"]
[null,"南越前町","土岐市","名古屋市南区","いなべ市","東近江市","福知山市","大阪市生野区","明石市","宇陀市","九度山町"]
[null,"越前町","各務原市","名古屋市守山区","志摩市","米原市","舞鶴市","大阪市旭区","西宮市","山添村","高野町"]
[null,"美浜町","可児市","名古屋市緑区","伊賀市","日野町","綾部市","大阪市城東区","洲本市","平群町","湯浅町"]
[null,"高浜町","山県市","名古屋市名東区","木曽岬町","竜王町","宇治市","大阪市阿倍野区","芦屋市","三郷町","広川町"]
[null,"おおい町","瑞穂市","名古屋市天白区","東員町","愛荘町","宮津市","大阪市住吉区","伊丹市","斑鳩町","有田川町"]
[null,"若狭町","飛騨市","豊橋市","菰野町","豊郷町","亀岡市","大阪市東住吉区","相生市","安堵町","美浜町"]
[null,null,"本巣市","岡崎市","朝日町","甲良町","城陽市","大阪市西成区","豊岡市","川西町","日高町"]
[null,null,"郡上市","一宮市","川越町","多賀町","向日市","大阪市淀川区","加古川市","三宅町","由良町"]
[null,null,"下呂市","瀬戸市","多気町",null,"長岡京市","大阪市鶴見区","赤穂市","田原本町","印南町"]
[null,null,"海津市","半田市","明和町",null,"八幡市","大阪市住之江区","西脇市","曽爾村","みなべ町"]
[null,null,"岐南町","春日井市","大台町",null,"京田辺市","大阪市平野区","宝塚市","御杖村","日高川町"]
[null,null,"笠松町","豊川市","玉城町",null,"京丹後市","大阪市北区","三木市","高取町","白浜町"]
[null,null,"養老町","津島市","度会町",null,"南丹市","大阪市中央区","高砂市","明日香村","上富田町"]
[null,null,"垂井町","碧南市","大紀町",null,"木津川市","堺市堺区","川西市","上牧町","すさみ町"]
[null,null,"関ケ原町","刈谷市","南伊勢町",null,"大山崎町","堺市中区","小野市","王寺町","那智勝浦町"]
[null,null,"神戸町","豊田市","紀北町",null,"久御山町","堺市東区","三田市","広陵町","太地町"]
[null,null,"輪之内町","安城市","御浜町",null,"井手町","堺市西区","加西市","河合町","古座川町"]
[null,null,"安八町","西尾市","紀宝町",null,"宇治田原町","堺市南区","丹波篠山市","吉野町","北山村"]
[null,null,"揖斐川町","蒲郡市",null,null,"笠置町","堺市北区","養父市","大淀町","串本町"]
[null,null,"大野町","犬山市",null,null,"和束町","堺市美原区","丹波市","下市町"]
[null,null,"池田町","常滑市",null,null,"精華町","岸和田市","南あわじ市","黒滝村"]
[null,null,"北方町","江南市",null,null,"南山城村","豊中市","朝来市","天川村"]
[null,null,"坂祝町","小牧市",null,null,"京丹波町","池田市","淡路市","野迫川村"]
[null,null,"富加町","稲沢市",null,null,"伊根町","吹田市","宍粟市","十津川村"]
[null,null,"川辺町","新城市",null,null,"与謝野町","泉大津市","加東市","下北山村"]
[null,null,"七宗町","東海市",{"$nulls":3},"高槻市","たつの市","上北山村"]
[null,null,"八百津町","大府市",{"$nulls":3},"貝塚市","猪名川町","川上村"]
[null,null,"白川町","知多市",{"$nulls":3},"守口市","多可町","東吉野村"]
[null,null,"東白川村","知立市",{"$nulls":3},"枚方市","稲美町"]
[null,null,"御嵩町","尾張旭市",{"$nulls":3},"茨木市","播磨町"]
[null,null,"白川村","高浜市",{"$nulls":3},"八尾市","市川町"]
[{"$nulls":3},"岩倉市",{"$nulls":3},"泉佐野市","福崎町"]
[{"$nulls":3},"豊明市",{"$nulls":3},"富田林市","神河町"]
[{"$nulls":3},"日進市",{"$nulls":3},"寝屋川市","太子町"]
[{"$nulls":3},"田原市",{"$nulls":3},"河内長野市","上郡町"]
[{"$nulls":3},"愛西市",{"$nulls":3},"松原市","佐用町"]
[{"$nulls":3},"清須市",{"$nulls":3},"大東市","香美町"]
[{"$nulls":3},"北名古屋市",{"$nulls":3},"和泉市","新温泉町"]
[{"$nulls":3},"弥富市",{"$nulls":3},"箕面市"]
[{"$nulls":3},"みよし市",{"$nulls":3},"柏原市"]
[{"$nulls":3},"あま市",{"$nulls":3},"羽曳野市"]
[{"$nulls":3},"長久手市",{"$nulls":3},"門真市"]
[{"$nulls":3},"東郷町",{"$nulls":3},"摂津市"]
[{"$nulls":3},"豊山町",{"$nulls":3},"高石市"]
[{"$nulls":3},"大口町",{"$nulls":3},"藤井寺市"]
[{"$nulls":3},"扶桑町",{"$nulls":3},"東大阪市"]
[{"$nulls":3},"大治町",{"$nulls":3},"泉南市"]
[{"$nulls":3},"蟹江町",{"$nulls":3},"四條畷市"]
[{"$nulls":3},"飛島村",{"$nulls":3},"交野市"]
[{"$nulls":3},"阿久比町",{"$nulls":3},"大阪狭山市"]
[{"$nulls":3},"東浦町",{"$nulls":3},"阪南市"]
[{"$nulls":3},"南知多町",{"$nulls":3},"島本町"]
[{"$nulls":3},"美浜町",{"$nulls":3},"豊能町"]
[{"$nulls":3},"武豊町",{"$nulls":3},"能勢町"]
[{"$nulls":3},"幸田町",{"$nulls":3},"忠岡町"]
[{"$nulls":3},"設楽町",{"$nulls":3},"熊取町"]
[{"$nulls":3},"東栄町",{"$nulls":3},"田尻町"]
[{"$nulls":3},"豊根村",{"$nulls":3},"岬町"]
[{"$nulls":7},"太子町"]
[{"$nulls":7},"河南町"]
[{"$nulls":7},"千早赤阪村"]

{"sheet":"滋賀敷調表1・2","index":17,"n_rows":78,"n_cols":37,"rows_kept":78,"merged":[[2,26,2,27],[2,28,2,29],[3,0,3,5],[3,6,3,34],[4,0,4,5],[4,6,4,34],[5,0,5,5],[5,6,5,34],[10,9,10,28],[11,10,11,11],[11,16,11,19],[11,24,11,27],[12,9,12,27],[14,0,44,0],[15,32,15,33],[16,1,23,14],[16,31,16,33],[31,1,32,14],[31,15,32,17],[31,18,32,18],[31,19,32,19],[31,20,32,20],[31,21,32,22],[31,26,32,26],[31,27,32,27],[34,15,35,17],[34,18,35,18],[34,19,35,19],[34,20,35,20],[34,21,35,22],[34,26,35,26],[34,27,35,27],[36,1,37,14],[37,20,37,22],[42,24,42,25],[43,1,44,14],[46,0,66,0],[54,1,55,14],[54,15,55,17],[54,18,55,18],[54,19,55,19],[54,20,55,20],[54,21,55,22],[54,27,55,27],[54,28,55,28],[54,29,55,29],[54,30,55,30],[56,1,57,14],[56,15,57,17],[56,18,57,18],[56,19,57,19],[56,20,57,20],[56,21,57,22],[56,27,57,27],[56,28,57,28],[56,29,57,29],[56,30,57,30],[58,1,59,14],[62,1,63,14],[65,1,65,14],[65,15,65,34],[66,1,66,14],[66,15,66,34],[67,0,67,13]]}
["滋-第4号様式",{"$nulls":33},"（株）確認検査機構アネックス"]
["建築物の敷地及び周辺の状況に関する調査報告書",{"$nulls":35},"シートの保護を解除すると編集が可能になります（パスワードなし）"]
[{"$nulls":26},{"$f":"IF(申一面!X17=\"\",\"\",申一面!X17)","v":"令和"},{"$nulls":3},"年",null,"月",null,"日"]
["建築主住所・氏名",{"$nulls":5},{"$f":"IF(申二面!J7=\"\",\"\",申二面!J9&\"　　\"&申二面!J7)","v":""},{"$nulls":29},"滋賀県内用"]
["敷地の地名地番",{"$nulls":5},{"$f":"IF(申三面!G3=\"\",\"\",申三面!G3)","v":""}]
["主要用途・構造・階数",{"$nulls":5},{"$f":"IF(申三面!G3=\"\",\"\",申三面!N29&\"　・　\"&申三面!I64&\"　一部　\"&申三面!U64&\"　・　\"&\"地上　\"&申三面!L62&\"階　　\"&\"地下　\"&申三面!L63&\"階\")","v":""}]
[]
["上記の建築（築造）計画について、表１から表３のとおり調査しましたので報告します。"]
["この報告書に記載の事項は事実に相違ありません。"]
[]
[{"$nulls":4},"■","報告者の住所"]
[{"$nulls":4},"■","資　　　　格",{"$nulls":3},"（",null,null,"）","建築士　　",null,"（",{"$nulls":4},"）","登録",null,"第",{"$nulls":4},"号"]
[{"$nulls":4},"■","氏　　　　名"]
["表１"]
["建築基準関係規定等","事前調査を要する法令等",{"$nulls":13},"許可等の要・不要及び添付の有無"]
[null,"道路の種別",{"$nulls":13},"□","国道",null,"□","県道",null,"□","市町村道",null,null,"□","私道",null,"□","その他",null,"（",null,null,"）"]
[null,"建築基準法第４２条及び第４３条",{"$nulls":13},"□","法42条1項",null,null,"□","一号該当",null,null,"（道路法）",{"$nulls":4},"道路幅員",{"$nulls":5},"ｍ"]
[{"$nulls":19},"□","二号該当",null,null,"（都計法）"]
[{"$nulls":19},"□","三号該当",null,null,"（既存道路）"]
[{"$nulls":19},"□","四号該当",null,null,"（事業予定）"]
[{"$nulls":19},"□","五号該当",null,null,"（位置指定）"]
[{"$nulls":15},"□","法42条2項"]
[{"$nulls":15},"□","法第43条2項一号"]
[{"$nulls":15},"□","法第43条2項二号",{"$nulls":7},"添付の",null,"□","有"]
[null,"都市計画法第５３条による許可",{"$nulls":13},"許可の",null,null,"□","要","□","不要",null,null,"添付の",null,"□","有"]
[null,"都市計画法第２９条、第４２条及び第４３条による許可",{"$nulls":13},"許可の",null,null,"□","要","□","不要",{"$nulls":4},"□","有"]
[null,"都市計画法第４１条制限",{"$nulls":13},"制限の",null,null,"□","有","□","無"]
[null,"宅地造成及び特定盛土等規制法による許可",{"$nulls":13},"許可の",null,null,"□","要","□","不要",{"$nulls":4},"□","有"]
[null,"河川(水路)占用の許可（法定外公共物占用許可）",{"$nulls":13},"許可の",null,null,"□","要","□","不要",{"$nulls":4},"□","有"]
[null,"屋外広告物法及び同条例による許可",{"$nulls":13},"許可の",null,null,"□","要","□","不要",{"$nulls":4},"□","有"]
[null,"駐車場法に係る届出",{"$nulls":13},"届出の",null,null,"□","要","□","不要",{"$nulls":4},"□","有"]
[null,"建築基準法に基づく例外的な許可及び認定\n（仮設許可・連担建築物等）",{"$nulls":13},"許可の",null,null,"□","要","□","不要",{"$nulls":4},"□","有"]
[]
[null,"土砂災害防止法特別警戒区域",{"$nulls":13},"□","区域内",{"$nulls":3},"□","区域外"]
[null,"滋賀県流域治水の推進に関する条例　浸水警戒区域",{"$nulls":13},"条例14条の\n許可の",null,null,"□","要","□","不要",{"$nulls":4},"□","有"]
[{"$nulls":4},"□","区域内",null,"□","区域外"]
[null,"下水関係",{"$nulls":13},"□","公共下水道",{"$nulls":3},"□","農村下水道",{"$nulls":3},"□","団地内浄化槽"]
[{"$nulls":15},"供用開始年月日",{"$nulls":7},"年",null,"月",null,"日"]
[null,"浄化槽",{"$nulls":13},"□","設置",null,"□","既設置",null,"（","合併","・","単独",null," )","□","非設置"]
[null,"浄化槽設置による排水先等の協議",{"$nulls":13},"市町村との",null,null,"□","協議済",null,"□","協議中",null,null,"□","未","□","不要　"]
[null,"みずすまし条例　義務化区域",{"$nulls":13},"□","区域内",null,"□","区域外"]
[null,"地区計画",{"$nulls":13},"□","区域内",null,"□","区域外",{"$nulls":3},"届出",null,"□","有","□","無"]
[null,"高度地区",{"$nulls":13},"□","地区内",null,"□","地区外",{"$nulls":3},"（",null,null,"）","種高度"]
[null,"高齢者、障害者等の移動等の円滑化の促進に関する法律\n（バリアフリー法）",{"$nulls":13},"特別特定建築物（基準適合義務）",{"$nulls":8},"□","該当",null,"□","非該当"]
[{"$nulls":15},"特定建築物の計画の認定　",{"$nulls":8},"□","有",null,"□","無"]
["表２"]
["他法令及び要綱基準等","事前調査を要する法令等",{"$nulls":13},"許可等の要・不要及び添付の有無"]
[null,"各市町の小規模開発等の指導要綱等",{"$nulls":13},"適用の",null,null,"□","有","□","無",{"$nulls":3},"協議",null,"□","済","□","中","□","未"]
[null,"風致地区条例による許可",{"$nulls":13},"許可の",null,null,"□","要","□","不要",{"$nulls":5},"□","有","□","無"]
[null,"伝統的建造物群保存地区条例の許可",{"$nulls":13},"許可の",null,null,"□","要","□","不要",{"$nulls":5},"□","有","□","無"]
[null,"建築協定区域内の建築物に関する協議",{"$nulls":13},"地域の",null,null,"□","内","□","外",{"$nulls":3},"協議",null,"□","要","□","不要"]
[null,"自然公園法による許可",{"$nulls":13},"許可の",null,null,"□","要","□","不要",{"$nulls":5},"□","有","□","無"]
[null,"文化財保護法による許可・届出",{"$nulls":13},"許可等の",null,null,"□","要","□","不要",{"$nulls":5},"□","有","□","無"]
[null,"農地法による許可・届出",{"$nulls":13},"許可等の",null,null,"□","要","□","不要",{"$nulls":5},"□","有","□","無"]
[null,"だれもが住みたくなる福祉滋賀のまちづくり条例による\n届出",{"$nulls":13},"届出の",null,null,"□","要","□","不要",{"$nulls":5},"□","有","□","無"]
[]
[null,"景観計画の届出\n（滋賀県ふるさと滋賀の風景を守り育てる条例・各市景観計画条例）",{"$nulls":13},"届出の",null,null,"□","要","□","不要",{"$nulls":5},"□","有","□","無"]
[]
[null,"建設リサイクル法",{"$nulls":13},"□","対象",null,"（","□","解体",null,"□","新築",null,"□","土木",null,"□","その他",null,"）"]
[{"$nulls":15},"□","対象外"]
[null,"土地区画整理法第７６条による許可",{"$nulls":13},"許可の",null,null,"□","要","□","不要",{"$nulls":5},"□","有"]
[null,"工場立地法",{"$nulls":13},"届出の",null,null,"□","要","□","不要",{"$nulls":5},"□","有","□","無"]
[null,"特殊建築物定期調査報告",{"$nulls":13},"対象の",null,null,"□","有","□","無"]
[{"$nulls":15},"※有の場合、特定行政庁に付近見取図、配置図、各階平面図を提出してください。"]
[null,"大津市生活道路拡幅整備推進条例による拡幅協議",{"$nulls":13},"協議の",null,null,"□","要","□","不要",{"$nulls":5},"□","有"]
[]
[]
["上記以外に協議した場合、空欄に記入して下さい。",{"$nulls":33},"2025.04.01"]
{"$rows_empty":8}
[null,"□"]
[null,"■"]

{"sheet":"滋賀敷調表3","index":18,"n_rows":43,"n_cols":29,"rows_kept":43,"merged":[[7,0,11,2],[7,3,8,10],[7,18,7,25],[8,18,8,25],[9,3,10,10],[9,18,9,25],[10,18,10,25],[11,3,11,10],[11,18,11,25],[12,0,16,2],[12,3,12,10],[12,11,12,14],[12,15,12,17],[12,18,12,25],[13,11,13,13],[13,21,13,22],[14,11,14,13],[14,21,14,22],[15,11,15,13],[15,21,15,22],[16,3,16,10],[16,11,16,13],[17,0,24,2],[17,3,17,10],[17,11,17,14],[17,15,17,17],[17,18,17,25],[18,11,18,13],[18,15,18,17],[18,18,18,21],[18,22,18,25],[19,11,19,13],[19,15,19,17],[19,18,19,21],[19,22,19,25],[20,11,20,13],[20,15,20,17],[20,18,20,21],[20,22,20,25],[21,11,21,13],[21,15,21,17],[21,18,21,21],[21,22,21,25],[22,11,22,13],[22,15,22,17],[22,18,22,21],[22,22,22,25],[23,11,23,13],[23,15,23,17],[23,18,23,21],[23,22,23,25],[24,3,24,10],[24,11,24,13],[24,15,24,17],[24,18,24,21],[24,22,24,25],[25,0,25,2],[25,3,25,25],[26,3,26,25],[27,3,27,25]]}
[]
[{"$nulls":25},"株式会社確認検査機構アネックス"]
["表３ (敷地が以下のいずれかに該当する場合、記入願います）",{"$nulls":27},"シートの保護を解除すると編集が可能になります（パスワードなし）"]
["・市街化調整区域"]
["・市街化区域　1,000㎡以上"]
["・非線引き都市計画区域 3,000㎡以上（但し、甲賀市・東近江市・長浜市・米原市は1,000㎡以上、高島市は2,000㎡以上）"]
[]
["都市計画区域及び区域決定年月日",null,null,"・市街化区域",{"$nulls":9},"年",null,"月",null,"日","（都市計画区域）"]
[{"$nulls":13},"年",null,"月",null,"日","（市街化区域）"]
[{"$nulls":3},"・市街化調整区域",{"$nulls":9},"年",null,"月",null,"日","（都市計画区域）"]
[{"$nulls":13},"年",null,"月",null,"日","（市街化調整区域）"]
[{"$nulls":3},"・非線引き都市計画区域",{"$nulls":9},"年",null,"月",null,"日","（都市計画区域）"]
["敷地の変遷",null,null,"造成　年月日",{"$nulls":7},"規模",{"$nulls":3},"造成の有無",null,null,"都市計画法の許可等"]
[{"$nulls":3},"新設",null,null,"年",null,"月",null,"日",{"$nulls":3},"㎡","有","・","無",null,"線引前","・","許可等",null,"・","適用除外"]
[{"$nulls":3},"増設",null,null,"年",null,"月",null,"日",{"$nulls":3},"㎡","有","・","無",null,"線引前","・","許可等",null,"・","適用除外"]
[{"$nulls":3},"増設",null,null,"年",null,"月",null,"日",{"$nulls":3},"㎡","有","・","無",null,"線引前","・","許可等",null,"・","適用除外"]
[{"$nulls":3},"計",{"$nulls":10},"㎡"]
["建築物の変遷",null,null,"建築　年月日",{"$nulls":7},"規模",{"$nulls":3},"棟別用途",null,null,"建築確認検査済証　年月日・番号"]
[{"$nulls":3},"新設",null,null,"年",null,"月",null,"日",{"$nulls":3},"㎡"]
[{"$nulls":3},"増設",null,null,"年",null,"月",null,"日",{"$nulls":3},"㎡"]
[{"$nulls":3},"増設",null,null,"年",null,"月",null,"日",{"$nulls":3},"㎡"]
[{"$nulls":3},"増設",null,null,"年",null,"月",null,"日",{"$nulls":3},"㎡"]
[{"$nulls":3},"増設",null,null,"年",null,"月",null,"日",{"$nulls":3},"㎡"]
[{"$nulls":3},"増設",null,null,"年",null,"月",null,"日",{"$nulls":3},"㎡"]
[{"$nulls":3},"計",{"$nulls":10},"㎡"]
["備考"]
[]
[]
[]
["【注意事項】"]
["１.","確認申請を行う前に設計者が上記の関連法令及び指導要綱等について所管する行政庁において調査確認し、該当する□には"]
[null,"レ印を、その他については数値等を記載し報告してください。それらが　記載されていない場合は、確認申請を受け付けな"]
[null,"いことがあります。"]
["２.","調査の結果、許可等が必要であることが明らかになったものの内、建築基準関係規定に係るものについては、当該許可証等"]
[null,"を確認申請書に添付してください。"]
["３.","表１に掲げるものは、建築基準関係規定の一部であり、表２に掲げるものは建築物を建築するに当たって許可等が必要なも"]
["　　","のの主なものです。この他にも建築物等を建築する場合に当たって許可等の手続きが必要なものがありますので、十分注意"]
["　　","してください。"]
["４.","表３については、都市計画法第29条、第43条等の規定についての適否を判断するのに必要となりますので、十分調査の上記"]
[null,"載してください。"]
["５.","この報告書の記載内容が、事実と異なることが判明し、建築基準関係規定に抵触することとなった場合は、申請の取り下げ"]
["　　","又は工事取り止め届けを提出し、建築計画を中止してください。"]
["６.","報告者の氏名の記載を自署で行う場合に於いては押印を省略することができます。"]

{"sheet":"京市敷調1・2","index":19,"n_rows":177,"n_cols":105,"rows_kept":177,"merged":[[4,47,4,49],[4,52,4,53],[4,56,4,57],[6,2,6,8],[6,10,6,59],[7,2,7,8],[7,10,7,26],[7,27,7,60],[9,1,10,38],[12,14,12,21],[12,23,12,58],[13,15,13,20],[13,24,13,27],[13,34,13,39],[13,45,13,50],[14,15,14,20],[14,23,14,58],[17,1,17,12],[17,13,17,44],[17,45,17,60],[18,1,33,6],[18,7,18,12],[18,13,19,44],[18,45,18,47],[18,58,18,59],[19,7,19,12],[19,45,19,47],[19,58,19,59],[20,7,23,12],[20,13,20,44],[20,45,20,47],[20,58,20,59],[21,13,21,44],[21,45,21,47],[21,58,21,59],[22,13,23,44],[22,45,22,47],[22,58,22,59],[23,45,23,47],[23,58,23,59],[24,7,25,12],[24,13,25,44],[24,45,25,47],[24,48,25,48],[24,49,25,49],[24,50,25,50],[24,51,25,51],[24,52,25,52],[24,53,25,53],[24,57,25,57],[24,58,25,59],[26,7,27,12],[26,13,26,44],[26,45,26,47],[26,58,26,59],[27,13,27,44],[27,45,27,47],[27,58,27,59],[28,7,29,12],[28,13,29,44],[28,45,29,47],[28,48,29,48],[28,49,29,49],[28,50,29,50],[28,51,29,51],[28,52,29,52],[28,53,29,53],[28,57,29,57],[28,58,29,59],[30,7,33,12],[30,13,31,44],[30,45,31,47],[30,48,31,48],[30,49,31,49],[30,50,31,50],[30,51,31,51],[30,52,31,52],[30,53,31,53],[30,57,31,57],[30,58,31,59],[32,13,33,44],[32,45,33,47],[32,48,33,48],[32,49,33,49],[32,50,33,50],[32,51,33,51],[32,52,33,52],[32,53,33,53],[32,57,33,57],[32,58,33,59],[34,1,35,6],[34,7,35,12],[34,13,35,44],[34,45,35,47],[34,48,35,48],[34,49,35,49],[34,50,35,50],[34,51,35,51],[34,52,35,52],[34,53,35,53],[34,57,35,57],[34,58,35,59],[36,1,38,6],[36,7,38,12],[36,13,38,44],[36,45,38,47],[36,48,38,48],[36,49,38,49],[36,50,38,50],[36,51,38,51],[36,52,38,52],[36,53,38,53],[36,57,38,57],[36,58,38,59],[39,1,42,6],[39,7,40,12],[39,13,40,44],[39,45,40,47],[39,51,40,51],[39,52,40,52],[39,53,40,53],[39,57,40,57],[39,58,40,58],[41,7,42,12],[41,13,42,44],[41,45,42,47],[41,51,42,51],[41,52,42,52],[41,53,42,53],[41,57,42,57],[41,58,42,58],[43,1,46,6],[43,7,44,12],[43,13,44,44],[43,45,44,59],[43,60,44,60],[45,7,46,12],[45,13,46,44],[45,45,46,47],[45,48,46,48],[45,49,46,49],[45,50,46,50],[45,57,46,57],[45,58,46,59],[49,1,49,12],[49,13,49,44],[49,45,49,60],[50,1,83,6],[50,7,54,12],[50,13,50,44],[50,45,50,47],[50,58,50,59],[51,13,51,44],[51,45,51,47],[51,58,51,59],[52,13,52,44],[52,45,52,47],[52,58,52,59],[53,13,53,44],[53,45,53,47],[53,58,53,59],[54,13,54,44],[54,45,54,47],[54,58,54,59],[55,7,61,12],[55,13,55,44],[55,45,55,47],[55,58,55,59],[56,13,56,44],[56,45,56,47],[56,58,56,59],[57,13,59,44],[57,45,59,47],[57,48,59,48],[57,49,59,49],[57,50,59,50],[57,51,59,51],[57,52,59,52],[57,53,59,53],[57,54,59,54],[57,55,59,55],[57,56,59,56],[57,57,59,57],[57,58,59,59],[60,13,60,44],[60,45,60,47],[60,58,60,59],[61,13,61,44],[61,45,61,47],[61,58,61,59],[62,7,63,12],[62,13,63,44],[62,45,63,47],[62,48,63,48],[62,49,63,49],[62,50,63,50],[62,51,63,51],[62,52,63,52],[62,53,63,53],[62,54,63,54],[62,55,63,55],[62,56,63,56],[62,57,63,57],[62,58,63,59],[62,60,63,60],[64,7,68,12],[64,13,64,44],[64,45,64,47],[64,58,64,59],[65,13,65,44],[65,45,65,47],[65,58,65,59],[66,13,66,44],[66,45,66,47],[66,58,66,59],[67,13,67,44],[67,45,67,47],[67,58,67,59],[68,13,68,44],[68,45,68,47],[68,58,68,59],[69,7,75,12],[69,13,69,44],[69,45,69,47],[69,58,69,59],[70,13,70,44],[70,45,70,47],[70,58,70,59],[71,13,71,44],[71,45,71,47],[71,58,71,59],[72,13,72,44],[72,45,72,47],[72,58,72,59],[73,13,74,44],[73,45,73,47],[73,58,73,59],[74,45,74,47],[74,58,74,59],[75,13,75,44],[75,45,75,47],[75,58,75,59],[76,7,83,12],[76,13,76,44],[76,45,76,47],[76,58,76,59],[77,13,78,44],[77,45,77,47],[77,58,77,59],[78,45,78,47],[78,58,78,59],[79,13,79,44],[79,45,79,47],[79,58,79,59],[80,13,80,44],[80,45,80,47],[80,58,80,59],[81,13,82,44],[81,45,81,47],[81,58,81,59],[82,45,82,47],[82,58,82,59],[83,13,83,44],[83,45,83,47],[83,58,83,59],[84,54,84,59],[86,1,86,12],[86,13,86,44],[86,45,86,60],[87,1,89,6],[87,7,87,12],[87,13,89,44],[87,45,89,47],[87,48,89,48],[87,49,89,49],[87,50,89,50],[87,51,89,51],[87,52,89,52],[87,53,89,53],[87,54,89,54],[87,55,89,55],[87,56,89,56],[87,57,89,57],[87,58,89,59],[88,7,89,12],[90,1,93,6],[90,7,91,12],[90,13,90,44],[90,45,90,47],[90,58,90,59],[91,13,91,44],[91,45,91,47],[91,58,91,59],[92,7,93,12],[92,13,93,44],[92,45,93,47],[92,48,93,48],[92,49,93,49],[92,50,93,50],[92,51,93,51],[92,52,93,52],[92,53,93,53],[92,54,93,54],[92,55,93,55],[92,56,93,56],[92,57,93,57],[92,58,93,59],[92,60,93,60],[94,1,99,6],[94,7,97,12],[94,13,94,44],[94,45,94,47],[94,58,94,59],[95,13,95,44],[95,45,95,47],[95,58,95,59],[96,13,97,44],[96,45,97,47],[96,48,97,48],[96,49,97,49],[96,50,97,50],[96,51,97,51],[96,52,97,52],[96,53,97,53],[96,54,97,54],[96,55,97,55],[96,56,97,56],[96,57,97,57],[96,58,97,59],[98,7,99,12],[98,13,99,44],[98,45,99,47],[98,48,99,48],[98,49,99,49],[98,50,99,50],[98,51,99,51],[98,52,99,52],[98,53,99,53],[98,54,99,54],[98,55,99,55],[98,56,99,56],[98,57,99,57],[98,58,99,59],[100,1,105,6],[100,7,102,12],[100,13,102,44],[100,45,102,47],[100,48,102,48],[100,49,102,49],[100,50,102,50],[100,51,102,51],[100,52,102,52],[100,53,102,53],[100,54,102,54],[100,55,102,55],[100,56,102,56],[100,57,102,57],[100,58,102,59],[100,60,102,60],[103,7,105,12],[103,13,105,44],[103,45,105,47],[103,48,105,48],[103,49,105,49],[103,50,105,50],[103,51,105,51],[103,52,105,52],[103,53,105,53],[103,54,105,54],[103,55,105,55],[103,56,105,56],[103,57,105,57],[103,58,105,59],[103,60,105,60],[106,1,113,6],[106,7,108,12],[106,13,106,44],[106,45,106,47],[106,58,106,59],[107,13,108,44],[107,45,108,47],[107,48,108,48],[107,49,108,49],[107,50,108,50],[107,51,108,51],[107,52,108,52],[107,53,108,53],[107,54,108,54],[107,55,108,55],[107,56,108,56],[107,57,108,57],[107,58,108,59],[109,7,111,12],[109,13,109,44],[109,45,109,47],[109,58,109,59],[110,13,111,44],[110,45,111,47],[110,48,111,48],[110,49,111,49],[110,50,111,50],[110,51,111,51],[110,52,111,52],[110,53,111,53],[110,54,111,54],[110,55,111,55],[110,56,111,56],[110,57,111,57],[110,58,111,59],[112,7,113,12],[112,13,113,44],[112,45,113,47],[112,48,113,48],[112,49,113,49],[112,50,113,50],[112,51,113,51],[112,52,113,52],[112,53,113,53],[112,54,113,54],[112,55,113,55],[112,56,113,56],[112,57,113,57],[112,58,113,59],[114,1,115,6],[114,7,115,12],[114,13,115,44],[114,45,115,47],[114,48,115,48],[114,49,115,49],[114,50,115,50],[114,57,115,57],[114,58,115,59],[116,1,122,6],[116,7,117,12],[116,13,117,44],[116,45,117,47],[116,48,117,48],[116,49,117,49],[116,50,117,50],[116,57,117,57],[116,58,117,59],[118,7,120,12],[118,13,120,44],[118,45,120,47],[118,48,120,48],[118,49,120,49],[118,50,120,50],[118,51,120,51],[118,52,120,52],[118,53,120,53],[118,54,120,54],[118,55,120,55],[118,56,120,56],[118,57,120,57],[118,58,120,59],[121,7,122,12],[121,13,122,44],[121,45,122,47],[121,48,122,48],[121,49,122,49],[121,50,122,50],[121,51,122,51],[121,52,122,52],[121,53,122,53],[121,54,122,54],[121,55,122,55],[121,56,122,56],[121,57,122,57],[121,58,122,59],[123,1,128,6],[123,7,124,12],[123,13,123,44],[123,45,123,47],[124,13,124,44],[124,45,124,47],[125,7,126,12],[125,13,126,44],[125,45,126,47],[125,48,126,48],[125,49,126,49],[125,50,126,50],[125,51,126,51],[125,52,126,52],[125,53,126,53],[125,54,126,54],[125,55,126,55],[125,56,126,56],[125,57,126,57],[125,58,126,59],[127,7,128,12],[127,13,128,44],[127,45,128,47],[127,48,128,48],[127,49,128,49],[127,50,128,50],[127,51,128,51],[127,52,128,52],[127,53,128,53],[127,54,128,54],[127,55,128,55],[127,56,128,56],[127,57,128,57],[127,58,128,59],[129,1,132,6],[129,7,130,12],[129,13,130,44],[129,45,130,47],[129,48,130,48],[129,49,130,49],[129,50,130,50],[129,51,130,51],[129,52,130,52],[129,53,130,53],[129,54,130,54],[129,55,130,55],[129,56,130,56],[129,57,130,57],[129,58,130,59],[131,7,132,12],[131,13,132,44],[131,45,132,47],[131,48,132,48],[131,49,132,49],[131,50,132,50],[131,51,132,51],[131,52,132,52],[131,53,132,53],[131,54,132,54],[131,55,132,55],[131,56,132,56],[131,57,132,57],[131,58,132,59],[136,1,136,6],[138,1,138,6],[140,1,140,6],[142,1,142,6],[144,1,144,6],[146,1,146,6],[148,1,148,6],[150,1,150,6],[152,1,152,6],[154,1,154,6],[174,13,174,44],[174,45,174,47],[174,58,174,59],[176,7,177,12],[176,13,177,44],[176,45,177,47],[176,48,177,48],[176,49,177,49],[176,50,177,50],[176,51,177,51],[176,52,177,52],[176,53,177,53],[176,54,177,54],[176,55,177,55],[176,56,177,56],[176,57,177,57],[176,58,177,59]]}
[]
[null,"京－４様式",{"$nulls":55},"その１",{"$nulls":6},"シートの保護を解除すると編集が可能になります（パスワードなし）"]
[null,"確認申請事前調査報告書"]
[]
[{"$nulls":46},{"$f":"IF(申一面!X17=\"\",\"\",申一面!X17)","v":"令和"},{"$nulls":3},"年",{"$nulls":3},"月",{"$nulls":3},"日",{"$nulls":5},"京都市用"]
[]
[null,null,"建築場所",{"$nulls":7},{"$f":"IF(申三面!G3=\"\",\"\",申三面!G3)","v":""}]
[null,null,"建築主",{"$nulls":7},"氏名（法人にあっては、名称及び代表者名）",{"$nulls":16},{"$f":"IF(申二面!J7=\"\",\"\",申二面!J7)","v":""}]
[]
[null,"上記の建築（築造）計画について，表１及び表２のとおり調査しましたので，報告します。\nこの報告書に記載の事項は，事実に相違ありません。"]
[]
[]
[{"$nulls":14},"報告者の住所"]
[{"$nulls":15},"資格",{"$nulls":7},"（",{"$nulls":4},"）","建築士",{"$nulls":3},"（",{"$nulls":6},"）","登録　第",{"$nulls":9},"号"]
[{"$nulls":15},"氏名"]
[]
[null,"表１ 建築基準関係規定（建築確認対象法令）"]
[null,"関　係　部　署　名",{"$nulls":11},"事　前　調　査　を　要　す　る　法　令　等",{"$nulls":31},"許 可 等 の 要 ， 不 要 等",{"$nulls":58},"□"]
[null,"都市計画局",{"$nulls":5},"建築指導課",{"$nulls":5},"建築基準法及びそれに基づく条例による例外的な許可又は認定\n(建築基準法第43条第2項許可又は認定含む）",{"$nulls":31},"許可の",null,null,"□","要","（","□","有","），",{"$nulls":3},"□","不要",{"$nulls":45},"■"]
[{"$nulls":7},"建築審査課",{"$nulls":37},"認定の",null,null,"□","要","（","□","有","），",{"$nulls":3},"□","不要"]
[{"$nulls":7},"建築指導課",{"$nulls":5},"マンションの建替え等の円滑化に関する法律第105条による許可",{"$nulls":31},"許可の",null,null,"□","要","（","□","有","），",{"$nulls":3},"□","不要"]
[{"$nulls":13},"長期優良住宅の普及の促進に関する法律第18条による許可",{"$nulls":31},"許可の",null,null,"□","要","（","□","有","），",{"$nulls":3},"□","不要"]
[{"$nulls":13},"京都市斜面地等における建築物等の制限に関する条例による許可又は認定",{"$nulls":31},"許可の",null,null,"□","要","（","□","有","），",{"$nulls":3},"□","不要"]
[{"$nulls":45},"認定の",null,null,"□","要","（","□","有","），",{"$nulls":3},"□","不要"]
[{"$nulls":7},"建築審査課",{"$nulls":5},"高齢者、障害者等の移動等円滑化の促進に関する法律（バリアフリー法）\n第14条第1項から第3項までによる適合（協議）",{"$nulls":31},"協議の",null,null,"□","要","（","□","有","），",{"$nulls":3},"□","不要"]
[]
[{"$nulls":7},"都市計画課",{"$nulls":5},"都市計画法第53条による許可",{"$nulls":31},"許可の",null,null,"□","要","（","□","有","），",{"$nulls":3},"□","不要"]
[{"$nulls":13},"駐車場法第20条及び駐車場条例による届出",{"$nulls":31},"届出の",null,null,"□","要","（","□","有","），",{"$nulls":3},"□","不要"]
[{"$nulls":7},"広告景観づくり推進課",{"$nulls":5},"京都市屋外広告物等に関する条例による許可",{"$nulls":31},"許可の",null,null,"□","要","（","□","有","），",{"$nulls":3},"□","不要"]
[]
[{"$nulls":7},"開発指導課",{"$nulls":5},"都市計画法第29条第1項及び第2項、第35条の2第1項、第41条第2項（同法第35条の2第4項において準用する場合を含む）、第42条及び第43条第1項による許可",{"$nulls":31},"許可の",null,null,"□","要","（","□","有","），",{"$nulls":3},"□","不要"]
[]
[{"$nulls":13},"宅地造成及び特定盛土等規制法第12条第1項、第16条第1項、第30条第1項及び第35条第1項による許可",{"$nulls":31},"許可の",null,null,"□","要","（","□","有","），",{"$nulls":3},"□","不要"]
[]
[null,"建設局",{"$nulls":5},"自転車政策\n推進室",{"$nulls":5},"自転車の安全利用の促進及び自転車等の駐車対策の総合的推進に関する法律\n第5条第4項及び京都市自転車等放置防止条例による届出",{"$nulls":31},"届出の",null,null,"□","要","（","□","有","），",{"$nulls":3},"□","不要"]
[]
[null,"環境政策局",{"$nulls":5},"北部・南部\n各環境共生\nセンター",{"$nulls":5},"浄化槽法第3条の2第1項及びび京都市浄化槽取扱指導要綱による協議",{"$nulls":31},"協議の",null,null,"□","要","（","□","有","），",{"$nulls":3},"□","不要"]
[]
[]
[null,"消防局",{"$nulls":5},"指導課\n（消防指導センター）",{"$nulls":5},"消防法第9条、第9条の2、第15条及び第17条による協議",{"$nulls":31},"協議の",{"$nulls":5},"□","有","，",{"$nulls":3},"□","無"]
[]
[{"$nulls":7},"指導課\n（保安担当）",{"$nulls":5},"液化石油ガスの保安確保及び取引適正化に関する法律第38条の2による基準適合義務",{"$nulls":31},"協議の",{"$nulls":5},"□","有","，",{"$nulls":3},"□","無"]
[]
[null,"上下水道局",{"$nulls":5},"水道部\n給水工事事務所",{"$nulls":5},"水道法第16条による協議（給水装置工事申請の際に実施）",{"$nulls":31},"-"]
[]
[{"$nulls":7},"下水道部\n管理課",{"$nulls":5},"下水道法第10条第1項及び第3項による協議",{"$nulls":31},"協議の",null,null,"□","要","，",{"$nulls":6},"□","不要"]
[]
[]
[null,"表２　建築基準関係規定（建築確認対象法令）以外で必要な手続"]
[null,"関　係　部　署　名",{"$nulls":11},"事　前　調　査　を　要　す　る　法　令　等",{"$nulls":31},"許 可 等 の 要 ， 不 要 等"]
[null,"都市計画局",{"$nulls":5},"建築指導課",{"$nulls":5},"京都市狭あい道路等整備事業実施要綱による狭あい道路整備の申出又は協議",{"$nulls":31},"申出の",null,null,"□","要","（","□","有","，","□","無","），","□","不要"]
[{"$nulls":13},"京都市狭あい道路等整備事業実施要綱による位置指定道路（拡幅予定型）整備の申出",{"$nulls":31},"申出の",null,null,"□","要","（","□","有","，","□","無","），","□","不要"]
[{"$nulls":13},"京都市中高層建築物等の建築等に係る住環境の保全及び形成に関する条例による届出",{"$nulls":31},"届出の",null,null,"□","要","（","□","有","，","□","無","），","□","不要"]
[{"$nulls":13},"京都市宿泊施設の建築等に係る地域との調和のための手続要綱による届出",{"$nulls":31},"届出の",null,null,"□","要","（","□","有","，","□","無","），","□","不要"]
[{"$nulls":13},"京都市葬祭場の建築等に関する指導要綱による届出",{"$nulls":31},"届出の",null,null,"□","要","（","□","有","，","□","無","），","□","不要"]
[{"$nulls":7},"建築審査課",{"$nulls":5},"京都市建築物等のバリアフリーの促進に関する条例による協議",{"$nulls":31},"協議の",null,null,"□","要","（","□","有","，","□","無","），","□","不要"]
[{"$nulls":13},"建築物のエネルギー消費性能の向上等に関する法律による建築物の建築に関する届出",{"$nulls":31},"届出の",null,null,"□","要","（","□","有","，","□","無","），","□","不要"]
[{"$nulls":13},"京都市地球温暖化対策条例による特定建築物に係る届出\n(建築物排出量削減計画書、地域産木材利用及び再生可能エネルギー利用設備設置届出書、建築物環境配慮性能の表示届）",{"$nulls":31},"届出の",null,null,"□","要","（","□","有","，","□","無","），","□","不要"]
[]
[]
[{"$nulls":13},"京都市地球温暖化対策条例による準特定建築物に係る完了届",{"$nulls":31},"届出の",null,null,"□","要","，",{"$nulls":6},"□","不要"]
[{"$nulls":13},"京都市地球温暖化対策条例による緑化計画書の提出",{"$nulls":31},"提出の",null,null,"□","要","（","□","有","，","□","無","），","□","不要"]
[{"$nulls":7},"建築安全\n推進課",{"$nulls":5},"建設工事に係る資材の再資源化等に関する法律（建設ﾘｻｲｸﾙ法）による届出",{"$nulls":31},"届出の",null,null,"□","要","（","□","有","，","□","無","），","□","不要"]
[]
[{"$nulls":7},"都市計画課",{"$nulls":5},"都市計画法第58条の2（地区計画）による届出",{"$nulls":31},"届出の",null,null,"□","要","（","□","有","，","□","無","），","□","不要"]
[{"$nulls":13},"都市計画法第65条による許可",{"$nulls":31},"許可の",null,null,"□","要","（","□","有","，","□","無","），","□","不要"]
[{"$nulls":13},"京都市土地利用の調整に係るまちづくりに関する条例による協議",{"$nulls":31},"協議の",null,null,"□","要","（","□","有","，","□","無","），","□","不要"]
[{"$nulls":13},"都市再生特別措置法第88条、第108条又は第108条の2（「立地適正化計画」制度）による届出",{"$nulls":31},"届出の",null,null,"□","要","（","□","有","，","□","無","），","□","不要"]
[{"$nulls":13},"工業地域における住宅と工場の共存の実現に向けた調和を図るための手続要綱による届出",{"$nulls":31},"届出の",null,null,"□","要","（","□","有","，","□","無","），","□","不要"]
[{"$nulls":7},"景観政策課",{"$nulls":5},"京都市伝統的建造物群保存地区条例による許可",{"$nulls":31},"許可の",null,null,"□","要","（","□","有","，","□","無","），","□","不要"]
[{"$nulls":13},"景観地区（美観地区・美観形成地区）内における認定",{"$nulls":31},"認定の",null,null,"□","要","（","□","有","，","□","無","），","□","不要"]
[{"$nulls":13},"景観計画区域（建造物修景地区）内における届出",{"$nulls":31},"届出の",null,null,"□","要","（","□","有","，","□","無","），","□","不要"]
[{"$nulls":13},"京都市眺望景観創生条例による事前協議（景観デザインレビュー）",{"$nulls":31},"協議の",null,null,"□","要","（","□","有","，","□","無","），","□","不要"]
[{"$nulls":13},"京都市眺望景観創生条例による認定又は届出",{"$nulls":31},"認定の",null,null,"□","要","（","□","有","，","□","無","），","□","不要"]
[{"$nulls":45},"届出の",null,null,"□","要","（","□","有","，","□","無","），","□","不要"]
[{"$nulls":13},"京都都市計画高度地区の空間創出型高度地区第２項に定める建築物の認定",{"$nulls":31},"認定の",null,null,"□","要","（","□","有","，","□","無","），","□","不要"]
[{"$nulls":7},"風致保全課",{"$nulls":5},"京都市風致地区条例による許可",{"$nulls":31},"許可の",null,null,"□","要","（","□","有","，","□","無","），","□","不要"]
[{"$nulls":13},"古都における歴史的風土の保存に関する特別措置法による許可又は届出",{"$nulls":31},"許可の",null,null,"□","要","（","□","有","，","□","無","），","□","不要"]
[{"$nulls":45},"届出の",null,null,"□","要","（","□","有","，","□","無","），","□","不要"]
[{"$nulls":13},"都市緑地法による許可",{"$nulls":31},"許可の",null,null,"□","要","（","□","有","，","□","無","），","□","不要"]
[{"$nulls":13},"京都市自然風景保全条例による許可",{"$nulls":31},"許可の",null,null,"□","要","（","□","有","，","□","無","），","□","不要"]
[{"$nulls":13},"京都市眺望景観創生条例による認定又は届出",{"$nulls":31},"認定の",null,null,"□","要","（","□","有","，","□","無","），","□","不要"]
[{"$nulls":45},"届出の",null,null,"□","要","（","□","有","，","□","無","），","□","不要"]
[{"$nulls":13},"近畿圏の保全区域の整備に関する法律による届出",{"$nulls":31},"届出の",null,null,"□","要","（","□","有","，","□","無","），","□","不要"]
[{"$nulls":54},"R07.04.01 時点"]
[{"$nulls":57},"その２"]
[null,"関　係　部　署　名",{"$nulls":11},"事　前　調　査　を　要　す　る　法　令　等",{"$nulls":31},"許 可 等 の 要 ， 不 要 等"]
[null,"建設局",{"$nulls":5},"市街地整備課",{"$nulls":5},"土地区画整理法第76条による許可（事業施行中の地区（※））\n※　市街地整備課のホームページ参照",{"$nulls":31},"許可の",null,null,"□","要","（","□","有","，","□","無","），","□","不要"]
[{"$nulls":7},"南部区画整理事務所"]
[]
[null,"産業観光局",{"$nulls":5},"地域企業\n振興室",{"$nulls":5},"大規模小売店舗立地法又は中規模小売店舗設置指導要綱に関する届出",{"$nulls":31},"届出の",null,null,"□","要","（","□","有","，","□","無","），","□","不要"]
[{"$nulls":13},"京都市商業集積ガイドラインに関する協議",{"$nulls":31},"協議の",null,null,"□","要","（","□","有","，","□","無","），","□","不要"]
[{"$nulls":7},"企業誘致\n推進室",{"$nulls":5},"工場立地法に関する届出",{"$nulls":31},"届出の",null,null,"□","要","（","□","有","，","□","無","），","□","不要"]
[]
[null,"文化市民局",{"$nulls":5},"文化財保護課",{"$nulls":5},"文化財保護法第93条による届出（埋蔵文化財包蔵地）",{"$nulls":31},"届出の",null,null,"□","要","（","□","有","，","□","無","），","□","不要"]
[{"$nulls":13},"文化財保護法第125条による許可（史跡名勝天然記念物指定範囲）",{"$nulls":31},"許可の",null,null,"□","要","（","□","有","，","□","無","），","□","不要"]
[{"$nulls":13},"文化財保護法第139条による届出（重要文化的景観選定範囲における重要な構成要素）※左京区岡崎地区",{"$nulls":31},"届出の",null,null,"□","要","（","□","有","，","□","無","），","□","不要"]
[]
[{"$nulls":7},"地域自治\n推進室",{"$nulls":5},"京都市地域コミュニティ活性化推進条例第15条第1項による届出（転入者地域交流支\n援制度）※特定共同住宅（3階以上かつ15戸以上の共同住宅）の新築が対象",{"$nulls":31},"届出の",null,null,"□","要","（","□","有","，","□","無","），","□","不要"]
[]
[null,"保健福祉局",{"$nulls":5},"医療衛生センター（旅館業審査担当）",{"$nulls":5},"京都市旅館業施設建築等指導要綱による承認",{"$nulls":31},"承認の",null,null,"□","要","（","□","有","，","□","無","），","□","不要"]
[]
[]
[{"$nulls":7},"医療衛生センター（各方面担当）",{"$nulls":5},"食品衛生法、興行場法、公衆浴場法及びクリーニング業法による届出",{"$nulls":31},"届出の",null,null,"□","要","（","□","有","，","□","無","），","□","不要"]
[]
[]
[null,"環境政策局",{"$nulls":5},"環境保全\n創造課",{"$nulls":5},"土壌汚染対策法第3条第7項又は第4条第1項による届出",{"$nulls":31},"届出の",null,null,"□","要","，",{"$nulls":6},"□","不要"]
[{"$nulls":13},"京都市土砂等による土地の埋立て等の規制に関する条例第10条第1項及び第14条第1項による許可",{"$nulls":31},"許可の",null,null,"□","要","（","□","有","），","□","無","），","□","不要"]
[]
[{"$nulls":7},"北部・南部\n各環境共生\nセンター",{"$nulls":5},"大気、騒音、振動及び水質に係る公害関係法令等に関する協議",{"$nulls":31},"協議の",null,null,"□","要","（","□","有","，","□","無","），","□","不要"]
[{"$nulls":13},"京都市廃棄物の減量及び適正処理等に関する条例第24条及び25条による届出\n（事業用途の床面積が1,000㎡以上対象）",{"$nulls":31},"届出の",null,null,"□","要","（","□","有","，","□","無","），","□","不要"]
[]
[{"$nulls":7},"まち美化\n推進課",{"$nulls":5},"中高層住宅におけるごみ保管施設設置基準による協議\n（共同住宅など家庭系対象）",{"$nulls":31},"協議の",null,null,"□","要","（","□","有","，","□","無","），","□","不要"]
[]
[null,"消防局",{"$nulls":5},"指導課\n（保安担当）",{"$nulls":5},"液化石油ガスの保安確保及び取引適正化に関する法律第38条の3による届出",{"$nulls":31},"届出の",null,null,"□","要","，",{"$nulls":6},"□","不要"]
[]
[null,"上下水道局",{"$nulls":5},"下水道部\n管理課",{"$nulls":5},"排水槽、ディスポーザー排水処理システムを設置する建築物の協議（詳細については上下水道局ホームページ参照）",{"$nulls":31},"協議の",null,null,"□","要","，",{"$nulls":6},"□","不要"]
[]
[{"$nulls":7},"下水道部　　　　　　施設課",{"$nulls":5},"下水道法第11条の2（公共下水道使用開始）、下水道法第12条の3（特定施設設置）、京都市公共下水道事業条例第11条の2又は京都市特定環境保全公共下水道事業条例第11条（除害施設設置）による届出",{"$nulls":31},"届出の",null,null,"□","要","（","□","有","，","□","無","），","□","不要"]
[]
[]
[{"$nulls":7},"水道部給水工事事務所",{"$nulls":5},"3階建て以上の建物（個人住宅を除く）の直結式給水施行要領に基づく協議",{"$nulls":31},"協議の",null,null,"□","要","（","□","有","，","□","無","），","□","不要"]
[]
[null,"京都府",{"$nulls":5},"京都土木事務所",{"$nulls":5},"砂防指定地管理規則第4条による許可（砂防指定地）",{"$nulls":31},"許可の",null,null,"□","要","（","□","有","，","□","無","），","□","不要"]
[{"$nulls":13},"地すべり等防止法第18条による許可（地すべり防止区域）",{"$nulls":31},"許可の",null,null,"□","要","（","□","有","，","□","無","），","□","不要"]
[{"$nulls":7},"乙訓土木事務所（西京区の一部）",{"$nulls":5},"急傾斜地の崩壊による災害の防止に関する法律第7条による許可\n（急傾斜地崩壊危険区域）",{"$nulls":31},"許可の",null,null,"□","要","（","□","有","，","□","無","），","□","不要"]
[]
[{"$nulls":7},"南丹土木事務所（右京区の一部）",{"$nulls":5},"土砂災害警戒区域等における土砂災害防止対策の推進に関する法律第10条による許可（土砂災害特別警戒区域）",{"$nulls":31},"許可の",null,null,"□","要","（","□","有","，","□","無","），","□","不要"]
[]
[null,"その他",{"$nulls":5},"建築協定\n運営委員会",{"$nulls":5},"建築協定区域内における建築物に関する協議（問合せ：建築指導課）",{"$nulls":31},"協議の",null,null,"□","要","（","□","有","，","□","無","），","□","不要"]
[]
[{"$nulls":7},"地域景観\nづくり協議会",{"$nulls":5},"地域景観づくり協議地区内における意見の聴取　（問合せ：景観政策課）",{"$nulls":31},"意見\n聴取の",null,null,"□","要","（","□","有","，","□","無","），","□","不要"]
[]
[]
[null,"関　　係　　部　　署　　押　　印　　欄"]
[]
[null,"都市計画局"]
[]
[null,"環境政策局"]
[]
[null,"産業観光局"]
[]
[null,"文化市民局"]
[]
[null,"保健福祉局"]
[]
[null,"建設局"]
[]
[null,"各区役所"]
[]
[null,"上下水道局"]
[]
[]
[]
[null,"その他"]
[]
[]
[]
[]
[{"$nulls":59},{"$f":"BC85","v":"R07.04.01 時点"}]
[]
[null,"注１",null,"表１に掲げるものは，建築基準関係規定（建築確認対象法令）の一部であり，表２に掲げるものは建築物等を建築するに当たって許可等が必要なもの"]
[{"$nulls":3},"のうち主なものです。このほかにも，建築物等を建築するに当たって許可等の手続きが必要なものがありますので，十分注意してください。"]
[null,"注２",null,"調査の結果、許可・認定等が必要であることが明らかになったものについては，当該許可証等を添付してください。"]
[]
[]
[]
[]
[]
[]
[{"$nulls":4},"□",null,"一級"]
[{"$nulls":4},"■",null,"二級"]
[{"$nulls":6},"木造"]
[]
[{"$nulls":13},"都市の低炭素化の促進に関する法律第54条による認定",{"$nulls":31},"認定の",{"$nulls":5},"□","有","，",{"$nulls":3},"□","無"]
[]
[{"$nulls":7},"開発指導課",{"$nulls":5},"京都市土砂等による土地の埋立て等の規制に関する条例第10条第1項及び\n第14条第1項による許可",{"$nulls":31},"許可の",null,null,"□","要","（","□","有","，","□","無","），","□","不要"]

{"sheet":"京都基礎","index":20,"n_rows":43,"n_cols":36,"rows_kept":43,"merged":[[2,0,2,32],[4,21,4,22],[4,23,4,25],[4,27,4,28],[4,30,4,31],[8,17,9,18],[8,19,9,32],[10,17,10,18],[10,19,10,31],[15,0,15,32],[21,10,21,27],[28,17,28,27]]}
[]
[{"$nulls":35},"シートの保護を解除すると編集が可能になります（パスワードなし）"]
["基礎の構造関係チェックシート"]
[]
[{"$nulls":21},{"$f":"IF(申一面!X17=\"\",\"\",申一面!X17)","v":"令和"},{"$nulls":4},"年",null,null,"月",null,null,"日"]
[]
["株式会社確認検査機構アネックス　　様"]
[]
[{"$nulls":14},"設計者",null,null,"住所",null,{"$f":"IF(申二面!J30=\"\",\"\",申二面!J30)","v":""}]
[]
[{"$nulls":17},"氏名",null,{"$f":"IF(申二面!J26=\"\",\"\",申二面!J26)","v":""}]
[]
["　下記の各項目については，建築基準法施行令第３８条及び建設省告示第１３４７号に基づき，"]
["適法であることを確認しましたので報告します。"]
[]
["記"]
[]
[null,null,"◎　地耐力の確認"]
[]
[{"$nulls":3},"□","標準貫入試験"]
[{"$nulls":3},"□","スクリューウエイト貫入試験（SWS試験）"]
[{"$nulls":3},"□","その他の方法（",{"$nulls":23},"）"]
[]
[null,null,"◎　基礎の構造"]
[]
[{"$nulls":3},"□","２０ｋＮ／㎡未満",{"$nulls":10},"⇒",null,"基礎ぐい"]
[{"$nulls":3},"□","２０以上３０ｋＮ／㎡未満",{"$nulls":10},"⇒",null,"基礎ぐい・べた基礎"]
[{"$nulls":3},"□","３０ｋＮ／㎡以上",{"$nulls":10},"⇒",null,"基礎ぐい・べた基礎・布基礎"]
[{"$nulls":3},"□","その他構造計算等で確認",{"$nulls":10},"⇒"]
[]
[]
[]
[]
[null,"注意 ： □欄の該当する箇所にチェックしてください。"]
{"$rows_empty":7}
[null,null,"□"]
[null,null,"■"]

{"sheet":"軽微変更","index":21,"n_rows":70,"n_cols":23,"rows_kept":70,"merged":[[1,0,1,20],[3,0,3,6],[3,11,3,12],[3,15,3,16],[5,0,5,2],[5,3,5,5],[5,7,8,8],[5,9,6,9],[5,10,6,19],[6,0,15,2],[6,3,15,5],[7,9,8,9],[7,10,8,19],[9,7,11,8],[10,9,11,9],[10,10,11,19],[12,7,15,8],[13,9,13,16],[14,9,15,9],[14,10,15,19],[16,0,17,2],[16,3,17,5],[16,7,19,8],[17,9,17,16],[18,9,19,9],[18,10,19,19],[20,7,23,8],[21,9,21,16],[22,9,23,9],[22,10,23,19],[25,0,26,20],[27,0,27,20],[28,0,28,1],[28,6,28,8],[28,10,28,11],[28,12,28,13],[29,0,29,1],[30,0,31,1],[30,2,31,4],[30,5,31,20],[32,0,35,1],[32,2,32,4],[32,5,32,20],[33,2,33,4],[33,5,33,20],[34,2,34,4],[34,5,34,20],[35,2,35,4],[35,5,35,20],[36,2,36,4],[36,5,36,20],[37,2,37,4],[37,5,37,20],[38,2,38,4],[38,5,38,20],[39,2,39,4],[39,5,39,20],[40,2,40,4],[40,5,40,20],[41,2,41,4],[41,5,41,20],[42,2,42,4],[42,5,42,20],[43,2,43,4],[43,5,43,20],[44,2,44,4],[44,5,44,20],[45,0,45,1],[45,2,45,20],[46,2,46,20],[47,2,47,20],[48,2,48,20]]}
[]
["軽微な変更 説明書(届出）",{"$nulls":21},"シートの保護を解除すると編集が可能になります（パスワードなし）"]
[]
["（あて先）株式会社 確認検査機構アネックス",{"$nulls":10},"令和",null,null,"年",null,null,"月",null,"日"]
[]
["※受付欄",null,null,"※決裁欄",{"$nulls":3},"建築主",null,"住所"]
[{"$nulls":3},"　　年 　月 　日　"]
[{"$nulls":9},"氏名"]
[]
[{"$nulls":7},"代理者",null,"資格","(",null,")","建築士","（",null,"）","登録",null,"号"]
[{"$nulls":9},"氏名"]
[]
[{"$nulls":7},"設計者\n（代表となる設計者）",null,"資格","(",null,")","建築士","（",null,"）","登録",null,"号"]
[{"$nulls":9},"構造・設備 設計一級建築士交付",{"$nulls":7},"第",null,"号"]
[{"$nulls":9},"氏名"]
[]
["※計画変更確認申請",null,null,"要 ・ 否",{"$nulls":3},"設計者\n（構造設計者）",null,"資格","(",null,")","建築士","（",null,"）","登録",null,"号"]
[{"$nulls":9},"構造設計一級建築士交付",{"$nulls":7},"第",null,"号"]
[{"$nulls":9},"氏名",{"$nulls":12},"←軽微な変更に係る部分が構造に関係する場合、記入してください。"]
[]
[{"$nulls":7},"法適合\n確認者",null,"資格","(",null,")","建築士","（",null,"）","登録",null,"号"]
[{"$nulls":9},"構造・設備 設計一級建築士交付",{"$nulls":7},"第",null,"号",null,null,"←軽微な変更に係る部分が構造及び設備に関係する場合で、"]
[{"$nulls":9},"氏名",{"$nulls":12},"　建築士法第20条の２第３項もしくは第20条の３第３項の表示"]
[{"$nulls":22},"　（構造・設備の法適合確認）をしたとき記入してください。"]
[]
["施行規則第３条の２に該当する軽微な変更がありましたので、当該変更の内容を下記の通り説明します。\nこの説明書及び添付図書に記載の事項は、事実に相違ありません。"]
[]
["記"]
["確認番号",{"$nulls":3},"第",{"$nulls":4},{"$f":"IF(受付用!B9=\"\",\"\",受付用!B9)","v":""},{"$f":"IF(受付用!C9=\"\",\"\",受付用!C9)","v":""},{"$nulls":3},"号"]
["確認年月日",{"$nulls":5},"令和",null,"年",null,"月",null,"日"]
["軽微な変更の内容",null,"規則第3条の2\n該当項･号",null,null,"内容説明及び変更箇所"]
[]
[" ※右表｢規則第3条の2該当項･号｣欄には、変更内容が該当する条文を明記すること"]
{"$rows_empty":12}
["添付図書リスト"]
[]
[]
[]
[]
["注1","　変更箇所の分かる図書を添付してください。"]
[2,"　該当項･号欄は項目ごとに変更内容が施行規則第3条の2の何項何号に該当するかを明記してください。"]
[3,"　軽微な変更の内容は、項目ごとに内容説明及び変更箇所を明記してください。"]
[4,"　※欄には記入しないで下さい。"]
[5,"　軽微な変更の内容に関係する設計者は、設計者欄に記名してください。"]
[]
[]
[]
[]
[]
[]
[null,"一級"]
[null,"二級"]
[null,"木造"]
[null,"確認建機構ア"]
[null,"変認建機構ア"]
[null,2024]
[null,2025]
[null,"2026"]
[null,"2027"]

{"sheet":"計画変更一面","index":22,"n_rows":57,"n_cols":37,"rows_kept":57,"merged":[[13,23,13,24],[13,25,13,26],[13,34,13,35],[13,36,13,42],[16,18,16,29],[17,18,17,29],[20,18,20,29],[21,18,21,29],[25,10,25,11],[25,12,25,16],[25,18,25,19],[25,20,25,22],[26,9,26,10],[28,7,28,31],[29,2,29,31],[30,2,30,31],[41,0,41,2],[41,24,41,26],[53,1,53,4],[54,1,54,4],[55,1,55,4],[56,1,56,4]]}
["第四号様式（第一条の三、第三条、第三条の三関係）（Ａ４）"]
[{"$nulls":33},"シートの保護を解除すると編集が可能になります（パスワードなし）"]
[]
["計画変更確認申請書（建築物）",{"$nulls":32},"（注意）"]
[{"$nulls":33},"共通：　数字は算用数字を、単位はメートル法を用いてください。"]
["（第一面）",{"$nulls":32},"※印のある欄は記入しないでください。"]
[]
[]
["　建築基準法第６条第1項又は第６条の２第1項の規定による計画の変更の確認を申請します。　この申請書及"]
["び添付図書に記載の事項は、事実に相違ありません。"]
[]
["指定確認検査機関"]
["株式会社　確認検査機構アネックス  　様"]
[{"$nulls":23},"令和",{"$nulls":3},"年",null,"月",null,"日",null,null,"本日",null,{"$f":"TODAY()","v":"2025-04-09"}]
[]
[]
[]
[{"$nulls":13},"申請者氏名"]
[]
[]
[]
[{"$nulls":13},"設計者氏名"]
[]
[]
["【計画を変更する建築物の直前の確認】"]
[null,"【確認済証番号】",{"$nulls":7},"第",{"$nulls":7},{"$f":"IF(受付用!B9=\"\",\"\",受付用!B9)","v":""},{"$f":"IF(受付用!C9=\"\",\"\",受付用!C9)","v":""},{"$nulls":4},"号"]
[null,"【確認済証交付年月日】",{"$nulls":7},"令和",null,null,"年",null,"月",null,"日"]
[null,"【確認済証交付者】",{"$nulls":7},"　株式会社　確認検査機構アネックス"]
[null,"【計画変更の概要】"]
[]
[]
[]
["※","手数料欄"]
[]
[]
[]
["※受付欄",{"$nulls":7},"※消防関係同意欄",{"$nulls":7},"※決裁欄",{"$nulls":7},"※確認番号欄"]
[]
[]
[{"$f":"IF(X14=\"\",\"\",X14)","v":"令和"},null,null,"年",null,"月",null,"日",{"$nulls":16},{"$f":"IF(X14=\"\",\"\",X14)","v":"令和"},null,null,"年",null,"月",null,"日"]
["第",{"$nulls":5},"変申建機構ア",{"$f":"IF(受付用!B9=\"\",\"\",受付用!B9)","v":""},{"$nulls":16},"第",{"$nulls":5},"変認建機構ア",{"$f":"IF(受付用!B9=\"\",\"\",受付用!B9)","v":""}]
[{"$f":"IF(受付用!C9=\"\",\"\",受付用!C9)","v":""},{"$nulls":6},"号",{"$nulls":16},{"$f":"IF(受付用!C9=\"\",\"\",受付用!C9)","v":""},{"$nulls":6},"号"]
["係員氏名",{"$nulls":23},"係員氏名"]
{"$rows_empty":7}
[null,"入力規則"]
[null,"確認建機構ア"]
[null,"変認建機構ア"]
[null,2024,2023,2023,2023]
[null,2025,2024,2024,2024]
[null,"2026","2025","2025","2025"]
[null,"2027","2026","2026","2026"]

{"sheet":"選定届","index":23,"n_rows":66,"n_cols":37,"rows_kept":66,"merged":[[3,23,3,24],[3,25,3,26],[3,28,3,29],[3,31,3,32],[5,17,7,33],[6,1,6,6],[7,0,8,16],[8,25,8,33],[10,0,10,33],[11,0,11,6],[11,7,11,8],[11,9,11,10],[11,12,11,13],[11,15,11,16],[11,19,11,20],[11,21,11,25],[11,27,11,28],[11,29,11,31],[11,32,11,33],[12,0,12,6],[12,7,12,33],[13,0,20,6],[13,12,13,13],[13,19,13,22],[13,27,13,30],[14,12,14,33],[15,12,15,13],[15,19,15,22],[15,27,15,30],[16,12,16,33],[17,13,17,18],[18,12,18,33],[19,12,19,20],[20,14,20,33],[21,0,28,6],[21,12,21,13],[21,19,21,22],[21,27,21,30],[22,12,22,33],[23,12,23,13],[23,19,23,22],[23,27,23,30],[24,12,24,33],[25,13,25,18],[26,12,26,33],[27,12,27,20],[28,14,28,33],[29,0,34,6],[29,12,29,33],[30,16,30,19],[30,23,30,29],[31,12,31,33],[32,13,32,18],[33,12,33,33],[34,12,34,20],[35,0,37,6],[35,7,35,33],[36,7,36,33],[37,7,37,33],[49,1,49,4],[50,1,50,4],[51,1,51,4],[52,1,52,4]]}
["第十八号様式",{"$nulls":35},"シートの保護を解除すると編集が可能になります（パスワードなし）"]
["選　　定　　届"]
[]
["（あて先）株式会社確認検査機構アネックス",{"$nulls":22},"令和",{"$nulls":3},"年",null,null,"月",null,null,"日"]
["届出者の住所(建築主,設置者または築造主)",{"$nulls":16},"届出者の氏名(法人にあっては、名称及び代表者名）"]
["(法人にあっては、主たる事務所の所在地）"]
["〒"]
[]
[{"$nulls":24},"電話番号"]
[]
["工事施工者、工事監理者を定めましたので、\n株式会社確認検査機構アネックス確認検査業務規定第十五条の規定により届け出ます。"]
["確認済証交付年月日\n及び確認済証番号",{"$nulls":6},"令和",{"$nulls":3},"年",null,null,"月",null,null,"日","第",{"$nulls":7},{"$f":"IF(受付用!B9=\"\",\"\",受付用!B9)","v":""},{"$f":"IF(受付用!C9=\"\",\"\",受付用!C9)","v":""},{"$nulls":4},"号"]
["敷地の地名地番"]
["工　事　監　理　者\n（代表となる工事監理者）",{"$nulls":6},"【イ.資格】",{"$nulls":6},"建築士",{"$nulls":3},"（",{"$nulls":4},"）登録　　　　第",{"$nulls":7},"号"]
[{"$nulls":7},"【ロ.氏名 】"]
[{"$nulls":7},"【ハ.建築士事務所名】",{"$nulls":6},"建築士事務所",{"$nulls":3},"（",{"$nulls":4},"）知事登録　第",{"$nulls":7},"号"]
[]
[{"$nulls":7},"【ニ.郵便番号】",{"$nulls":4},"〒"]
[{"$nulls":7},"【ホ.所在地】"]
[{"$nulls":7},"【ヘ.電話番号】"]
[{"$nulls":7},"【ト.工事と照合した設計図書】"]
["工　事　監　理　者\n（その他の工事監理者）",{"$nulls":6},"【イ.資格】",{"$nulls":6},"建築士",{"$nulls":3},"（",{"$nulls":4},"）登録　　　　第",{"$nulls":7},"号"]
[{"$nulls":7},"【ロ.氏名 】"]
[{"$nulls":7},"【ハ.建築士事務所名】",{"$nulls":6},"建築士事務所",{"$nulls":3},"（",{"$nulls":4},"）知事登録　第",{"$nulls":7},"号"]
[]
[{"$nulls":7},"【ニ.郵便番号】",{"$nulls":4},"〒"]
[{"$nulls":7},"【ホ.所在地】"]
[{"$nulls":7},"【ヘ.電話番号】"]
[{"$nulls":7},"【ト.工事と照合した設計図書】"]
["工　事　施　工　者",{"$nulls":6},"【イ.氏名】"]
[{"$nulls":7},"【ロ.営業所名】",{"$nulls":7},"建設業の許可（",{"$nulls":4},"）",null,"第",{"$nulls":7},"号"]
[]
[{"$nulls":7},"【ハ.郵便番号】",{"$nulls":4},"〒"]
[{"$nulls":7},"【ニ.所在地】"]
[{"$nulls":7},"【ホ.電話番号】"]
["その他必要な事項"]
[]
[]
["注1.この届は、建築主、設置者又は築造主でなければできません。"]
["　2.工事監理者及び工事施工者は該当する欄のみ記入してください。（既に選定されている場合は記入不要）"]
[]
[]
[]
[]
[null,"確認建機構ア"]
[null,"変認建機構ア"]
[null,"一級"]
[null,"二級"]
[null,"木造"]
[null,2024,2023,2023,2023]
[null,2025,2024,2024,2024]
[null,"2026","2025","2025","2025"]
[null,"2027","2026","2026","2026"]
[]
[null,"大臣",{"$nulls":5},"滋賀県",null,null,"設計図書一式"]
[null,"○○県知事",{"$nulls":5},"京都府",null,null,"設計図書一式（構造図、構造計算書を除く）"]
[null,"滋賀県知事",{"$nulls":5},"大阪府",null,null,"構造図、構造計算書"]
[null,"京都府知事",{"$nulls":5},"奈良県"]
[null,"大阪府知事"]
[null,"奈良県知事"]
[null,"兵庫県知事"]
[null,"和歌山県知事"]
[null,"福井県知事"]
[null,"岐阜県知事"]
[null,"愛知県知事"]
[null,"三重県知事"]

{"sheet":"建築主等変更","index":24,"n_rows":93,"n_cols":37,"rows_kept":93,"merged":[[4,23,4,24],[4,25,4,26],[4,28,4,29],[4,31,4,32],[6,17,8,33],[7,1,7,6],[8,0,9,16],[9,25,9,33],[11,0,11,33],[12,0,13,6],[14,0,14,6],[14,7,14,8],[14,9,14,10],[14,12,14,13],[14,15,14,16],[14,19,14,20],[14,21,14,25],[14,27,14,28],[14,29,14,31],[14,32,14,33],[15,0,15,6],[15,7,15,33],[16,0,24,6],[16,7,19,9],[17,10,17,33],[18,25,18,33],[19,11,19,13],[19,14,19,33],[20,7,22,9],[21,10,21,11],[21,12,21,33],[22,10,22,33],[23,7,24,9],[23,25,23,33],[24,11,24,13],[24,14,24,33],[25,0,36,6],[25,7,30,9],[25,12,25,13],[26,11,26,13],[26,14,26,16],[26,17,26,19],[26,21,26,33],[27,12,27,13],[28,11,28,12],[28,17,28,19],[28,21,28,33],[29,25,29,33],[30,11,30,13],[30,14,30,33],[31,7,33,9],[31,12,31,13],[32,11,32,13],[32,14,32,16],[32,17,32,19],[32,21,32,33],[33,12,33,13],[34,7,35,9],[34,11,34,12],[34,17,34,19],[34,21,34,33],[35,25,35,33],[36,11,36,13],[36,14,36,33],[37,0,43,6],[37,7,42,9],[37,12,37,13],[38,11,38,13],[38,14,38,16],[38,17,38,19],[38,21,38,33],[39,12,39,13],[40,11,40,12],[40,17,40,19],[40,21,40,33],[41,25,41,33],[42,11,42,13],[42,14,42,33],[43,7,46,9],[43,12,43,13],[44,0,44,6],[44,11,44,13],[44,14,44,16],[44,17,44,19],[44,21,44,33],[45,12,45,13],[46,11,46,12],[46,17,46,19],[46,21,46,33],[47,7,48,9],[47,25,47,33],[48,11,48,13],[48,14,48,33],[49,17,49,33],[50,0,57,6],[50,7,53,9],[50,25,50,27],[50,29,50,32],[51,10,51,33],[52,25,52,33],[53,11,53,13],[53,14,53,33],[54,7,55,9],[54,25,54,27],[54,29,54,32],[55,10,55,33],[56,7,57,9],[56,25,56,33],[57,11,57,13],[57,14,57,33],[58,0,59,6],[58,7,58,33],[59,7,59,33],[89,1,89,4],[90,1,90,4],[91,1,91,4],[92,1,92,4]]}
[]
["第十九号様式",{"$nulls":35},"シートの保護を解除すると編集が可能になります（パスワードなし）"]
["建 築 主 等 変 更 届"]
[]
["（あて先）株式会社確認検査機構アネックス",{"$nulls":22},"令和",{"$nulls":3},"年",null,null,"月",null,null,"日"]
["届出者の住所(建築主,設置者または築造主)",{"$nulls":16},"届出者の氏名(法人にあっては、名称及び代表者名）"]
["(法人にあっては、主たる事務所の所在地）"]
["〒"]
[]
[{"$nulls":24},"電話番号"]
[]
["建築主等の変更が有りましたので、株式会社確認検査機構アネックス確認検査業務規定第十五条の規定により届け出ます。"]
["変更の種別",{"$nulls":6},"□","建築主",{"$nulls":3},"□","設置者",{"$nulls":3},"□","築造主",{"$nulls":3},"□","代理者",{"$nulls":3},"□","工事監理者"]
[{"$nulls":7},"□","工事施工者"]
["確認済証交付年月日\n及び確認済証番号",{"$nulls":6},"令和",{"$nulls":3},"年",null,null,"月",null,null,"日","第",{"$nulls":7},{"$f":"IF(受付用!B9=\"\",\"\",受付用!B9)","v":""},{"$f":"IF(受付用!C9=\"\",\"\",受付用!C9)","v":""},{"$nulls":4},"号"]
["敷地の地名地番"]
["建築主、設置者\n又は築造主",{"$nulls":6},"変更前",null,null,"氏名（法人にあっては、名称及び代表者名）"]
[]
[{"$nulls":10},"住所（法人にあっては、主たる事務所の所在地）",{"$nulls":11},"電話番号"]
[{"$nulls":10},"〒"]
[{"$nulls":7},"変更後",null,null,"氏名（法人にあっては、名称及び代表者名）"]
[{"$nulls":10},"ﾌﾘｶﾞﾅ"]
[]
[{"$nulls":10},"住所（法人にあっては、主たる事務所の所在地）",{"$nulls":11},"電話番号"]
[{"$nulls":10},"〒"]
["代　　理　　者",{"$nulls":6},"変更前",null,null,"資格",{"$nulls":3},"建築士",{"$nulls":6},"氏名"]
[{"$nulls":10},"（",{"$nulls":3},"）登録　第",{"$nulls":5},"号"]
[{"$nulls":10},"登録",{"$nulls":3},"建築士事務所",{"$nulls":6},"建築士事務所名"]
[{"$nulls":10},"（",null,null,"）知事登録　　第",{"$nulls":6},"号"]
[{"$nulls":10},"所在地",{"$nulls":11},"電話番号"]
[{"$nulls":10},"〒"]
[{"$nulls":7},"変更後",null,null,"資格",{"$nulls":3},"建築士",{"$nulls":6},"氏名"]
[{"$nulls":10},"（",{"$nulls":3},"）登録　第",{"$nulls":5},"号"]
[{"$nulls":10},"登録",{"$nulls":3},"建築士事務所",{"$nulls":6},"建築士事務所名"]
[{"$nulls":10},"（",null,null,"）知事登録　　第",{"$nulls":6},"号"]
[{"$nulls":10},"所在地",{"$nulls":11},"電話番号"]
[{"$nulls":10},"〒"]
["工　事　監　理　者",{"$nulls":6},"変更前",null,null,"資格",{"$nulls":3},"建築士",{"$nulls":6},"氏名"]
[{"$nulls":10},"（",{"$nulls":3},"）登録　第",{"$nulls":5},"号"]
[{"$nulls":10},"登録",{"$nulls":3},"建築士事務所",{"$nulls":6},"建築士事務所名"]
[{"$nulls":10},"（",null,null,"）知事登録　　第",{"$nulls":6},"号"]
[{"$nulls":10},"所在地",{"$nulls":11},"電話番号"]
[{"$nulls":10},"〒"]
[{"$nulls":7},"変更後",null,null,"資格",{"$nulls":3},"建築士",{"$nulls":6},"氏名"]
[{"$nulls":10},"（",{"$nulls":3},"）登録　第",{"$nulls":5},"号",{"$nulls":15},"変更することにより構造や設備等の監理者が不在になるということがないようにご注意ください。"]
[{"$nulls":10},"登録",{"$nulls":3},"建築士事務所",{"$nulls":6},"建築士事務所名"]
[{"$nulls":10},"（",null,null,"）知事登録　　第",{"$nulls":6},"号"]
[{"$nulls":10},"所在地",{"$nulls":11},"電話番号"]
[{"$nulls":10},"〒"]
[{"$nulls":10},"工事と照合する設計図書："]
["工　事　施　工　者",{"$nulls":6},"変更前",null,null,"氏名（法人にあっては、名称及び代表者名）",{"$nulls":13},"建設業の許可（",{"$nulls":3},"）第",{"$nulls":4},"号"]
[]
[{"$nulls":10},"住所（法人にあっては、主たる事務所の所在地）",{"$nulls":11},"電話番号"]
[{"$nulls":10},"〒"]
[{"$nulls":7},"変更後",null,null,"氏名（法人にあっては、名称及び代表者名）",{"$nulls":13},"建設業の許可（",{"$nulls":3},"）第",{"$nulls":4},"号"]
[]
[{"$nulls":10},"住所（法人にあっては、主たる事務所の所在地）",{"$nulls":11},"電話番号"]
[{"$nulls":10},"〒"]
["備　　　　　　考"]
[]
["注1　この届は、建築主、設置者又は築造主でなければできません。"]
["　2　該当する□には、レ印を記入してください。"]
["　3　届出には変更される確認済証・副本・変更後の概要書（第一面）を提出して下さい。"]
["　4　代理者及び建築主に変更が有る場合は新たに委任状を添付してください。"]
[]
[]
[]
[]
[]
[null,"□"]
[null,"■"]
[]
[null,"確認建機構ア",{"$nulls":5},"一級",{"$nulls":5},"（代表となる工事監理者）",{"$nulls":8},"設計図書一式"]
[null,"変認建機構ア",{"$nulls":5},"二級",{"$nulls":5},"（その他の工事監理者）",{"$nulls":8},"設計図書一式（構造図、構造計算書を除く）"]
[{"$nulls":7},"木造",{"$nulls":14},"構造図、構造計算書"]
[{"$nulls":13},"（建築主\n追加）"]
[{"$nulls":7},"大臣",{"$nulls":5},"（代理者\n追加）"]
[{"$nulls":7},"滋賀県知事",{"$nulls":5},"（工事監理者追加）"]
[{"$nulls":7},"京都府知事",{"$nulls":5},"（工事施工者追加）"]
[{"$nulls":7},"大阪府知事"]
[{"$nulls":7},"奈良県知事"]
[{"$nulls":7},"○○県知事"]
[]
[{"$nulls":7},"滋賀県"]
[{"$nulls":7},"京都府"]
[{"$nulls":7},"大阪府"]
[{"$nulls":7},"奈良県"]
[{"$nulls":7},"○○県"]
[]
[null,2024,2023,2023,2023]
[null,2025,2024,2024,2024]
[null,"2026","2025","2025","2025"]
[null,"2027","2026","2026","2026"]

{"sheet":"中間一面","index":25,"n_rows":56,"n_cols":34,"rows_kept":56,"merged":[[2,0,2,2],[15,23,15,24],[15,25,15,26],[17,18,17,29],[18,18,18,29],[22,18,22,29],[23,18,23,29],[39,0,39,1],[39,24,39,25],[41,0,41,2],[41,24,41,26]]}
["第二十六号様式（第四条の八、第四条の十一の二関係）（A4）"]
[{"$nulls":33},"シートの保護を解除すると編集が可能になります（パスワードなし）"]
[]
["中間検査申請書"]
[]
["（第一面）"]
[]
[]
["　建築基準法第７条の３第１項又は第７条の４第１項（これらの規定を同法第８７条の４又は第"]
["８８条第１項において準用する場合を含む。）の規定により、検査を申請します。この申請書及"]
["び添付図書に記載の事項は、事実に相違ありません。"]
[]
[]
["指定確認検査機関"]
["株式会社　確認検査機構アネックス  　様"]
[{"$nulls":23},"令和",{"$nulls":3},"年",null,"月",null,"日"]
[{"$nulls":33},"建築主等変更届の提出がないか確認してください"]
[]
[{"$nulls":13},"申請者氏名"]
[]
[]
["第四面に記載の事項は、事実に相違ありません。"]
[]
[{"$nulls":13},"工事監理者氏名"]
[]
[]
[null,null,"【検査を申請する建築物等】"]
[null,null,"■","建築物",{"$nulls":7},"□","建築設備（昇降機）",{"$nulls":9},"□","建築設備（昇降機以外）"]
[null,null,"□","工作物（昇降機）",{"$nulls":7},"□","工作物（法第８８条第１項）"]
[]
[]
["※","手数料欄"]
[]
[]
[]
[]
["※受付欄　　　　",{"$nulls":7},"※検査の特例欄",{"$nulls":4},"※検査欄",{"$nulls":5},"※決裁欄",{"$nulls":4},"※中間検査合格証欄"]
[]
[]
[{"$f":"IF(X16=\"\",\"\",X16)","v":"令和"},null,null,"年",null,"月",null,"日",{"$nulls":16},{"$f":"IF(X16=\"\",\"\",X16)","v":"令和"},null,null,"年",null,"月",null,"日"]
["第",{"$nulls":5},{"$f":"IF(C28=\"■\",\"中間建機構ア\",IF(L28=\"■\",\"中間昇機構ア\",IF(L29=\"■\",\"中間工機構ア\",\"中間　　機構ア\")))","v":"中間建機構ア"},{"$f":"IF(受付用!B11=\"\",\"\",受付用!B11)","v":""},{"$nulls":16},"第",{"$nulls":5},{"$f":"IF(C28=\"■\",\"中間建機構ア\",IF(L28=\"■\",\"中間昇機構ア\",IF(L29=\"■\",\"中間工機構ア\",\"中間　　機構ア\")))","v":"中間建機構ア"},{"$f":"IF(受付用!B11=\"\",\"\",受付用!B11)","v":""}]
[{"$f":"IF(受付用!C11=\"\",\"\",受付用!C11)","v":""},{"$nulls":6},"号","有　・　無",{"$nulls":15},{"$f":"IF(受付用!C11=\"\",\"\",受付用!C11)","v":""},{"$nulls":6},"号"]
["係員氏名",{"$nulls":23},"係員氏名"]
{"$rows_empty":7}
[null,"（注意）第一面"]
[null,null,"数字は算用数字を、単位はメートル法を用いてください。"]
[null,"①","「検査を申請する建築物等」の欄は、該当するチェックボックスに「レ」マークを入れてください。"]
[null,null,"建築基準法第88条第１項に規定する工作物のうち同法施行令第138条第２項第１号に掲げるものにあつ"]
[null,null,"ては、「工作物（昇降機）」のチェックボックスに「レ」マークを入れてください。"]
[null,"②","※印のある欄は記入しないでください。"]

{"sheet":"中間二面","index":26,"n_rows":175,"n_cols":35,"rows_kept":175,"merged":[[5,9,5,31],[6,9,6,31],[7,10,7,15],[8,9,8,31],[9,9,9,15],[13,10,13,11],[13,19,13,22],[13,27,13,30],[14,9,14,31],[15,10,15,11],[15,19,15,21],[15,27,15,30],[16,9,16,31],[17,10,17,15],[18,9,18,31],[19,9,19,15],[24,10,24,11],[24,19,24,22],[24,27,24,30],[25,9,25,31],[26,10,26,11],[26,19,26,21],[26,27,26,30],[27,9,27,31],[28,10,28,15],[29,9,29,31],[30,9,30,15],[31,9,31,31],[34,10,34,11],[34,19,34,22],[34,27,34,30],[35,9,35,31],[36,10,36,11],[36,19,36,21],[36,27,36,30],[37,9,37,31],[38,10,38,15],[39,9,39,31],[40,9,40,15],[41,9,41,31],[43,10,43,11],[43,19,43,22],[43,27,43,30],[44,9,44,31],[45,10,45,11],[45,19,45,21],[45,27,45,30],[46,9,46,31],[47,10,47,15],[48,9,48,31],[49,9,49,15],[50,9,50,31],[52,10,52,11],[52,19,52,22],[52,27,52,30],[53,9,53,31],[54,10,54,11],[54,19,54,21],[54,27,54,30],[55,9,55,31],[56,10,56,15],[57,9,57,31],[58,9,58,15],[59,9,59,31],[64,10,64,11],[64,19,64,22],[64,27,64,30],[65,9,65,31],[66,10,66,11],[66,19,66,21],[66,27,66,30],[67,9,67,31],[68,10,68,15],[69,9,69,31],[70,9,70,15],[71,11,71,31],[74,10,74,11],[74,19,74,22],[74,27,74,30],[75,9,75,31],[76,10,76,11],[76,19,76,21],[76,27,76,30],[77,9,77,31],[78,10,78,15],[79,9,79,31],[80,9,80,15],[81,11,81,31],[83,10,83,11],[83,19,83,22],[83,27,83,30],[84,9,84,31],[85,10,85,11],[85,19,85,21],[85,27,85,30],[86,9,86,31],[87,10,87,15],[88,9,88,31],[89,9,89,15],[90,11,90,31],[92,10,92,11],[92,19,92,22],[92,27,92,30],[93,9,93,31],[94,10,94,11],[94,19,94,21],[94,27,94,30],[95,9,95,31],[96,10,96,15],[97,9,97,31],[98,9,98,15],[99,11,99,31],[104,7,104,31],[105,7,105,31],[106,8,106,13],[107,7,107,31],[108,7,108,13],[109,7,109,13],[110,11,110,31],[113,7,113,31],[114,7,114,31],[115,8,115,13],[116,7,116,31],[117,7,117,13],[118,7,118,13],[119,11,119,31],[121,7,121,31],[122,7,122,31],[123,8,123,13],[124,7,124,31],[125,7,125,13],[126,7,126,13],[127,11,127,31],[129,7,129,31],[130,7,130,31],[131,8,131,13],[132,7,132,31],[133,7,133,13],[134,7,134,13],[135,11,135,31],[139,7,139,31],[140,13,140,16],[140,19,140,25],[141,7,141,31],[142,8,142,13],[143,7,143,31],[144,7,144,13],[147,4,147,31],[148,4,148,31],[149,4,149,31],[150,4,150,31]]}
["建築主等変更届、選定届の提出により確認申請書から記載に変更がないか確認してください。"]
["（第二面）"]
[null,"建築主、設置者又は築造主等の概要",{"$nulls":31},"シートの保護を解除すると編集が可能になります（パスワードなし）"]
[]
["【1.建築主、設置者又は築造主】"]
[null,"【イ.氏名のフリガナ】"]
[null,"【ロ.氏名】"]
[null,"【ハ.郵便番号】",{"$nulls":7},"〒"]
[null,"【ニ.住所】"]
[null,"【ホ.電話番号】"]
[]
[]
["【2.代理者】"]
[null,"【イ.資格】",{"$nulls":7},"（",null,null,"）","建築士",{"$nulls":4},"（",{"$nulls":4},"）","登録",null,"第",{"$nulls":4},"号"]
[null,"【ロ.氏名】"]
[null,"【ハ.建築士事務所名】",{"$nulls":7},"（",null,null,"）","建築士事務所",{"$nulls":4},"（",{"$nulls":3},"）","知事登録第",{"$nulls":7},"号"]
[]
[null,"【ニ.郵便番号】",{"$nulls":7},"〒"]
[null,"【ホ.所在地】"]
[null,"【へ.電話番号】"]
[]
[]
["【3.設計者】"]
[null,"(代表となる設計者)"]
[null,"【イ.資格】",{"$nulls":7},"（",null,null,"）","建築士",{"$nulls":4},"（",{"$nulls":4},"）","登録",null,"第",{"$nulls":4},"号"]
[null,"【ロ.氏名】"]
[null,"【ハ.建築士事務所名】",{"$nulls":7},"（",null,null,"）","建築士事務所",{"$nulls":4},"（",{"$nulls":3},"）","知事登録第",{"$nulls":7},"号"]
[]
[null,"【ニ.郵便番号】",{"$nulls":7},"〒"]
[null,"【ホ.所在地】"]
[null,"【へ.電話番号】"]
[null,"【ト.作成した設計図書】"]
[]
[null,"(その他の設計者)"]
[null,"【イ.資格】",{"$nulls":7},"（",null,null,"）","建築士",{"$nulls":4},"（",{"$nulls":4},"）","登録",null,"第",{"$nulls":4},"号"]
[null,"【ロ.氏名】"]
[null,"【ハ.建築士事務所名】",{"$nulls":7},"（",null,null,"）","建築士事務所",{"$nulls":4},"（",{"$nulls":3},"）","知事登録第",{"$nulls":7},"号"]
[]
[null,"【ニ.郵便番号】",{"$nulls":7},{"$f":"IF(K39=\"\",\"\",\"〒\")","v":""}]
[null,"【ホ.所在地】"]
[null,"【へ.電話番号】"]
[null,"【ト.作成した設計図書】"]
[]
[null,"【イ.資格】",{"$nulls":7},"（",null,null,"）","建築士",{"$nulls":4},"（",{"$nulls":4},"）","登録",null,"第",{"$nulls":4},"号"]
[null,"【ロ.氏名】"]
[null,"【ハ.建築士事務所名】",{"$nulls":7},"（",null,null,"）","建築士事務所",{"$nulls":4},"（",{"$nulls":3},"）","知事登録第",{"$nulls":7},"号"]
[]
[null,"【ニ.郵便番号】",{"$nulls":7},{"$f":"IF(K48=\"\",\"\",\"〒\")","v":""}]
[null,"【ホ.所在地】"]
[null,"【へ.電話番号】"]
[null,"【ト.作成した設計図書】"]
[]
[null,"【イ.資格】",{"$nulls":7},"（",null,null,"）","建築士",{"$nulls":4},"（",{"$nulls":4},"）","登録",null,"第",{"$nulls":4},"号"]
[null,"【ロ.氏名】"]
[null,"【ハ.建築士事務所名】",{"$nulls":7},"（",null,null,"）","建築士事務所",{"$nulls":4},"（",{"$nulls":3},"）","知事登録第",{"$nulls":7},"号"]
[]
[null,"【ニ.郵便番号】",{"$nulls":7},{"$f":"IF(K57=\"\",\"\",\"〒\")","v":""}]
[null,"【ホ.所在地】"]
[null,"【へ.電話番号】"]
[null,"【ト.作成した設計図書】"]
[]
[]
["【4.工事監理者】"]
[null,"(代表となる工事監理者)"]
[null,"【イ.資格】",{"$nulls":7},"（",null,null,"）","建築士",{"$nulls":4},"（",{"$nulls":4},"）","登録",null,"第",{"$nulls":4},"号"]
[null,"【ロ.氏名】"]
[null,"【ハ.建築士事務所名】",{"$nulls":7},"（",null,null,"）","建築士事務所",{"$nulls":4},"（",{"$nulls":3},"）","知事登録第",{"$nulls":7},"号"]
[]
[null,"【ニ.郵便番号】",{"$nulls":7},"〒"]
[null,"【ホ.所在地】"]
[null,"【へ.電話番号】"]
[null,"【ト.工事と照合した設計図書】"]
[]
[null,"(その他の工事監理者)"]
[null,"【イ.資格】",{"$nulls":7},"（",null,null,"）","建築士",{"$nulls":4},"（",{"$nulls":4},"）","登録",null,"第",{"$nulls":4},"号"]
[null,"【ロ.氏名】"]
[null,"【ハ.建築士事務所名】",{"$nulls":7},"（",null,null,"）","建築士事務所",{"$nulls":4},"（",{"$nulls":3},"）","知事登録第",{"$nulls":7},"号"]
[]
[null,"【ニ.郵便番号】",{"$nulls":7},{"$f":"IF(K79=\"\",\"\",\"〒\")","v":""}]
[null,"【ホ.所在地】"]
[null,"【へ.電話番号】"]
[null,"【ト.工事と照合した設計図書】"]
[]
[null,"【イ.資格】",{"$nulls":7},"（",null,null,"）","建築士",{"$nulls":4},"（",{"$nulls":4},"）","登録",null,"第",{"$nulls":4},"号"]
[null,"【ロ.氏名】"]
[null,"【ハ.建築士事務所名】",{"$nulls":7},"（",null,null,"）","建築士事務所",{"$nulls":4},"（",{"$nulls":3},"）","知事登録第",{"$nulls":7},"号"]
[]
[null,"【ニ.郵便番号】",{"$nulls":7},{"$f":"IF(K88=\"\",\"\",\"〒\")","v":""}]
[null,"【ホ.所在地】"]
[null,"【へ.電話番号】"]
[null,"【ト.工事と照合した設計図書】"]
[]
[null,"【イ.資格】",{"$nulls":7},"（",null,null,"）","建築士",{"$nulls":4},"（",{"$nulls":4},"）","登録",null,"第",{"$nulls":4},"号"]
[null,"【ロ.氏名】"]
[null,"【ハ.建築士事務所名】",{"$nulls":7},"（",null,null,"）","建築士事務所",{"$nulls":4},"（",{"$nulls":3},"）","知事登録第",{"$nulls":7},"号"]
[]
[null,"【ニ.郵便番号】",{"$nulls":7},{"$f":"IF(K97=\"\",\"\",\"〒\")","v":""}]
[null,"【ホ.所在地】"]
[null,"【へ.電話番号】"]
[null,"【ト.工事と照合した設計図書】"]
[]
[]
["【5.建築設備の設計に関し意見を聴いた者】"]
[null,"(代表となる建築設備の工事監理に関し意見を聴いた者)"]
[null,"【イ.氏名】"]
[null,"【ロ.勤務先】"]
[null,"【ハ.郵便番号】",{"$nulls":5},{"$f":"IF(I107=\"\",\"\",\"〒\")","v":""}]
[null,"【ニ.所在地】"]
[null,"【ホ.電話番号】"]
[null,"【ヘ.登録番号】"]
[null,"【ト.意見を聴いた設計図書】"]
[]
[null,"(その他の建築設備の工事監理に関し意見を聴いた者)"]
[null,"【イ.氏名】"]
[null,"【ロ.勤務先】"]
[null,"【ハ.郵便番号】",{"$nulls":5},{"$f":"IF(I116=\"\",\"\",\"〒\")","v":""}]
[null,"【ニ.所在地】"]
[null,"【ホ.電話番号】"]
[null,"【ヘ.登録番号】"]
[null,"【ト.意見を聴いた設計図書】"]
[]
[null,"【イ.氏名】"]
[null,"【ロ.勤務先】"]
[null,"【ハ.郵便番号】",{"$nulls":5},{"$f":"IF(I124=\"\",\"\",\"〒\")","v":""}]
[null,"【ニ.所在地】"]
[null,"【ホ.電話番号】"]
[null,"【ヘ.登録番号】"]
[null,"【ト.意見を聴いた設計図書】"]
[]
[null,"【イ.氏名】"]
[null,"【ロ.勤務先】"]
[null,"【ハ.郵便番号】",{"$nulls":5},{"$f":"IF(I132=\"\",\"\",\"〒\")","v":""}]
[null,"【ニ.所在地】"]
[null,"【ホ.電話番号】"]
[null,"【ヘ.登録番号】"]
[null,"【ト.意見を聴いた設計図書】"]
[]
[]
["【6.工事施工者】"]
[null,"【イ.氏名】"]
[null,"【ロ.営業所名】",{"$nulls":5},"建設業の許可",{"$nulls":4},"（",{"$nulls":4},"）","第",{"$nulls":7},"号"]
[]
[null,"【ハ.郵便番号】",{"$nulls":5},"〒"]
[null,"【ニ.所在地】"]
[null,"【ホ.電話番号】"]
[]
[]
["【7.備考】"]
[]
[{"$nulls":33},"←","建築物の名称又は工事名(フリガナ）"]
[{"$nulls":33},"←","建築物の名称又は工事名"]
[]
[]
[]
[]
[null,"（注意）第二面"]
[null,null,"数字は算用数字を、単位はメートル法を用いてください。"]
[null,"①","建築主、設置者又は築造主が２以上のときは、１欄は代表となる建築主、設置者又は築造主について"]
[null,null,"記入し、別紙に他の建築主、設置者又は築造主についてそれぞれ必要な事項を記入して添えてください。"]
[null,"②","建築主、設置者又は築造主からの委任を受けて申請を行う者がいる場合においては、２欄に記入して"]
[null,null,"ください。"]
[null,"③","２欄、３欄及び５欄は、代理者、設計者又は工事監理者が建築士事務所に属しているときは、その名"]
[null,null,"称を書き、建築士事務所に属していないときは、所在地はそれぞれ代理者、設計者又は工事監理者の住"]
[null,null,"所を書いてください。"]
[null,"④","３欄、４欄及び５欄は、それぞれ代表となる設計者、工事監理者及び建築設備の工事監理に関し意見"]
[null,null,"を聴いた者並びに申請に係る建築物に係る他のすべての設計者、工事監理者及び建築設備の工事監理に"]
[null,null,"関し意見を聴いた者について記入してください。記入欄が不足する場合には、別紙に必要な事項を記入"]
[null,null,"して添えてください。"]
[null,"⑤","５欄は、建築士法第20条第５項に規定する場合（工事監理に係る場合に限る。）に、同項に定める資"]
[null,null,"格を有する者について記入し、所在地は、その者が勤務しているときは勤務先の所在地を、勤務してい"]
[null,null,"ないときはその者の住所を登録番号は建築士法施行規則（昭和25年建設省令第38号）第17条の35第"]
[null,null,"１項の規定による登録を受けている場合の当該登録番号を書いてください。"]
[null,"⑥","６欄は、工事施工者が２以上のときは、代表となる工事施工者について記入し、別紙に他の工事施工者"]
[null,null,"について棟別にそれぞれ必要な事項を記入して添えてください。"]
[null,"⑦","建築物又は工作物の名称又は工事名が定まつているときは、７欄に記入してください。"]

{"sheet":"中間三面","index":27,"n_rows":65,"n_cols":65,"rows_kept":65,"merged":[[3,7,3,32],[4,7,4,32],[6,22,6,27],[9,22,9,31],[10,12,10,13],[10,14,10,17],[10,19,10,20],[10,21,10,23],[11,13,11,14],[11,15,11,16],[11,18,11,19],[11,21,11,22],[12,10,12,29],[13,13,13,14],[13,15,13,16],[13,18,13,19],[13,21,13,22],[14,13,14,14],[14,15,14,16],[14,18,14,19],[14,21,14,22],[16,12,16,31],[17,13,17,14],[17,15,17,16],[17,18,17,19],[17,21,17,22],[18,13,18,22],[19,14,19,19],[19,24,19,29],[20,13,20,20],[20,23,20,30],[21,13,21,20],[21,23,21,30],[22,13,22,20],[22,23,22,30],[23,13,23,14],[23,23,23,24],[24,14,24,19],[24,24,24,29],[25,13,25,20],[25,23,25,30],[26,13,26,14],[26,23,26,24],[28,11,28,32],[29,6,29,32],[30,1,30,32],[31,1,31,32],[32,1,32,32],[33,1,33,32],[34,1,34,32],[35,1,35,32],[37,1,37,32],[38,1,38,32],[39,1,39,32],[40,1,40,32],[44,37,44,40],[45,37,45,40],[46,37,46,40],[47,37,47,40]]}
["第三面"]
[null,"申請する工事の概要",{"$nulls":32},"シートの保護を解除すると編集が可能になります（パスワードなし）"]
["【1.建築場所、設置場所又は築造場所】",{"$nulls":63},"確認建機構ア"]
[null,"【イ.地名地番】",{"$nulls":62},"変認建機構ア"]
[null,"【ロ.住居表示】",{"$nulls":62},"㈱確認検査機構アネックス"]
["【2.工事種別】",{"$nulls":63},"第○○中間建機構ア○○○"]
[null,"【イ.建築基準法施行令第１０条各号に掲げる建築物の区分】",{"$nulls":19},"第",{"$nulls":6},"号",{"$nulls":35},1]
[null,"【ロ.工事種別】",{"$nulls":5},"□","新築",{"$nulls":5},"□","増築",{"$nulls":5},"□","改築",{"$nulls":5},"□","移転",{"$nulls":34},2]
[{"$nulls":7},"□","大規模の修繕",{"$nulls":5},"□","大規模の模様替",{"$nulls":5},"□","建築設備の設置",{"$nulls":41},3]
[null,"【ハ.建築基準法第68条の20第2項の検査の特例に係る認証番号】",{"$nulls":62},4]
["【3.確認済証番号】",{"$nulls":10},"第",{"$nulls":6},{"$f":"IF(受付用!B11=\"\",\"\",受付用!B11)","v":""},{"$f":"IF(受付用!C11=\"\",\"\",受付用!C11)","v":""},{"$nulls":4},"号"]
["【4.確認済証交付年月日】",{"$nulls":12},"令和",{"$nulls":3},"年",null,null,"月",null,null,"日"]
["【5.確認済証交付者】",{"$nulls":9}," 　　　　株式会社確認検査機構アネックス"]
["【6.工事着手年月日】",{"$nulls":12},"令和",{"$nulls":3},"年",null,null,"月",null,null,"日",{"$nulls":13},"●滋賀県●"]
["【7.工事完了予定年月日】",{"$nulls":12},"令和",{"$nulls":3},"年",null,null,"月",null,null,"日",{"$nulls":13},"土台、柱、はりおよび筋かいを金物等により接合する工事の工程"]
["【8.特定工程】",{"$nulls":36},"壁を設置する工事の工程"]
[null,"【イ.特定工程】",{"$nulls":35},"鉄骨の軸組を溶接し、またはボルト等により接合する工事(建て方)の工程"]
[null,"【ロ.特定工程工事終了（予定）年月日】",{"$nulls":11},"令和",{"$nulls":3},"年",null,null,"月",null,null,"日",{"$nulls":13},"2階の床版の取り付けまたは床版の鉄筋を配置する工事の工程"]
[null,"【ハ.検査対象床面積】",{"$nulls":21},"㎡",{"$nulls":13},"基礎および地中梁に鉄筋を配置する工事の工程"]
["【9.今回申請以前の中間検査】",{"$nulls":11},"（第",{"$nulls":7},"回","）","（第",{"$nulls":7},"回","）",{"$nulls":5},"2階の床およびこれを支持する梁に鉄筋を配置する工事の工程"]
[null,"【イ.特定工程】",{"$nulls":10},"（",{"$nulls":8},"）","（",{"$nulls":8},"）",{"$nulls":5},"●京都市●特殊な構造の場合は名称が異なりますのでご注意ください。"]
[null,"【ロ.中間検査合格証交付者】 ",{"$nulls":10},"（",{"$nulls":8},"）","（",{"$nulls":8},"）",{"$nulls":5},"地中はりの鉄筋を配置する工事の工程"]
[null,"【ハ.中間検査合格証番号】",{"$nulls":10},"（",{"$nulls":8},"）","（",{"$nulls":8},"）",{"$nulls":5},"構造耐力上主要な部分である壁、柱、横架材、筋かい及び木板その他これに類するものの仕口、継手を金物等により接合する工事の工程"]
[null,"【ニ.交付年月日】　",{"$nulls":10},"（","令和",null,null,"年",null,"月",null,"日","）","（","令和",null,null,"年",null,"月",null,"日","）",{"$nulls":5},"耐力壁、小屋ばり組及び屋根版を設置する工事の工程"]
["【10.今回申請以降の中間検査】",{"$nulls":11},"（第",{"$nulls":7},"回","）","（第",{"$nulls":7},"回","）",{"$nulls":5},"軸組、床組及び小屋ばり組をボルト等により接合、また溶接する工事の工程"]
[null,"【イ.特定工程】",{"$nulls":10},"（",{"$nulls":8},"）","（",{"$nulls":8},"）",{"$nulls":5},"２階の床（平家にあっては屋根）及びこれを支持するはりに鉄筋を配置する工事の工程"]
[null,"【ロ.特定工程工事終了予定年月日】",{"$nulls":10},"（","令和",null,null,"年",null,"月",null,"日","）","（","令和",null,null,"年",null,"月",null,"日","）",{"$nulls":5},"2階の床及びこれを支持するはりに鉄筋を配置する工事の工程"]
["【11.確認以降の軽微な変更の概要】",{"$nulls":36},"●京都府●"]
[null,"【イ.変更された設計図書の種類】",{"$nulls":35},"木造の軸組を金物等により接合する工事の工程"]
[null,"【ロ.変更の概要】",{"$nulls":35},"耐力壁の設置工事の工程"]
[{"$nulls":37},"２階の床及びこれを支持するはりの配筋工事の工程"]
[{"$nulls":37},"２階のはり及び床版の取付け工事の工程"]
[{"$nulls":37},"屋根床版の配筋工事又は建方工事の工程"]
[{"$nulls":37},"●宇治市●　★★木造の軸組については京都府の欄をご利用ください★★"]
[{"$nulls":37},"木造の軸組を金物等により接合する工事の工程"]
[{"$nulls":37},"木材で組まれた枠組を設置する工事の工程"]
["【12.備考】",{"$nulls":36},"2階の床の配筋工事の工程"]
[{"$nulls":37},"2階のはりおよび床版の取付け工事の工程"]
[{"$nulls":37},"屋根床版の配筋工事または建方工事の工程"]
[{"$nulls":37},"●大阪府・奈良県は直接入力してください●"]
[]
[]
[]
[null,"（注意）第一面"]
[null,null,"数字は算用数字を、単位はメートル法を用いてください。",{"$nulls":34},2024,2023,2023,2023]
[null,"①","住居表示が定まつているときは、１欄の「ロ」に記入してください。",{"$nulls":34},2025,2024,2024,2024]
[null,"②","２欄の「イ」は、建築物が建築基準法施行令第10条各号に掲げる建築物に該当する場合に、当該各号",{"$nulls":34},"2026","2025","2025","2025"]
[null,null,"の数字を記入してください。",{"$nulls":34},"2027","2026","2026","2026"]
[null,"③","２欄の「ロ」は、該当するチェックボックスに「レ」マークを入れてください。"]
[null,"④","２欄の「ハ」は、認証型式部材等製造者が製造をした当該認証に係る型式部材等を有する場合に、その"]
[null,null,"認証番号を記載してください。"]
[null,"⑤","３欄、４欄及び５欄は、計画変更の確認を受けている場合は直前の計画変更の確認について記載して"]
[null,null,"ください。"]
[null,"⑥","８欄の「ハ」は、検査対象となる部分の床面積の合計に相当する面積を記入してください。"]
[null,"⑦","９欄及び10欄は、記入欄が不足する場合には、別紙に必要な事項を記入して添えてください。"]
[null,"⑧","11欄は、軽微な設計変更が２以上あるときは、その一について記入し、別紙にその他の軽微な設計変"]
[null,null,"更について、必要な事項を記入して添えてください。"]
[null,"⑨","11欄の「ロ」は、変更の内容、変更の理由等の概要を記入してください。"]
[null,"⑩","11欄は、既に中間検査を受けたものにあつては、この申請を直前の中間検査を申請した建築主事に対"]
[null,null,"して行う場合には、確認から直前の中間検査までに生じた軽微な設計変更の概要について記入する必要"]
[null,null,"はありません。また、それ以外の場合で、確認から直前の中間検査までに生じた軽微な設計変更の概要"]
[null,null,"についてこの欄に記載すべき事項を記載した書類を別に添付すれば、その部分について記入する必要は"]
[null,null,"ありません。"]
[null,"⑪","11欄は、申請建築物について変更後も建築物の計画が建築基準関係規定に適合することが明らかなこ"]
[null,null,"とが確かめられた旨の図書を添えてください。"]

{"sheet":"中間四面","index":28,"n_rows":50,"n_cols":9,"rows_kept":50,"merged":[[3,0,4,0],[3,1,4,1],[3,2,4,2],[3,3,4,3],[3,4,4,4],[3,5,4,5],[3,7,4,7],[16,1,16,6]]}
["（第四面）"]
["工事監理の状況",{"$nulls":7},"シートの保護を解除すると編集が可能になります（パスワードなし）"]
[]
[null,"確認を行つた部位、材料の種類等","照合内容","照合を行つた設計図書","設計図書の内容について設計者に確認した事項","照合方法","照合結果"]
[{"$nulls":6},"（不適の場合には建築主に対して行った報告の内容）"]
["敷地の形状、高さ、衛生及び安全"]
["主要構造部及び主要構造部以外の構造耐力上主要な部分に用いる材料（接合材料を含む。）の種類、品質、形状及び寸法"]
["主要構造部及び主要構造部以外の構造耐力上主要な部分に用いる材料の接合状況、接合部分の形状等"]
["建築物の各部分の位置、形状及び大きさ"]
["構造耐力上主要な部分の防錆、防腐及び防蟻措置及び状況"]
["特定天井に用いる材料の種類並びに当該特定天井の構造及び施工状況"]
["居室の内装仕上げに用いる建築材料の種別及び当該材料を用いる部分の面積"]
["天井及び壁の室内に面する部分に係る仕上げの材料の種別及び厚さ"]
["開口部に設ける建具の種類及び大きさ"]
["建築設備に用いる材料の種類並びにその照合した内容、構造及び施工状況（区画貫通部の処理状況を含む。）"]
["備         考\n（住宅用防災機器）\n(省エネ基準に係る状況)"]
["備         考\n"]
[]
[]
["（注意）第一面"]
[null,"数字は算用数字を、単位はメートル法を用いてください。"]
["①","申請建築物（建築基準法第７条の５及び第68条の20第２項（建築物である認証型式部材等に係る場合"]
[null,"に限る。）の適用を受けず、かつ、建築士法第３条から第３条の３までの規定に含まれないものを除く。"]
[null,"以下同じ。）に関する当該特定工程に係る工事までの工事監理の状況について記載してください。ただし、"]
[null,"既に中間検査を受けたものにあつては、この申請を直前の中間検査を申請した建築主事に対して行う場合"]
[null,"には、確認から直前の中間検査までの工事監理の状況について記入する必要はありません。また、それ以"]
[null,"外の場合で、確認から直前の中間検査までの工事監理の状況についてこの書類に記載すべき事項を記載し"]
[null,"た書類を別に添付すれば、その部分について記入する必要はありません。"]
["②","申請建築物が複数の構造方法からなる場合には、それぞれの構造の部分ごとに記載してください。"]
["③","接合状況のうち、鋼材等の金属材料の溶接又は圧接部分に係る内部欠陥の検査、強度検査等の確認につ"]
[null,"いては、当該部分に係る検査を行つた者の氏名及び資格並びに当該検査に係るサンプル数及びその結果を"]
[null,"記載してください。"]
["④","材料のうち、コンクリートについては、四週圧縮強度、塩化物量、アルカリ骨材反応等の試験又は検査"]
[null,"（以下「試験等」という。）を行つた者、試験等に係るサンプル数及び試験等の結果について記載してく"]
[null,"ださい。"]
["⑤","「特定天井に用いる材料の種類並びに当該特定天井の構造及び施工状況」は、建築基準法施行令第39"]
[null,"条第３項、第81条第１項第３号、第82条の５第７号又は第137条の２第１号イ(3)の規定の適用を受ける"]
[null,"部分について記載してください。"]
["⑥","「居室の内装の仕上げに用いる建築材料の種別及び当該建築材料を用いる部分の面積」は、建築基準法"]
[null,"施行令第20条の７第１項第１号に規定する内装の仕上げに用いる建築材料の種別並びに当該建築材料を"]
[null,"用いる内装の仕上げの部分及び当該部分の面積について記載してください。"]
["⑦","「天井及び壁の室内に面する部分に係る仕上げ」は、建築基準法第35条の２の規定の適用を受ける部"]
[null,"分について記載してください。"]
["⑧","「開口部」は、防火設備の設置が義務付けられている部分、建築基準法第28条第１項の規定の適用を"]
[null,"受ける部分及び同法第35条の適用を受ける部分について記載してください。"]
["⑨","「照合結果」は、「適」・「不適」のいずれかを記入し、工事施工者が注意に従わなかつた場合には「不"]
[null,"適」を記入してください。また、不適の場合には建築主に対して行つた報告の内容を記載してください。"]
["⑩","ここに書き表せない事項で特に報告すべき事項は、備考欄又は別紙に記載して添えてください。"]
["⑪","この書類に記載すべき事項を含む報告書を別に添付すれば、この書類を別途提出する必要はありませ"]
[null,"ん。"]

{"sheet":"中間ﾁｪｯｸA表","index":29,"n_rows":77,"n_cols":62,"rows_kept":77,"merged":[[14,1,14,56],[15,1,16,34],[15,35,16,56],[15,59,15,68],[17,1,17,56],[17,60,17,68],[18,1,18,2],[18,3,18,10],[18,11,18,12],[18,13,18,15],[18,16,18,21],[18,22,18,23],[18,24,18,26],[18,27,18,29],[18,30,18,31],[18,32,18,41],[18,42,18,44],[18,45,18,46],[18,47,18,48],[18,49,18,50],[18,51,18,52],[18,53,18,54],[18,55,18,56],[18,60,18,68],[19,1,20,2],[19,3,19,10],[19,11,19,56],[19,60,19,68],[20,3,20,10],[20,11,20,56],[20,60,20,68],[21,1,22,2],[21,3,21,10],[21,11,21,14],[21,15,21,22],[21,23,21,30],[21,31,21,40],[21,41,21,44],[21,45,21,46],[21,47,21,54],[21,55,21,56],[21,60,21,68],[22,3,22,10],[22,11,22,56],[22,60,22,68],[23,1,23,56],[23,60,23,68],[24,1,28,8],[24,9,28,37],[24,38,25,56],[24,60,24,68],[26,38,26,39],[26,41,26,45],[26,46,28,49],[26,50,28,56],[27,38,27,39],[27,41,27,45],[28,38,28,39],[28,41,28,45],[29,1,29,2],[29,3,29,8],[29,9,29,37],[29,38,29,45],[29,46,29,49],[29,50,29,56],[30,1,31,2],[30,3,31,8],[30,9,30,37],[30,38,30,45],[30,46,30,49],[30,50,30,56],[31,9,31,37],[31,38,31,45],[31,46,31,49],[31,50,31,56],[32,1,36,2],[32,3,36,8],[32,9,32,37],[32,38,32,45],[32,46,32,49],[32,50,32,56],[33,9,33,37],[33,38,33,45],[33,46,33,49],[33,50,33,56],[34,9,34,37],[34,38,34,45],[34,46,34,49],[34,50,34,56],[35,9,35,37],[35,38,35,45],[35,46,35,49],[35,50,35,56],[36,9,36,37],[36,38,36,45],[36,46,36,49],[36,50,36,56],[37,1,40,2],[37,3,40,8],[37,9,37,37],[37,38,37,45],[37,46,37,49],[37,50,37,56],[38,9,38,37],[38,38,38,45],[38,46,38,49],[38,50,38,56],[39,9,39,37],[39,38,39,45],[39,46,39,49],[39,50,39,56],[40,9,40,37],[40,38,40,45],[40,46,40,49],[40,50,40,56],[41,1,41,2],[41,3,41,8],[41,15,41,17],[41,18,41,37],[41,38,41,45],[41,46,41,49],[41,50,41,56],[42,1,44,2],[42,3,44,8],[42,9,42,37],[42,38,42,45],[42,46,42,49],[42,50,42,56],[43,9,43,37],[43,38,43,45],[43,46,43,49],[43,50,43,56],[44,9,44,37],[44,38,44,45],[44,46,44,49],[44,50,44,56],[45,1,47,2],[45,3,47,8],[45,9,45,37],[45,38,45,45],[45,46,45,49],[45,50,45,56],[46,9,46,37],[46,38,46,45],[46,46,46,49],[46,50,46,56],[47,9,47,37],[47,38,47,45],[47,46,47,49],[47,50,47,56],[48,1,49,2],[48,3,49,8],[48,9,48,37],[48,38,48,45],[48,46,48,49],[48,50,48,56],[49,9,49,37],[49,38,49,45],[49,46,49,49],[49,50,49,56],[50,1,50,56],[51,1,51,2],[51,3,51,56],[52,3,52,56],[53,1,53,2],[53,3,53,56],[54,1,54,56],[55,1,55,56],[56,1,56,56],[57,1,57,56],[58,1,58,56],[59,1,59,56],[60,1,60,56],[61,1,61,56],[62,1,62,56],[63,1,63,56],[66,3,66,7],[66,9,66,14],[66,16,66,20]]}
[null,"工事監理の状況（中間検査時チェックシート）の取扱いについて（概要）"]
[null,null,"◆","検査申請時に添付するシートは、原則として、A表＋B表に建築物の構造に応じたC1～8表を添付してください。",{"$nulls":57},"シートの保護を解除すると編集が可能になります（パスワードなし）"]
[null,null,"◆","特定工程が2回（RC造等）の場合には、基礎工程の検査申請時にA表＋B表を添付し、上部工程の検査申請時には"]
[{"$nulls":3},"C1～8表のいずれかのみを添付してください。"]
[null,null,"◆","SRC造については、上部工程の検査申請時には、C3、4表の両方を添付してください。"]
[null,null,"◆","混構造の場合には、検査工程については、主たる構造の指定内容に従うが、チェックシートについては、C1～8表の"]
[{"$nulls":3},"うち、混在する各構造に応じた全てのシートを添付してください。"]
[null,null,"◆","Ａ、Ｂ，Ｃ表に併せて、各工程ごと（特に検査時見え隠れ部分）の施工状況が確認できる資料(施工写真、試験成績"]
[{"$nulls":3},"書、材料の出荷証明書等)を提出してください。"]
[null,null,"◆","上記確認資料(写真)については、黒板等で物件名、撮影年月日が確認できるように撮影してください。"]
[null,null,"◆","中間検査対象外の建築物について添付するシートは、B表と建築物の構造に応じたC1～8表を添付してください。"]
[null,null,"◆","中間検査以降に行われた構造耐力上主要な部分の施工については、建築物の構造に応じたC1～8表を添付して"]
[{"$nulls":3},"ください。"]
[]
[]
[null,"工事監理の状況　A表（集団規定等）"]
[]
[]
[null,1,null,"確認済証番号",{"$nulls":7},"第",null,{"$f":"IF(中間三面!M11=\"\",\"\",中間三面!M11)","v":""},null,null,{"$f":"IF(中間三面!O11=\"\",\"\",中間三面!O11)","v":""},{"$nulls":5},{"$f":"IF(中間三面!S11=\"\",\"\",中間三面!S11)","v":""},null,{"$f":"IF(中間三面!T11=\"\",\"\",中間三面!T11)","v":""},null,null,{"$f":"IF(中間三面!V11=\"\",\"\",中間三面!V11)","v":""},null,null,"号",null,"確認済証交付日",{"$nulls":9},{"$f":"IF(中間三面!N12=\"\",\"\",中間三面!N12)","v":"令和"},null,null,{"$f":"IF(中間三面!P12=\"\",\"\",中間三面!P12)","v":""},null,"年",null,{"$f":"IF(中間三面!S12=\"\",\"\",中間三面!S12)","v":""},null,"月",null,{"$f":"IF(中間三面!V12=\"\",\"\",中間三面!V12)","v":""},null,"日"]
[null,2,null,"建築場所",{"$nulls":7},{"$f":"IF(中間三面!H4=\"\",\"\",中間三面!H4)","v":""}]
[{"$nulls":3},"建築主氏名",{"$nulls":7},{"$f":"IF(中間二面!J7=\"\",\"\",IF(別紙追加様式!J6=\"\",中間二面!J7,中間二面!J7&\"　・　\"&別紙追加様式!J6))","v":""}]
[null,3,null,"工事監理者",{"$nulls":7},"資格",{"$nulls":3},{"$f":"IF(中間二面!K65=\"\",\"\",中間二面!K65&\"建築士\")","v":""},{"$nulls":7},"建築士番号",{"$nulls":7},{"$f":"IF(中間二面!T65=\"\",\"\",中間二面!T65)","v":""},{"$nulls":9},"登録",{"$nulls":3},"第",null,{"$f":"IF(中間二面!AB65=\"\",\"\",中間二面!AB65)","v":""},{"$nulls":7},"号"]
[{"$nulls":3},"監理者氏名",{"$nulls":7},{"$f":"IF(中間二面!J66=\"\",\"\",中間二面!J66)","v":""}]
[]
[null,"監　理　項　目",{"$nulls":36},"監　理　記　録"]
[]
[{"$nulls":38},"A",null,"：","目視検査",{"$nulls":4},"結果",{"$nulls":3},"備考"]
[{"$nulls":38},"B",null,"：","実測検査"]
[{"$nulls":38},"C",null,"：","施工者報告"]
[null,1,null,"確認の表示\n(法89条)",{"$nulls":5},"①確認表示板の設置及び記載内容の確認"]
[null,2,null,"敷地の安全性\n(法19条)",{"$nulls":5},"①がけ、又は擁壁の安全性について"]
[{"$nulls":9},"②切り土、盛り土の状況"]
["○",3,null,"敷地と道路\nの関係\n(法42条､43条)",{"$nulls":5},"①道路の幅員"]
["○",{"$nulls":8},"②接道長さの確認"]
["○",{"$nulls":8},"③路地状通路の幅、距離"]
["○",{"$nulls":8},"④法42条2項道路の後退"]
[{"$nulls":9},"⑤法43条許可条件との整合"]
["○",4,null,"敷地形状及び\n建物配置等\n(法52条～\n53条の2)",{"$nulls":5},"①敷地形状等（敷地の形、境界明示及び高低差等）"]
["○",{"$nulls":8},"②建物配置（道路・隣地境界からの寸法距離）"]
[{"$nulls":9},"③確認申請の平面図との照合（平面プランの確認）"]
[{"$nulls":9},"④既存建物の有無（建ぺい率、容積率等）"]
["○",5,null,"壁面後退等\n(法54条)",{"$nulls":5},"①外壁後退【",{"$nulls":8},"m】の確認（検査項目4にも関連）"]
[null,6,null,"道路斜線等\n(法56条､\n56条の2)",{"$nulls":5},"①建築確認図面の立面図、断面図との照合"]
["○",{"$nulls":8},"②最高高さ、軒高さ、庇・軒出寸法の確認"]
["○",{"$nulls":8},"③"]
[null,7,null,"工事現場の\n危害防止\n（法90条）",{"$nulls":5},"①仮囲い等の設置状況"]
[{"$nulls":9},"②危害防止措置（根切りによる転倒防止等）"]
[{"$nulls":9},"③その他"]
[{"$nulls":3},"その他",{"$nulls":5},"①"]
[{"$nulls":9},"②"]
[]
[null,"※",null,"工事監理者は、監理記録欄に監理状況の結果を記入し、中間検査申請書と同時に提出してください。"]
[{"$nulls":3},"なお、否となった事項についてはそれに対する措置等を下記に記入してください。"]
[null,"※",null,"該当する項目のみ記入してください。"]
{"$rows_empty":11}
[{"$nulls":3},"中間二面建築主",{"$nulls":8},{"$f":"IF(中間二面!J7=\"\",\"\",中間二面!J7)","v":""}]
[]
[{"$nulls":3},"A ・ B ・ C",{"$nulls":5},"A ・ B ・ C",{"$nulls":6},"適 ・否"]
[]
[{"$nulls":3},"Ⓐ",{"$nulls":5},"Ⓐ ・ Ⓑ",{"$nulls":6},"適"]
[{"$nulls":3},"Ⓐ ・ Ⓑ",{"$nulls":5},"Ⓐ ・ Ⓑ ・ Ⓒ",{"$nulls":6},"否"]
[{"$nulls":3},"Ⓐ ・ Ⓒ",{"$nulls":5},"Ⓑ",{"$nulls":6},"該当なし"]
[{"$nulls":3},"Ⓐ ・ Ⓑ ・ Ⓒ",{"$nulls":5},"Ⓑ ・ Ⓒ",{"$nulls":6},"-"]
[{"$nulls":3},"Ⓑ",{"$nulls":5},"-"]
[{"$nulls":3},"Ⓑ ・ Ⓒ"]
[{"$nulls":3},"Ⓒ"]
[{"$nulls":3},"-"]

{"sheet":"B表【基礎】","index":30,"n_rows":107,"n_cols":61,"rows_kept":107,"merged":[[1,1,1,56],[2,1,3,36],[2,37,3,56],[4,1,4,56],[5,1,9,8],[5,9,9,37],[5,38,6,56],[7,38,7,39],[7,41,7,45],[7,46,9,49],[7,50,9,56],[8,38,8,39],[8,41,8,45],[9,38,9,39],[9,41,9,45],[10,1,11,2],[10,3,11,8],[10,9,10,37],[10,38,10,45],[10,46,10,49],[10,50,10,56],[11,9,11,37],[11,38,11,45],[11,46,11,49],[11,50,11,56],[12,1,13,2],[12,3,13,8],[12,9,12,37],[12,38,12,45],[12,46,12,49],[12,50,12,56],[13,9,13,37],[13,38,13,45],[13,46,13,49],[13,50,13,56],[14,1,18,2],[14,3,18,8],[14,9,14,37],[14,38,14,45],[14,46,14,49],[14,50,14,56],[15,9,15,37],[15,38,15,45],[15,46,15,49],[15,50,15,56],[16,9,16,37],[16,38,16,45],[16,46,16,49],[16,50,16,56],[17,9,17,37],[17,38,17,45],[17,46,17,49],[17,50,17,56],[18,9,18,37],[18,38,18,45],[18,46,18,49],[18,50,18,56],[19,1,47,2],[19,3,47,8],[19,9,20,14],[19,15,19,37],[19,38,19,45],[19,46,19,49],[19,50,19,56],[20,15,20,37],[20,38,20,45],[20,46,20,49],[20,50,20,56],[21,9,23,14],[21,15,21,37],[21,38,21,45],[21,46,21,49],[21,50,21,56],[22,15,22,37],[22,38,22,45],[22,46,22,49],[22,50,22,56],[23,15,23,37],[23,38,23,45],[23,46,23,49],[23,50,23,56],[24,9,26,14],[24,15,24,37],[24,38,24,45],[24,46,24,49],[24,50,24,56],[25,15,25,37],[25,38,25,45],[25,46,25,49],[25,50,25,56],[26,15,26,37],[26,38,26,45],[26,46,26,49],[26,50,26,56],[27,9,31,14],[27,15,27,37],[27,38,27,45],[27,46,27,49],[27,50,27,56],[28,15,28,37],[28,38,28,45],[28,46,28,49],[28,50,28,56],[29,15,29,37],[29,38,29,45],[29,46,29,49],[29,50,29,56],[30,15,30,37],[30,38,30,45],[30,46,30,49],[30,50,30,56],[31,15,31,37],[31,38,31,45],[31,46,31,49],[31,50,31,56],[32,9,38,14],[32,15,32,37],[32,38,32,45],[32,46,32,49],[32,50,32,56],[33,15,33,37],[33,38,33,45],[33,46,33,49],[33,50,33,56],[34,15,34,37],[34,38,34,45],[34,46,34,49],[34,50,34,56],[35,15,35,37],[35,38,35,45],[35,46,35,49],[35,50,35,56],[36,15,36,37],[36,38,36,45],[36,46,36,49],[36,50,36,56],[37,15,37,37],[37,38,37,45],[37,46,37,49],[37,50,37,56],[38,15,38,37],[38,38,38,45],[38,46,38,49],[38,50,38,56],[39,9,40,14],[39,15,39,37],[39,38,39,45],[39,46,39,49],[39,50,39,56],[40,15,40,37],[40,38,40,45],[40,46,40,49],[40,50,40,56],[41,9,43,14],[41,15,41,37],[41,38,41,45],[41,46,41,49],[41,50,41,56],[42,15,42,37],[42,38,42,45],[42,46,42,49],[42,50,42,56],[43,15,43,37],[43,38,43,45],[43,46,43,49],[43,50,43,56],[44,9,47,14],[44,15,44,37],[44,38,44,45],[44,46,44,49],[44,50,44,56],[45,15,45,37],[45,38,45,45],[45,46,45,49],[45,50,45,56],[46,15,46,37],[46,38,46,45],[46,46,46,49],[46,50,46,56],[47,15,47,37],[47,38,47,45],[47,46,47,49],[47,50,47,56],[48,1,56,2],[48,3,56,8],[48,9,48,37],[48,38,48,45],[48,46,48,49],[48,50,48,56],[49,9,49,37],[49,38,49,45],[49,46,49,49],[49,50,49,56],[50,9,50,37],[50,38,50,45],[50,46,50,49],[50,50,50,56],[51,9,51,37],[51,38,51,45],[51,46,51,49],[51,50,51,56],[52,9,52,37],[52,38,52,45],[52,46,52,49],[52,50,52,56],[53,9,53,37],[53,38,53,45],[53,46,53,49],[53,50,53,56],[54,9,54,37],[54,38,54,45],[54,46,54,49],[54,50,54,56],[55,9,55,37],[55,38,55,45],[55,46,55,49],[55,50,55,56],[56,9,56,37],[56,38,56,45],[56,46,56,49],[56,50,56,56],[57,1,64,2],[57,3,64,8],[57,9,60,14],[57,15,57,37],[57,38,57,45],[57,46,57,49],[57,50,57,56],[58,15,58,37],[58,38,58,45],[58,46,58,49],[58,50,58,56],[59,15,59,37],[59,38,59,45],[59,46,59,49],[59,50,59,56],[60,15,60,37],[60,38,60,45],[60,46,60,49],[60,50,60,56],[61,9,64,14],[61,15,61,37],[61,38,61,45],[61,46,61,49],[61,50,61,56],[62,15,62,37],[62,38,62,45],[62,46,62,49],[62,50,62,56],[63,15,63,37],[63,38,63,45],[63,46,63,49],[63,50,63,56],[64,15,64,37],[64,38,64,45],[64,46,64,49],[64,50,64,56],[65,1,66,2],[65,3,66,8],[65,9,65,37],[65,38,65,45],[65,46,65,49],[65,50,65,56],[66,9,66,37],[66,38,66,45],[66,46,66,49],[66,50,66,56],[67,1,72,2],[67,3,72,8],[67,9,67,37],[67,38,67,45],[67,46,67,49],[67,50,67,56],[68,9,68,37],[68,38,68,45],[68,46,68,49],[68,50,68,56],[69,9,69,37],[69,38,69,45],[69,46,69,49],[69,50,69,56],[70,9,70,37],[70,38,70,45],[70,46,70,49],[70,50,70,56],[71,9,71,37],[71,38,71,45],[71,46,71,49],[71,50,71,56],[72,9,72,37],[72,38,72,45],[72,46,72,49],[72,50,72,56],[73,1,73,56],[74,1,74,2],[74,3,74,56],[75,3,75,56],[76,1,76,2],[76,3,76,56],[77,1,77,56],[78,1,78,56],[79,1,79,56],[80,1,80,56],[81,1,81,56],[82,1,82,56],[83,1,83,56],[84,1,84,56],[85,1,85,56],[86,1,86,56],[89,1,89,2],[89,3,89,56],[90,3,90,56],[91,3,91,56],[92,3,92,56],[93,3,93,56]]}
[{"$nulls":60},"シートの保護を解除すると編集が可能になります（パスワードなし）"]
[]
[null,"工事監理の状況　B表（基礎工程）"]
[]
[]
[null,"監　理　項　目",{"$nulls":36},"監　理　記　録"]
[]
[{"$nulls":38},"A",null,"：","目視検査",{"$nulls":4},"結果",{"$nulls":3},"備考"]
[{"$nulls":38},"B",null,"：","実測検査"]
[{"$nulls":38},"C",null,"：","施工者報告"]
[null,1,null,"基礎種別",{"$nulls":5},"①基礎種別（連続、ベタ、独立、杭、地盤改良等）"]
[{"$nulls":9},"②支持地盤の確認"]
[null,2,null,"使用材料",{"$nulls":5},"①鋼材の種類"]
[{"$nulls":9},"②コンクリートの種類、配合"]
["○","3-1",null,"基礎構造体\nの確認\n\n3号建築物又は小規模建物の場合記入",{"$nulls":5},"①形状、寸法"]
["○",{"$nulls":8},"②鉄筋の径、本数、配置等"]
["○",{"$nulls":8},"③継手位置、定着長さ等"]
["○",{"$nulls":8},"④かぶり厚さ"]
["○",{"$nulls":8},"⑤耐圧版の厚さ"]
[null,"3-2",null,"基礎構造体\nの確認",{"$nulls":5},"全体形状及び部材配置",{"$nulls":5},"①建築物の平面形状"]
[{"$nulls":15},"②柱、地中梁等の配置"]
["○",{"$nulls":8},"ベース",{"$nulls":5},"①部材の方向、形状、寸法"]
["○",{"$nulls":14},"②鉄筋の径、本数、間隔"]
["○",{"$nulls":14},"③かぶり厚さ"]
["○",{"$nulls":8},"耐圧版",{"$nulls":5},"①主筋及び配力筋の径、配置等"]
["○",{"$nulls":14},"②耐圧版の厚さ"]
["○",{"$nulls":14},"③かぶり厚さ"]
["○",{"$nulls":8},"柱",{"$nulls":5},"①部材の形状、寸法"]
["○",{"$nulls":14},"②主筋の径、本数、配置"]
["○",{"$nulls":14},"③継手位置、定着長さ、フック"]
["○",{"$nulls":14},"④帯筋の径、配置等"]
["○",{"$nulls":14},"⑤かぶり厚さ"]
["○",{"$nulls":8},"地中梁",{"$nulls":5},"①部材の形状、寸法"]
["○",{"$nulls":14},"②主筋の径、本数、配置"]
[{"$nulls":15},"③中吊り筋（2段筋）の位置"]
["○",{"$nulls":14},"④継手位置、定着長さ、フック"]
["○",{"$nulls":14},"⑤あばら筋及び幅止め筋の径、配置等"]
[{"$nulls":15},"⑥貫通孔の補強筋"]
["○",{"$nulls":14},"⑦かぶり厚さ"]
["○",{"$nulls":8},"圧接継手",{"$nulls":5},"①継手位置"]
["○",{"$nulls":14},"②圧接部の外観、ふくらみ"]
["○",{"$nulls":8},"型枠",{"$nulls":5},"①各部分の寸法"]
[{"$nulls":15},"②せき板、支保工等の設置状況"]
[{"$nulls":15},"③型枠内の清掃、異物の除去"]
[{"$nulls":9},"その他",{"$nulls":5},"①差し筋の設置状況"]
[{"$nulls":15},"②"]
[{"$nulls":15},"③"]
[{"$nulls":15},"④"]
["○",4,null,"杭基礎",{"$nulls":5},"①杭芯位置の確認"]
["○",{"$nulls":8},"②杭の種別、径、長さ、本数等"]
[{"$nulls":9},"③継手の溶接状況"]
["○",{"$nulls":8},"④杭頭のレベル、偏芯等"]
[{"$nulls":9},"⑤杭周充填液等の配合、強度試験"]
["○",{"$nulls":8},"⑥場所打ち杭の掘削孔径、深さ等"]
[{"$nulls":9},"⑦場所打ち杭のコンクリート配合、強度等　"]
[{"$nulls":9},"⑧支持層到達の確認"]
[{"$nulls":9},"⑨杭芯ずれによる補強筋の追加"]
["○",5,null,"地盤改良工事",{"$nulls":5},"表層改良",{"$nulls":5},"①施工範囲、改良厚等"]
[{"$nulls":15},"②改良剤の添加量"]
[{"$nulls":15},"③埋戻し、転圧状況"]
[{"$nulls":15},"④改良地盤耐力の確認"]
["○",{"$nulls":8},"柱状改良",{"$nulls":5},"①杭芯位置の確認"]
["○",{"$nulls":14},"②径、長さ、本数等"]
["○",{"$nulls":14},"③杭頭のレベル、偏芯等"]
[{"$nulls":15},"④改良地盤耐力の確認"]
[null,6,null,"地業工事等",{"$nulls":5},"①栗石、砕石等の敷き均し、転圧"]
[{"$nulls":9},"②埋戻し土の転圧"]
[null,7,null,"その他",{"$nulls":5},"①"]
[{"$nulls":9},"②"]
[{"$nulls":9},"③"]
[{"$nulls":9},"④"]
[{"$nulls":9},"⑤"]
[{"$nulls":9},"⑥"]
[]
[null,"※",null,"工事監理者は、監理記録欄に監理状況の結果を記入し、中間検査申請書と同時に提出してください。"]
[{"$nulls":3},"なお、否となった事項についてはそれに対する措置等を下記に記入してください。"]
[null,"※",null,"該当する項目のみ記入してください。"]
{"$rows_empty":20}
[{"$nulls":3},"A ・ B ・ C",{"$nulls":5},"A ・ B ・ C",{"$nulls":6},"適 ・否"]
[]
[{"$nulls":3},"Ⓐ",{"$nulls":5},"Ⓐ ・ Ⓑ",{"$nulls":6},"適"]
[{"$nulls":3},"Ⓐ ・ Ⓑ",{"$nulls":5},"Ⓐ ・ Ⓑ ・ Ⓒ",{"$nulls":6},"否"]
[{"$nulls":3},"Ⓐ ・ Ⓒ",{"$nulls":5},"Ⓑ",{"$nulls":6},"該当なし"]
[{"$nulls":3},"Ⓐ ・ Ⓑ ・ Ⓒ",{"$nulls":5},"Ⓑ ・ Ⓒ",{"$nulls":6},"-"]
[{"$nulls":3},"Ⓑ",{"$nulls":5},"-"]
[{"$nulls":3},"Ⓑ ・ Ⓒ"]
[{"$nulls":3},"Ⓒ"]
[{"$nulls":3},"-"]

{"sheet":"C1表【木造軸組】","index":31,"n_rows":67,"n_cols":60,"rows_kept":67,"merged":[[1,1,1,56],[2,1,3,36],[2,37,3,56],[4,1,4,56],[5,1,5,56],[6,1,10,8],[6,9,10,37],[6,38,7,56],[8,38,8,39],[8,41,8,45],[8,46,10,49],[8,50,10,56],[9,38,9,39],[9,41,9,45],[10,38,10,39],[10,41,10,45],[11,1,14,2],[11,3,14,8],[11,9,11,37],[11,38,11,45],[11,46,11,49],[11,50,11,56],[12,9,12,37],[12,38,12,45],[12,46,12,49],[12,50,12,56],[13,9,13,37],[13,38,13,45],[13,46,13,49],[13,50,13,56],[14,9,14,37],[14,38,14,45],[14,46,14,49],[14,50,14,56],[15,1,16,2],[15,3,16,8],[15,9,15,37],[15,38,15,45],[15,46,15,49],[15,50,15,56],[16,9,16,37],[16,38,16,45],[16,46,16,49],[16,50,16,56],[17,1,19,2],[17,3,19,8],[17,9,17,37],[17,38,17,45],[17,46,17,49],[17,50,17,56],[18,9,18,37],[18,38,18,45],[18,46,18,49],[18,50,18,56],[19,9,19,37],[19,38,19,45],[19,46,19,49],[19,50,19,56],[20,1,23,2],[20,3,23,8],[20,9,20,37],[20,38,20,45],[20,46,20,49],[20,50,20,56],[21,9,21,37],[21,38,21,45],[21,46,21,49],[21,50,21,56],[22,9,22,37],[22,38,22,45],[22,46,22,49],[22,50,22,56],[23,9,23,37],[23,38,23,45],[23,46,23,49],[23,50,23,56],[24,1,26,2],[24,3,26,8],[24,9,24,37],[24,38,24,45],[24,46,24,49],[24,50,24,56],[25,9,25,37],[25,38,25,45],[25,46,25,49],[25,50,25,56],[26,9,26,37],[26,38,26,45],[26,46,26,49],[26,50,26,56],[27,1,31,2],[27,3,31,8],[27,9,29,14],[27,15,27,37],[27,38,27,45],[27,46,27,49],[27,50,27,56],[28,15,28,37],[28,38,28,45],[28,46,28,49],[28,50,28,56],[29,15,29,37],[29,38,29,45],[29,46,29,49],[29,50,29,56],[30,9,31,14],[30,15,30,37],[30,38,30,45],[30,46,30,49],[30,50,30,56],[31,15,31,37],[31,38,31,45],[31,46,31,49],[31,50,31,56],[32,1,34,2],[32,3,34,8],[32,9,32,37],[32,38,32,45],[32,46,32,49],[32,50,32,56],[33,9,33,37],[33,38,33,45],[33,46,33,49],[33,50,33,56],[34,9,34,37],[34,38,34,45],[34,46,34,49],[34,50,34,56],[35,1,36,2],[35,3,36,8],[35,9,35,37],[35,38,35,45],[35,46,35,49],[35,50,35,56],[36,9,36,37],[36,38,36,45],[36,46,36,49],[36,50,36,56],[37,1,39,2],[37,3,39,8],[37,9,37,37],[37,38,37,45],[37,46,37,49],[37,50,37,56],[38,9,38,37],[38,38,38,45],[38,46,38,49],[38,50,38,56],[39,9,39,37],[39,38,39,45],[39,46,39,49],[39,50,39,56],[40,1,40,56],[41,1,41,2],[41,3,41,56],[42,3,42,56],[43,1,43,2],[43,3,43,56],[44,1,44,56],[45,1,45,56],[46,1,46,56],[47,1,47,56],[48,1,48,56],[49,1,49,56],[50,1,50,56],[51,1,51,56],[52,1,52,56],[53,1,53,56]]}
[{"$nulls":59},"シートの保護を解除すると編集が可能になります（パスワードなし）"]
[]
[null,"工事監理の状況　C１表（木造軸組構造）"]
[]
[]
[]
[null,"監　理　項　目",{"$nulls":36},"監　理　記　録"]
[]
[{"$nulls":38},"A",null,"：","目視検査",{"$nulls":4},"結果",{"$nulls":3},"備考"]
[{"$nulls":38},"B",null,"：","実測検査"]
[{"$nulls":38},"C",null,"：","施工者報告"]
[null,1,null,"全体形状及び\n部材の配置",{"$nulls":5},"①建築物の形状"]
[{"$nulls":9},"②柱の配置"]
[{"$nulls":9},"③耐力壁の配置"]
[{"$nulls":9},"④小屋組の形状"]
[null,2,null,"基礎",{"$nulls":5},"①床下換気口等の設置"]
[{"$nulls":9},"②構造体のひび割れの有無"]
["○",3,null,"土台",{"$nulls":5},"①部材の形状、寸法"]
[{"$nulls":9},"②アンカーボルトの据付及び緊結状況"]
[{"$nulls":9},"③火打ち材の設置"]
["○",4,null,"柱",{"$nulls":5},"①部材の形状、寸法"]
[{"$nulls":9},"②通し柱の設置"]
[{"$nulls":9},"③接合金物の設置"]
[{"$nulls":9},"④部材の緊結"]
["○",5,null,"横架材",{"$nulls":5},"①部材の形状、寸法"]
[{"$nulls":9},"②部材下部中央の欠き込み禁止"]
[{"$nulls":9},"③部材の緊結"]
["○",6,null,"耐力壁",{"$nulls":5},"筋かい",{"$nulls":5},"①部材の形状、寸法"]
[{"$nulls":15},"②補強金物の取付け"]
[{"$nulls":15},"③欠き込み禁止"]
[{"$nulls":9},"壁材",{"$nulls":5},"①板材の種類、厚さ"]
[{"$nulls":15},"②壁材の釘留め状況（種類、間隔等）"]
["○",7,null,"床組",{"$nulls":5},"①大引、根太の形状、寸法"]
[{"$nulls":9},"②火打ち材の設置"]
[{"$nulls":9},"③剛性床(床材の釘留め状況（種類、間隔等））"]
["○",8,null,"小屋組",{"$nulls":5},"①母屋、垂木の形状、寸法、部材の緊結等"]
[{"$nulls":9},"②振れ止め"]
["○",9,null,"その他",{"$nulls":5},"①地盤面からの床高さ"]
[{"$nulls":9},"②防腐・防蟻措置"]
[{"$nulls":9},"③"]
[]
[null,"※",null,"工事監理者は、監理記録欄に監理状況の結果を記入し、中間検査申請書と同時に提出してください。"]
[{"$nulls":3},"なお、否となった事項についてはそれに対する措置等を下記に記入してください。"]
[null,"※",null,"該当する項目のみ記入してください。"]
{"$rows_empty":13}
[{"$nulls":3},"A ・ B ・ C",{"$nulls":5},"A ・ B ・ C",{"$nulls":6},"適 ・否"]
[]
[{"$nulls":3},"Ⓐ",{"$nulls":5},"Ⓐ ・ Ⓑ",{"$nulls":6},"適"]
[{"$nulls":3},"Ⓐ ・ Ⓑ",{"$nulls":5},"Ⓐ ・ Ⓑ ・ Ⓒ",{"$nulls":6},"否"]
[{"$nulls":3},"Ⓐ ・ Ⓒ",{"$nulls":5},"Ⓑ",{"$nulls":6},"該当なし"]
[{"$nulls":3},"Ⓐ ・ Ⓑ ・ Ⓒ",{"$nulls":5},"Ⓑ ・ Ⓒ",{"$nulls":6},"-"]
[{"$nulls":3},"Ⓑ",{"$nulls":5},"-"]
[{"$nulls":3},"Ⓑ ・ Ⓒ"]
[{"$nulls":3},"Ⓒ"]
[{"$nulls":3},"-"]

{"sheet":"C2表【2×4】","index":32,"n_rows":68,"n_cols":60,"rows_kept":68,"merged":[[1,1,1,56],[2,1,3,36],[2,37,3,56],[4,1,4,56],[5,1,5,56],[6,1,10,8],[6,9,10,37],[6,38,7,56],[8,38,8,39],[8,41,8,45],[8,46,10,49],[8,50,10,56],[9,38,9,39],[9,41,9,45],[10,38,10,39],[10,41,10,45],[11,1,14,2],[11,3,14,8],[11,9,11,37],[11,38,11,45],[11,46,11,49],[11,50,11,56],[12,9,12,37],[12,38,12,45],[12,46,12,49],[12,50,12,56],[13,9,13,37],[13,38,13,45],[13,46,13,49],[13,50,13,56],[14,9,14,37],[14,38,14,45],[14,46,14,49],[14,50,14,56],[15,1,16,2],[15,3,16,8],[15,9,15,37],[15,38,15,45],[15,46,15,49],[15,50,15,56],[16,9,16,37],[16,38,16,45],[16,46,16,49],[16,50,16,56],[17,1,18,2],[17,3,18,8],[17,9,17,37],[17,38,17,45],[17,46,17,49],[17,50,17,56],[18,9,18,37],[18,38,18,45],[18,46,18,49],[18,50,18,56],[19,1,20,2],[19,3,20,8],[19,9,19,37],[19,38,19,45],[19,46,19,49],[19,50,19,56],[20,9,20,37],[20,38,20,45],[20,46,20,49],[20,50,20,56],[21,1,25,2],[21,3,25,8],[21,9,21,37],[21,38,21,45],[21,46,21,49],[21,50,21,56],[22,9,22,37],[22,38,22,45],[22,46,22,49],[22,50,22,56],[23,9,23,37],[23,38,23,45],[23,46,23,49],[23,50,23,56],[24,9,24,37],[24,38,24,45],[24,46,24,49],[24,50,24,56],[25,9,25,37],[25,38,25,45],[25,46,25,49],[25,50,25,56],[26,1,30,2],[26,3,30,8],[26,9,26,37],[26,38,26,45],[26,46,26,49],[26,50,26,56],[27,9,27,37],[27,38,27,45],[27,46,27,49],[27,50,27,56],[28,9,28,37],[28,38,28,45],[28,46,28,49],[28,50,28,56],[29,9,29,37],[29,38,29,45],[29,46,29,49],[29,50,29,56],[30,9,30,37],[30,38,30,45],[30,46,30,49],[30,50,30,56],[31,1,34,2],[31,3,34,8],[31,9,31,37],[31,38,31,45],[31,46,31,49],[31,50,31,56],[32,9,32,37],[32,38,32,45],[32,46,32,49],[32,50,32,56],[33,9,33,37],[33,38,33,45],[33,46,33,49],[33,50,33,56],[34,9,34,37],[34,38,34,45],[34,46,34,49],[34,50,34,56],[35,1,39,2],[35,3,39,8],[35,9,35,37],[35,38,35,45],[35,46,35,49],[35,50,35,56],[36,9,36,37],[36,38,36,45],[36,46,36,49],[36,50,36,56],[37,9,37,37],[37,38,37,45],[37,46,37,49],[37,50,37,56],[38,9,38,37],[38,38,38,45],[38,46,38,49],[38,50,38,56],[39,9,39,37],[39,38,39,45],[39,46,39,49],[39,50,39,56],[40,1,40,56],[41,1,41,2],[41,3,41,56],[42,3,42,56],[43,1,43,2],[43,3,43,56],[44,1,44,56],[45,1,45,56],[46,1,46,56],[47,1,47,56],[48,1,48,56],[49,1,49,56],[50,1,50,56],[51,1,51,56],[52,1,52,56],[53,1,53,56],[54,1,54,56]]}
[{"$nulls":59},"シートの保護を解除すると編集が可能になります（パスワードなし）"]
[]
[null,"工事監理の状況　C2表（木造枠組構造）"]
[]
[]
[]
[null,"監　理　項　目",{"$nulls":36},"監　理　記　録"]
[]
[{"$nulls":38},"A",null,"：","目視検査",{"$nulls":4},"結果",{"$nulls":3},"備考"]
[{"$nulls":38},"B",null,"：","実測検査"]
[{"$nulls":38},"C",null,"：","施工者報告"]
[null,1,null,"全体形状及び\n部材の配置",{"$nulls":5},"①建築物の形状"]
[{"$nulls":9},"②耐力壁の配置"]
[{"$nulls":9},"③小屋組の形状"]
[{"$nulls":9},"④補強金物の取付設置状況"]
[null,2,null,"使用材料",{"$nulls":5},"①木材、合板の種類"]
[{"$nulls":9},"②緊結金物"]
[null,3,null,"基礎",{"$nulls":5},"①床下換気口等の設置"]
[{"$nulls":9},"②構造体のひび割れの有無"]
["○",4,null,"土台",{"$nulls":5},"①部材の形状、寸法"]
[{"$nulls":9},"②アンカーボルトの据付及び緊結状況"]
["○",5,null,"床構面",{"$nulls":5},"①根太の形状、寸法、配置"]
[{"$nulls":9},"②開口部の補強"]
[{"$nulls":9},"③耐力壁下根太補強"]
[{"$nulls":9},"④転び止め"]
[{"$nulls":9},"⑤床材の釘留め状況（種類、間隔等）"]
[null,6,null,"耐力壁",{"$nulls":5},"①たて枠の配置"]
[{"$nulls":9},"②隅角部、交差部の補強"]
[{"$nulls":9},"③頭つなぎ"]
[{"$nulls":9},"④まぐさ、まぐさ受け"]
["○",{"$nulls":8},"⑤壁材の釘留め状況（種類、間隔等）"]
["○",7,null,"小屋組",{"$nulls":5},"①垂木の形状、寸法"]
[{"$nulls":9},"②垂木つなぎ"]
[{"$nulls":9},"③垂木、トラスの緊結"]
[{"$nulls":9},"④振れ止め"]
["○",8,null,"その他",{"$nulls":5},"①地盤面からの床高さ"]
[{"$nulls":9},"②防腐・防蟻措置"]
[{"$nulls":9},"③"]
[{"$nulls":9},"④"]
[{"$nulls":9},"⑤"]
[]
[null,"※",null,"工事監理者は、監理記録欄に監理状況の結果を記入し、中間検査申請書と同時に提出してください。"]
[{"$nulls":3},"なお、否となった事項についてはそれに対する措置等を下記に記入してください。"]
[null,"※",null,"該当する項目のみ記入してください。"]
{"$rows_empty":14}
[{"$nulls":3},"A ・ B ・ C",{"$nulls":5},"A ・ B ・ C",{"$nulls":6},"適 ・否",{"$nulls":5},"工事監理の状況　C2表（木造枠組構造）"]
[{"$nulls":22},"工事監理の状況　C2表（木質パネル構造）"]
[{"$nulls":3},"Ⓐ",{"$nulls":5},"Ⓐ ・ Ⓑ",{"$nulls":6},"適"]
[{"$nulls":3},"Ⓐ ・ Ⓑ",{"$nulls":5},"Ⓐ ・ Ⓑ ・ Ⓒ",{"$nulls":6},"否"]
[{"$nulls":3},"Ⓐ ・ Ⓒ",{"$nulls":5},"Ⓑ",{"$nulls":6},"該当なし"]
[{"$nulls":3},"Ⓐ ・ Ⓑ ・ Ⓒ",{"$nulls":5},"Ⓑ ・ Ⓒ",{"$nulls":6},"-"]
[{"$nulls":3},"Ⓑ",{"$nulls":5},"-"]
[{"$nulls":3},"Ⓑ ・ Ⓒ"]
[{"$nulls":3},"Ⓒ"]
[{"$nulls":3},"-"]

{"sheet":"C3表【S・SRC】","index":33,"n_rows":68,"n_cols":60,"rows_kept":68,"merged":[[1,1,1,56],[2,1,3,36],[2,37,3,56],[4,1,4,56],[5,1,5,56],[6,1,10,8],[6,9,10,37],[6,38,7,56],[8,38,8,39],[8,41,8,45],[8,46,10,49],[8,50,10,56],[9,38,9,39],[9,41,9,45],[10,38,10,39],[10,41,10,45],[11,1,15,2],[11,3,15,8],[11,9,11,37],[11,38,11,45],[11,46,11,49],[11,50,11,56],[12,9,12,37],[12,38,12,45],[12,46,12,49],[12,50,12,56],[13,9,13,37],[13,38,13,45],[13,46,13,49],[13,50,13,56],[14,9,14,37],[14,38,14,45],[14,46,14,49],[14,50,14,56],[15,9,15,37],[15,38,15,45],[15,46,15,49],[15,50,15,56],[16,1,17,2],[16,3,17,8],[16,9,16,37],[16,38,16,45],[16,46,16,49],[16,50,16,56],[17,9,17,37],[17,38,17,45],[17,46,17,49],[17,50,17,56],[18,1,22,2],[18,3,22,8],[18,9,18,37],[18,38,18,45],[18,46,18,49],[18,50,18,56],[19,9,19,37],[19,38,19,45],[19,46,19,49],[19,50,19,56],[20,9,20,37],[20,38,20,45],[20,46,20,49],[20,50,20,56],[21,9,21,37],[21,38,21,45],[21,46,21,49],[21,50,21,56],[22,9,22,37],[22,38,22,45],[22,46,22,49],[22,50,22,56],[23,1,25,2],[23,3,25,8],[23,9,23,37],[23,38,23,45],[23,46,23,49],[23,50,23,56],[24,9,24,37],[24,38,24,45],[24,46,24,49],[24,50,24,56],[25,9,25,37],[25,38,25,45],[25,46,25,49],[25,50,25,56],[26,1,28,2],[26,3,28,8],[26,9,26,37],[26,38,26,45],[26,46,26,49],[26,50,26,56],[27,9,27,37],[27,38,27,45],[27,46,27,49],[27,50,27,56],[28,9,28,37],[28,38,28,45],[28,46,28,49],[28,50,28,56],[29,1,29,2],[29,3,29,8],[29,9,29,37],[29,38,29,45],[29,46,29,49],[29,50,29,56],[30,1,31,2],[30,3,31,8],[30,9,30,37],[30,38,30,45],[30,46,30,49],[30,50,30,56],[31,9,31,37],[31,38,31,45],[31,46,31,49],[31,50,31,56],[32,1,33,2],[32,3,33,8],[32,9,32,37],[32,38,32,45],[32,46,32,49],[32,50,32,56],[33,9,33,37],[33,38,33,45],[33,46,33,49],[33,50,33,56],[34,1,37,2],[34,3,37,8],[34,9,34,37],[34,38,34,45],[34,46,34,49],[34,50,34,56],[35,9,35,37],[35,38,35,45],[35,46,35,49],[35,50,35,56],[36,9,36,37],[36,38,36,45],[36,46,36,49],[36,50,36,56],[37,9,37,37],[37,38,37,45],[37,46,37,49],[37,50,37,56],[38,1,38,56],[39,1,39,2],[39,3,39,56],[40,3,40,56],[41,1,41,2],[41,3,41,56],[42,1,42,56],[43,1,43,56],[44,1,44,56],[45,1,45,56],[46,1,46,56],[47,1,47,56],[48,1,48,56],[49,1,49,56],[50,1,50,56],[51,1,51,56],[52,1,52,56],[53,1,53,56]]}
[{"$nulls":59},"シートの保護を解除すると編集が可能になります（パスワードなし）"]
[]
[null,"工事監理の状況　C3表（鉄骨造・鉄骨鉄筋コンクリート造）"]
[]
[]
[]
[null,"監　理　項　目",{"$nulls":36},"監　理　記　録"]
[]
[{"$nulls":38},"A",null,"：","目視検査",{"$nulls":4},"結果",{"$nulls":3},"備考"]
[{"$nulls":38},"B",null,"：","実測検査"]
[{"$nulls":38},"C",null,"：","施工者報告"]
[null,1,null,"全体形状及び\n部材の配置",{"$nulls":5},"①建築物の形状"]
["○",{"$nulls":8},"②建方の精度"]
[{"$nulls":9},"③柱、梁の配置"]
[{"$nulls":9},"④垂直、水平ブレースの配置"]
[{"$nulls":9},"⑤剛性床の配置"]
[null,2,null,"使用材料",{"$nulls":5},"①鋼材の種類"]
[{"$nulls":9},"②高力ボルトの規格"]
["○",3,null,"柱",{"$nulls":5},"①部材の形状、寸法"]
[{"$nulls":9},"②溶接箇所の外観"]
["○",{"$nulls":8},"③ベースプレートの寸法、モルタル充填等"]
["○",{"$nulls":8},"④アンカーボルトの径、本数、締付け状況等"]
[{"$nulls":9},"⑤露出型固定柱脚のメーカーチェックシートによる確認"]
["○",4,null,"大梁",{"$nulls":5},"①部材の形状、寸法"]
["○",{"$nulls":8},"②ボルトの種類、径、本数、締付け状況等"]
[{"$nulls":9},"③溶接箇所の外観"]
["○",5,null,"小梁",{"$nulls":5},"①部材の形状、寸法"]
["○",{"$nulls":8},"②ボルトの種類、径、本数、締付け状況等"]
[{"$nulls":9},"③溶接箇所の外観"]
[null,6,null,"柱、梁の仕口",{"$nulls":5},"①溶接箇所の外観"]
["○",7,null,"床",{"$nulls":5},"①部材の形状、寸法"]
[{"$nulls":9},"②梁との接合方法"]
["○",8,null,"ブレース",{"$nulls":5},"①部材の形状、寸法及び位置"]
[{"$nulls":9},"②取付け方法"]
[null,9,null,"その他",{"$nulls":5},"①防錆処置"]
[{"$nulls":9},"②溶接部分の非破壊試験"]
[{"$nulls":9},"③梁貫通孔の補強"]
[{"$nulls":9},"④"]
[]
[null,"※",null,"工事監理者は、監理記録欄に監理状況の結果を記入し、中間検査申請書と同時に提出してください。"]
[{"$nulls":3},"なお、否となった事項についてはそれに対する措置等を下記に記入してください。"]
[null,"※",null,"該当する項目のみ記入してください。"]
{"$rows_empty":16}
[{"$nulls":4},"A ・ B ・ C",{"$nulls":5},"A ・ B ・ C",{"$nulls":6},"適 ・否"]
[]
[{"$nulls":4},"Ⓐ",{"$nulls":5},"Ⓐ ・ Ⓑ",{"$nulls":6},"適"]
[{"$nulls":4},"Ⓐ ・ Ⓑ",{"$nulls":5},"Ⓐ ・ Ⓑ ・ Ⓒ",{"$nulls":6},"否"]
[{"$nulls":4},"Ⓐ ・ Ⓒ",{"$nulls":5},"Ⓑ",{"$nulls":6},"該当なし"]
[{"$nulls":4},"Ⓐ ・ Ⓑ ・ Ⓒ",{"$nulls":5},"Ⓑ ・ Ⓒ",{"$nulls":6},"-"]
[{"$nulls":4},"Ⓑ",{"$nulls":5},"-"]
[{"$nulls":4},"Ⓑ ・ Ⓒ"]
[{"$nulls":4},"Ⓒ"]
[{"$nulls":4},"-"]

{"sheet":"C4表【RC・SRC】","index":34,"n_rows":68,"n_cols":60,"rows_kept":68,"merged":[[1,1,1,56],[2,1,3,37],[2,38,3,56],[4,1,4,56],[5,1,5,56],[6,1,10,8],[6,9,10,37],[6,38,7,56],[8,38,8,39],[8,41,8,45],[8,46,10,49],[8,50,10,56],[9,38,9,39],[9,41,9,45],[10,38,10,39],[10,41,10,45],[11,1,12,2],[11,3,12,8],[11,9,11,37],[11,38,11,45],[11,46,11,49],[11,50,11,56],[12,9,12,37],[12,38,12,45],[12,46,12,49],[12,50,12,56],[13,1,14,2],[13,3,14,8],[13,9,13,37],[13,38,13,45],[13,46,13,49],[13,50,13,56],[14,9,14,37],[14,38,14,45],[14,46,14,49],[14,50,14,56],[15,1,19,2],[15,3,19,8],[15,9,15,37],[15,38,15,45],[15,46,15,49],[15,50,15,56],[16,9,16,37],[16,38,16,45],[16,46,16,49],[16,50,16,56],[17,9,17,37],[17,38,17,45],[17,46,17,49],[17,50,17,56],[18,9,18,37],[18,38,18,45],[18,46,18,49],[18,50,18,56],[19,9,19,37],[19,38,19,45],[19,46,19,49],[19,50,19,56],[20,1,25,2],[20,3,25,8],[20,9,20,37],[20,38,20,45],[20,46,20,49],[20,50,20,56],[21,9,21,37],[21,38,21,45],[21,46,21,49],[21,50,21,56],[22,9,22,37],[22,38,22,45],[22,46,22,49],[22,50,22,56],[23,9,23,37],[23,38,23,45],[23,46,23,49],[23,50,23,56],[24,9,24,37],[24,38,24,45],[24,46,24,49],[24,50,24,56],[25,9,25,37],[25,38,25,45],[25,46,25,49],[25,50,25,56],[26,1,31,2],[26,3,31,8],[26,9,26,37],[26,38,26,45],[26,46,26,49],[26,50,26,56],[27,9,27,37],[27,38,27,45],[27,46,27,49],[27,50,27,56],[28,9,28,37],[28,38,28,45],[28,46,28,49],[28,50,28,56],[29,9,29,37],[29,38,29,45],[29,46,29,49],[29,50,29,56],[30,9,30,37],[30,38,30,45],[30,46,30,49],[30,50,30,56],[31,9,31,37],[31,38,31,45],[31,46,31,49],[31,50,31,56],[32,1,36,2],[32,3,36,8],[32,9,32,37],[32,38,32,45],[32,46,32,49],[32,50,32,56],[33,9,33,37],[33,38,33,45],[33,46,33,49],[33,50,33,56],[34,9,34,37],[34,38,34,45],[34,46,34,49],[34,50,34,56],[35,9,35,37],[35,38,35,45],[35,46,35,49],[35,50,35,56],[36,9,36,37],[36,38,36,45],[36,46,36,49],[36,50,36,56],[37,1,38,2],[37,3,38,8],[37,9,37,37],[37,38,37,45],[37,46,37,49],[37,50,37,56],[38,9,38,37],[38,38,38,45],[38,46,38,49],[38,50,38,56],[39,1,41,2],[39,3,41,8],[39,9,39,37],[39,38,39,45],[39,46,39,49],[39,50,39,56],[40,9,40,37],[40,38,40,45],[40,46,40,49],[40,50,40,56],[41,9,41,37],[41,38,41,45],[41,46,41,49],[41,50,41,56],[42,1,43,2],[42,3,43,8],[42,9,42,37],[42,38,42,45],[42,46,42,49],[42,50,42,56],[43,9,43,37],[43,38,43,45],[43,46,43,49],[43,50,43,56],[44,1,44,56],[45,1,45,2],[45,3,45,56],[46,3,46,56],[47,1,47,2],[47,3,47,56],[48,1,48,56],[49,1,49,56],[50,1,50,56],[51,1,51,56],[52,1,52,56],[53,1,53,56],[54,1,54,56]]}
[{"$nulls":59},"シートの保護を解除すると編集が可能になります（パスワードなし）"]
[]
[null,"工事監理の状況　C4表（鉄筋コンクリート造・鉄骨鉄筋コンクリート造）"]
[]
[]
[]
[null,"監　理　項　目",{"$nulls":36},"監　理　記　録"]
[]
[{"$nulls":38},"A",null,"：","目視検査",{"$nulls":4},"結果",{"$nulls":3},"備考"]
[{"$nulls":38},"B",null,"：","実測検査"]
[{"$nulls":38},"C",null,"：","施工者報告"]
[null,1,null,"全体形状及び\n部材の配置",{"$nulls":5},"①建築物の平面形状"]
[{"$nulls":9},"②柱、梁の配置"]
[null,2,null,"使用材料",{"$nulls":5},"①鋼材の種類"]
[{"$nulls":9},"②コンクリートの種類、強度"]
["○",3,null,"柱",{"$nulls":5},"①部材の形状、寸法"]
["○",{"$nulls":8},"②主筋の径、本数、配置等"]
["○",{"$nulls":8},"③継手位置、定着長さ、フック"]
["○",{"$nulls":8},"④帯筋の径、配置等"]
["○",{"$nulls":8},"⑤かぶり厚さ"]
["○",4,null,"梁",{"$nulls":5},"①部材の形状、寸法"]
["○",{"$nulls":8},"②主筋の径、本数、配置、中吊り筋（2段筋）の位置"]
["○",{"$nulls":8},"③継手位置、定着長さ、フック"]
["○",{"$nulls":8},"④あばら筋及び幅止め筋の径、配置等"]
[{"$nulls":9},"⑤貫通孔の補強筋"]
["○",{"$nulls":8},"⑥かぶり厚さ"]
["○",5,null,"壁",{"$nulls":5},"①部材の形状、寸法"]
["○",{"$nulls":8},"②縦・横筋の径、配置等"]
["○",{"$nulls":8},"③継手位置、定着長さ、フック"]
["○",{"$nulls":8},"④開口部の補強筋、配置等"]
["○",{"$nulls":8},"⑤幅止め筋の径、配置等"]
["○",{"$nulls":8},"⑥かぶり厚さ"]
["○",6,null,"床、階段",{"$nulls":5},"①部材の形状、寸法"]
["○",{"$nulls":8},"②主筋及び配力筋の径、配置"]
["○",{"$nulls":8},"③継手位置、定着長さ、フック"]
[{"$nulls":9},"④開口部の補強筋"]
["○",{"$nulls":8},"⑤かぶり厚さ"]
["○",7,null,"圧接継手",{"$nulls":5},"①継手位置"]
["○",{"$nulls":8},"②圧接部の外観、ふくらみ"]
["○",8,null,"型枠",{"$nulls":5},"①各部分の寸法"]
[{"$nulls":9},"②せき板、支保工等の設置状況"]
[{"$nulls":9},"③型枠内の清掃、異物の除去"]
[null,9,null,"その他",{"$nulls":5},"①差し筋の設置状況"]
[{"$nulls":9},"②"]
[]
[null,"※",null,"工事監理者は、監理記録欄に監理状況の結果を記入し、中間検査申請書と同時に提出してください。"]
[{"$nulls":3},"なお、否となった事項についてはそれに対する措置等を下記に記入してください。"]
[null,"※",null,"該当する項目のみ記入してください。"]
{"$rows_empty":10}
[{"$nulls":4},"A ・ B ・ C",{"$nulls":5},"A ・ B ・ C",{"$nulls":6},"適 ・否"]
[]
[{"$nulls":4},"Ⓐ",{"$nulls":5},"Ⓐ ・ Ⓑ",{"$nulls":6},"適"]
[{"$nulls":4},"Ⓐ ・ Ⓑ",{"$nulls":5},"Ⓐ ・ Ⓑ ・ Ⓒ",{"$nulls":6},"否"]
[{"$nulls":4},"Ⓐ ・ Ⓒ",{"$nulls":5},"Ⓑ",{"$nulls":6},"該当なし"]
[{"$nulls":4},"Ⓐ ・ Ⓑ ・ Ⓒ",{"$nulls":5},"Ⓑ ・ Ⓒ",{"$nulls":6},"-"]
[{"$nulls":4},"Ⓑ",{"$nulls":5},"-"]
[{"$nulls":4},"Ⓑ ・ Ⓒ"]
[{"$nulls":4},"Ⓒ"]
[{"$nulls":4},"-"]

{"sheet":"C5表【PC】","index":35,"n_rows":68,"n_cols":60,"rows_kept":68,"merged":[[1,1,1,56],[2,1,3,37],[2,38,3,56],[4,1,4,56],[5,1,5,56],[6,1,10,8],[6,9,10,37],[6,38,7,56],[8,38,8,39],[8,41,8,45],[8,46,10,49],[8,50,10,56],[9,38,9,39],[9,41,9,45],[10,38,10,39],[10,41,10,45],[11,1,12,2],[11,3,12,8],[11,9,11,37],[11,38,11,45],[11,46,11,49],[11,50,11,56],[12,9,12,37],[12,38,12,45],[12,46,12,49],[12,50,12,56],[13,1,20,2],[13,3,20,8],[13,9,13,37],[13,38,13,45],[13,46,13,49],[13,50,13,56],[14,9,14,37],[14,38,14,45],[14,46,14,49],[14,50,14,56],[15,9,15,37],[15,38,15,45],[15,46,15,49],[15,50,15,56],[16,9,16,37],[16,38,16,45],[16,46,16,49],[16,50,16,56],[17,9,17,37],[17,38,17,45],[17,46,17,49],[17,50,17,56],[18,9,18,37],[18,38,18,45],[18,46,18,49],[18,50,18,56],[19,9,19,37],[19,38,19,45],[19,46,19,49],[19,50,19,56],[20,9,20,37],[20,38,20,45],[20,46,20,49],[20,50,20,56],[21,1,24,2],[21,3,24,8],[21,9,21,37],[21,38,21,45],[21,46,21,49],[21,50,21,56],[22,9,22,37],[22,38,22,45],[22,46,22,49],[22,50,22,56],[23,9,23,37],[23,38,23,45],[23,46,23,49],[23,50,23,56],[24,9,24,37],[24,38,24,45],[24,46,24,49],[24,50,24,56],[25,1,31,2],[25,3,31,8],[25,9,28,12],[25,13,25,37],[25,38,25,45],[25,46,25,49],[25,50,25,56],[26,13,26,37],[26,38,26,45],[26,46,26,49],[26,50,26,56],[27,13,27,37],[27,38,27,45],[27,46,27,49],[27,50,27,56],[28,13,28,37],[28,38,28,45],[28,46,28,49],[28,50,28,56],[29,9,31,12],[29,13,29,37],[29,38,29,45],[29,46,29,49],[29,50,29,56],[30,13,30,37],[30,38,30,45],[30,46,30,49],[30,50,30,56],[31,13,31,37],[31,38,31,45],[31,46,31,49],[31,50,31,56],[32,1,35,2],[32,3,35,8],[32,9,32,37],[32,38,32,45],[32,46,32,49],[32,50,32,56],[33,9,33,37],[33,38,33,45],[33,46,33,49],[33,50,33,56],[34,9,34,37],[34,38,34,45],[34,46,34,49],[34,50,34,56],[35,9,35,37],[35,38,35,45],[35,46,35,49],[35,50,35,56],[36,1,36,56],[37,1,37,2],[37,3,37,56],[38,3,38,56],[39,1,39,2],[39,3,39,56],[40,1,40,56],[41,1,41,56],[42,1,42,56],[43,1,43,56],[44,1,44,56],[45,1,45,56],[46,1,46,56],[47,1,47,56],[48,1,48,56],[49,1,49,56],[50,1,50,56],[51,1,51,56],[52,1,52,56],[53,1,53,56],[54,1,54,56]]}
[{"$nulls":59},"シートの保護を解除すると編集が可能になります（パスワードなし）"]
[]
[null,"工事監理の状況　C5表（プレキャスト鉄筋コンクリート造）"]
[]
[]
[]
[null,"監　理　項　目",{"$nulls":36},"監　理　記　録"]
[]
[{"$nulls":38},"A",null,"：","目視検査",{"$nulls":4},"結果",{"$nulls":3},"備考"]
[{"$nulls":38},"B",null,"：","実測検査"]
[{"$nulls":38},"C",null,"：","施工者報告"]
[null,1,null,"全体形状及び\n部材の配置",{"$nulls":5},"①建築物の平面形状"]
[{"$nulls":9},"②プレキャスト部材の配置"]
["○",2,null,"プレキャスト\n部材",{"$nulls":5},"①部材の形状、寸法"]
[{"$nulls":9},"②製作材料の品質"]
[{"$nulls":9},"③鉄筋、型枠の加工・組立"]
[{"$nulls":9},"④コンクリート打設状況"]
[{"$nulls":9},"⑤養生、脱型及びひび割れ防止対策等"]
[{"$nulls":9},"⑥コンクリートの所要強度"]
[{"$nulls":9},"⑦プレキャストの導入"]
[{"$nulls":9},"⑧製品出荷時の品質確認検査"]
["○",3,null,"組立・建方",{"$nulls":5},"①組立・建方の精度"]
[{"$nulls":9},"②接合部の仕様、接合状況"]
[{"$nulls":9},"③継手部分の検査"]
[{"$nulls":9},"④ひび割れ、破損の有無"]
["○",4,null,"現場施工部分",{"$nulls":5},"鉄筋",{"$nulls":3},"①部材の形状、寸法"]
["○",{"$nulls":12},"②鉄筋の径、配置等"]
["○",{"$nulls":12},"③継手位置、定着長さ、フック等"]
["○",{"$nulls":12},"④かぶり厚さ"]
["○",{"$nulls":8},"型枠",{"$nulls":3},"①各部の寸法"]
[{"$nulls":13},"②せき板、支保工等の設置状況"]
[{"$nulls":13},"③型枠内の清掃、異物の除去"]
[null,5,null,"その他",{"$nulls":5},"①"]
[{"$nulls":9},"②"]
[{"$nulls":9},"③"]
[{"$nulls":9},"④"]
[]
[null,"※",null,"工事監理者は、監理記録欄に監理状況の結果を記入し、中間検査申請書と同時に提出してください。"]
[{"$nulls":3},"なお、否となった事項についてはそれに対する措置等を下記に記入してください。"]
[null,"※",null,"該当する項目のみ記入してください。"]
{"$rows_empty":18}
[{"$nulls":3},"A ・ B ・ C",{"$nulls":5},"A ・ B ・ C",{"$nulls":6},"適 ・否"]
[]
[{"$nulls":3},"Ⓐ",{"$nulls":5},"Ⓐ ・ Ⓑ",{"$nulls":6},"適"]
[{"$nulls":3},"Ⓐ ・ Ⓑ",{"$nulls":5},"Ⓐ ・ Ⓑ ・ Ⓒ",{"$nulls":6},"否"]
[{"$nulls":3},"Ⓐ ・ Ⓒ",{"$nulls":5},"Ⓑ",{"$nulls":6},"該当なし"]
[{"$nulls":3},"Ⓐ ・ Ⓑ ・ Ⓒ",{"$nulls":5},"Ⓑ ・ Ⓒ",{"$nulls":6},"-"]
[{"$nulls":3},"Ⓑ",{"$nulls":5},"-"]
[{"$nulls":3},"Ⓑ ・ Ⓒ"]
[{"$nulls":3},"Ⓒ"]
[{"$nulls":3},"-"]

{"sheet":"C6表【組積造】","index":36,"n_rows":68,"n_cols":60,"rows_kept":68,"merged":[[1,1,1,56],[2,1,3,37],[2,38,3,56],[4,1,4,56],[5,1,5,56],[6,1,10,8],[6,9,10,37],[6,38,7,56],[8,38,8,39],[8,41,8,45],[8,46,10,49],[8,50,10,56],[9,38,9,39],[9,41,9,45],[10,38,10,39],[10,41,10,45],[11,1,12,2],[11,3,12,8],[11,9,11,37],[11,38,11,45],[11,46,11,49],[11,50,11,56],[12,9,12,37],[12,38,12,45],[12,46,12,49],[12,50,12,56],[13,1,15,2],[13,3,15,8],[13,9,13,37],[13,38,13,45],[13,46,13,49],[13,50,13,56],[14,9,14,37],[14,38,14,45],[14,46,14,49],[14,50,14,56],[15,9,15,37],[15,38,15,45],[15,46,15,49],[15,50,15,56],[16,1,18,2],[16,3,18,8],[16,9,16,37],[16,38,16,45],[16,46,16,49],[16,50,16,56],[17,9,17,37],[17,38,17,45],[17,46,17,49],[17,50,17,56],[18,9,18,37],[18,38,18,45],[18,46,18,49],[18,50,18,56],[19,1,22,2],[19,3,22,8],[19,9,19,37],[19,38,19,45],[19,46,19,49],[19,50,19,56],[20,9,20,37],[20,38,20,45],[20,46,20,49],[20,50,20,56],[21,9,21,37],[21,38,21,45],[21,46,21,49],[21,50,21,56],[22,9,22,37],[22,38,22,45],[22,46,22,49],[22,50,22,56],[23,1,27,2],[23,3,27,8],[23,9,23,37],[23,38,23,45],[23,46,23,49],[23,50,23,56],[24,9,24,37],[24,38,24,45],[24,46,24,49],[24,50,24,56],[25,9,25,37],[25,38,25,45],[25,46,25,49],[25,50,25,56],[26,9,26,37],[26,38,26,45],[26,46,26,49],[26,50,26,56],[27,9,27,37],[27,38,27,45],[27,46,27,49],[27,50,27,56],[28,1,31,2],[28,3,31,8],[28,9,28,37],[28,38,28,45],[28,46,28,49],[28,50,28,56],[29,9,29,37],[29,38,29,45],[29,46,29,49],[29,50,29,56],[30,9,30,37],[30,38,30,45],[30,46,30,49],[30,50,30,56],[31,9,31,37],[31,38,31,45],[31,46,31,49],[31,50,31,56],[32,1,35,2],[32,3,35,8],[32,9,32,37],[32,38,32,45],[32,46,32,49],[32,50,32,56],[33,9,33,37],[33,38,33,45],[33,46,33,49],[33,50,33,56],[34,9,34,37],[34,38,34,45],[34,46,34,49],[34,50,34,56],[35,9,35,37],[35,38,35,45],[35,46,35,49],[35,50,35,56],[36,1,36,56],[37,1,37,2],[37,3,37,56],[38,3,38,56],[39,1,39,2],[39,3,39,56],[40,1,40,56],[41,1,41,56],[42,1,42,56],[43,1,43,56],[44,1,44,56],[45,1,45,56],[46,1,46,56],[47,1,47,56],[48,1,48,56],[49,1,49,56],[50,1,50,56],[51,1,51,56],[52,1,52,56],[53,1,53,56],[54,1,54,56]]}
[{"$nulls":59},"シートの保護を解除すると編集が可能になります（パスワードなし）"]
[]
[null,"工事監理の状況　C6表（組積造）"]
[]
[]
[]
[null,"監　理　項　目",{"$nulls":36},"監　理　記　録"]
[]
[{"$nulls":38},"A",null,"：","目視検査",{"$nulls":4},"結果",{"$nulls":3},"備考"]
[{"$nulls":38},"B",null,"：","実測検査"]
[{"$nulls":38},"C",null,"：","施工者報告"]
[null,1,null,"全体形状及び\n部材の配置",{"$nulls":5},"①建築物の平面形状"]
[{"$nulls":9},"②壁の配置"]
[null,2,null,"施工一般",{"$nulls":5},"①使用材料の水洗い"]
[{"$nulls":9},"②モルタルの配合"]
[{"$nulls":9},"③目地の形状（芋目地としない）"]
["○",3,null,"壁",{"$nulls":5},"①壁の長さ"]
["○",{"$nulls":8},"②外壁の厚さ"]
["○",{"$nulls":8},"③間仕切壁の厚さ"]
["○",4,null,"臥梁・床版",{"$nulls":5},"①臥梁の形状、寸法"]
["○",{"$nulls":8},"②鉄筋の径、本数、配置等"]
["○",{"$nulls":8},"③鉄筋の継手位置、定着長さ"]
["○",{"$nulls":8},"④鉄筋のかぶり厚さ"]
[null,5,null,"開口部",{"$nulls":5},"①開口部幅の総和"]
[{"$nulls":9},"②各階の開口部幅の総和"]
["○",{"$nulls":8},"③上下開口部間の垂直距離"]
[{"$nulls":9},"④開口部相互間又は開口部と対隣壁の垂直距離"]
[{"$nulls":9},"⑤まぐさの位置"]
["○",6,null,"補強等",{"$nulls":5},"①壁に設けるみぞの深さ、長さ"]
[{"$nulls":9},"②鉄骨軸組との緊結"]
[{"$nulls":9},"③手すり壁頂部の臥梁の設置"]
[{"$nulls":9},"④H12建告第1354号による補強"]
[null,7,null,"その他",{"$nulls":5},"①型枠内の清掃状況"]
[{"$nulls":9},"②"]
[{"$nulls":9},"③"]
[{"$nulls":9},"④"]
[]
[null,"※",null,"工事監理者は、監理記録欄に監理状況の結果を記入し、中間検査申請書と同時に提出してください。"]
[{"$nulls":3},"なお、否となった事項についてはそれに対する措置等を下記に記入してください。"]
[null,"※",null,"該当する項目のみ記入してください。"]
{"$rows_empty":18}
[{"$nulls":3},"A ・ B ・ C",{"$nulls":5},"A ・ B ・ C",{"$nulls":6},"適 ・否"]
[]
[{"$nulls":3},"Ⓐ",{"$nulls":5},"Ⓐ ・ Ⓑ",{"$nulls":6},"適"]
[{"$nulls":3},"Ⓐ ・ Ⓑ",{"$nulls":5},"Ⓐ ・ Ⓑ ・ Ⓒ",{"$nulls":6},"否"]
[{"$nulls":3},"Ⓐ ・ Ⓒ",{"$nulls":5},"Ⓑ",{"$nulls":6},"該当なし"]
[{"$nulls":3},"Ⓐ ・ Ⓑ ・ Ⓒ",{"$nulls":5},"Ⓑ ・ Ⓒ",{"$nulls":6},"-"]
[{"$nulls":3},"Ⓑ",{"$nulls":5},"-"]
[{"$nulls":3},"Ⓑ ・ Ⓒ"]
[{"$nulls":3},"Ⓒ"]
[{"$nulls":3},"-"]

{"sheet":"C7表【補強CB造】","index":37,"n_rows":69,"n_cols":60,"rows_kept":69,"merged":[[1,1,1,56],[2,1,3,37],[2,38,3,56],[4,1,4,56],[5,1,5,56],[6,1,10,8],[6,9,10,37],[6,38,7,56],[8,38,8,39],[8,41,8,45],[8,46,10,49],[8,50,10,56],[9,38,9,39],[9,41,9,45],[10,38,10,39],[10,41,10,45],[11,1,12,2],[11,3,12,8],[11,9,11,37],[11,38,11,45],[11,46,11,49],[11,50,11,56],[12,9,12,37],[12,38,12,45],[12,46,12,49],[12,50,12,56],[13,1,13,2],[13,3,13,8],[13,9,13,37],[13,38,13,45],[13,46,13,49],[13,50,13,56],[14,1,18,2],[14,3,18,8],[14,9,14,37],[14,38,14,45],[14,46,14,49],[14,50,14,56],[15,9,15,37],[15,38,15,45],[15,46,15,49],[15,50,15,56],[16,9,16,37],[16,38,16,45],[16,46,16,49],[16,50,16,56],[17,9,17,37],[17,38,17,45],[17,46,17,49],[17,50,17,56],[18,9,18,37],[18,38,18,45],[18,46,18,49],[18,50,18,56],[19,1,22,2],[19,3,22,8],[19,9,19,37],[19,38,19,45],[19,46,19,49],[19,50,19,56],[20,9,20,37],[20,38,20,45],[20,46,20,49],[20,50,20,56],[21,9,21,37],[21,38,21,45],[21,46,21,49],[21,50,21,56],[22,9,22,37],[22,38,22,45],[22,46,22,49],[22,50,22,56],[23,1,24,2],[23,3,24,8],[23,9,23,37],[23,38,23,45],[23,46,23,49],[23,50,23,56],[24,9,24,37],[24,38,24,45],[24,46,24,49],[24,50,24,56],[25,1,29,2],[25,3,29,8],[25,9,25,37],[25,38,25,45],[25,46,25,49],[25,50,25,56],[26,9,26,37],[26,38,26,45],[26,46,26,49],[26,50,26,56],[27,9,27,37],[27,38,27,45],[27,46,27,49],[27,50,27,56],[28,9,28,37],[28,38,28,45],[28,46,28,49],[28,50,28,56],[29,9,29,37],[29,38,29,45],[29,46,29,49],[29,50,29,56],[30,1,30,56],[31,1,31,2],[31,3,31,56],[32,3,32,56],[33,1,33,2],[33,3,33,56],[34,1,34,56],[35,1,35,56],[36,1,36,56],[37,1,37,56],[38,1,38,56],[39,1,39,56],[40,1,40,56],[41,1,41,56],[42,1,42,56],[43,1,43,56],[44,1,44,56],[45,1,45,56],[46,1,46,56],[47,1,47,56],[48,1,48,56],[49,1,49,56],[50,1,50,56],[51,1,51,56],[52,1,52,56],[53,1,53,56],[54,1,54,56],[55,1,55,56]]}
[{"$nulls":59},"シートの保護を解除すると編集が可能になります（パスワードなし）"]
[]
[null,"工事監理の状況　C7表（補強コンクリートブロック造）"]
[]
[]
[]
[null,"監　理　項　目",{"$nulls":36},"監　理　記　録"]
[]
[{"$nulls":38},"A",null,"：","目視検査",{"$nulls":4},"結果",{"$nulls":3},"備考"]
[{"$nulls":38},"B",null,"：","実測検査"]
[{"$nulls":38},"C",null,"：","施工者報告"]
[null,1,null,"全体形状及び\n部材の配置",{"$nulls":5},"①建築物の平面形状"]
[{"$nulls":9},"②耐力壁の配置"]
[null,2,null,"使用材料",{"$nulls":5},"①ブロックの種別、仕様"]
["○",3,null,"耐力壁",{"$nulls":5},"①耐力壁の長さ"]
["○",{"$nulls":8},"②耐力壁の厚さ"]
["○",{"$nulls":8},"③補強鉄筋の径、本数、配置"]
["○",{"$nulls":8},"④補強鉄筋の継手位置、定着長さ、フック"]
["○",{"$nulls":8},"⑤補強鉄筋の基礎及び臥梁等への定着"]
["○",4,null,"臥梁・床版",{"$nulls":5},"①臥梁の形状、寸法"]
["○",{"$nulls":8},"②鉄筋の径、本数、配置等"]
["○",{"$nulls":8},"③鉄筋の継手位置、定着長さ"]
["○",{"$nulls":8},"④鉄筋のかぶり厚さ"]
[null,5,null,"目地・空洞部",{"$nulls":5},"①目地モルタルの状況"]
[{"$nulls":9},"②空洞部の充填"]
[null,6,null,"その他",{"$nulls":5},"①型枠内の清掃状況"]
[{"$nulls":9},"②"]
[{"$nulls":9},"③"]
[{"$nulls":9},"④"]
[{"$nulls":9},"⑤"]
[]
[null,"※",null,"工事監理者は、監理記録欄に監理状況の結果を記入し、中間検査申請書と同時に提出してください。"]
[{"$nulls":3},"なお、否となった事項についてはそれに対する措置等を下記に記入してください。"]
[null,"※",null,"該当する項目のみ記入してください。"]
{"$rows_empty":25}
[{"$nulls":3},"A ・ B ・ C",{"$nulls":5},"A ・ B ・ C",{"$nulls":6},"適 ・否"]
[]
[{"$nulls":3},"Ⓐ",{"$nulls":5},"Ⓐ ・ Ⓑ",{"$nulls":6},"適"]
[{"$nulls":3},"Ⓐ ・ Ⓑ",{"$nulls":5},"Ⓐ ・ Ⓑ ・ Ⓒ",{"$nulls":6},"否"]
[{"$nulls":3},"Ⓐ ・ Ⓒ",{"$nulls":5},"Ⓑ",{"$nulls":6},"該当なし"]
[{"$nulls":3},"Ⓐ ・ Ⓑ ・ Ⓒ",{"$nulls":5},"Ⓑ ・ Ⓒ",{"$nulls":6},"-"]
[{"$nulls":3},"Ⓑ",{"$nulls":5},"-"]
[{"$nulls":3},"Ⓑ ・ Ⓒ"]
[{"$nulls":3},"Ⓒ"]
[{"$nulls":3},"-"]

{"sheet":"C8表【丸太組】","index":38,"n_rows":67,"n_cols":60,"rows_kept":67,"merged":[[1,1,1,56],[2,1,3,36],[2,37,3,56],[4,1,4,56],[5,1,5,56],[6,1,10,8],[6,9,10,37],[6,38,7,56],[8,38,8,39],[8,41,8,45],[8,46,10,49],[8,50,10,56],[9,38,9,39],[9,41,9,45],[10,38,10,39],[10,41,10,45],[11,1,14,2],[11,3,14,8],[11,9,11,37],[11,38,11,45],[11,46,11,49],[11,50,11,56],[12,9,12,37],[12,38,12,45],[12,46,12,49],[12,50,12,56],[13,9,13,37],[13,38,13,45],[13,46,13,49],[13,50,13,56],[14,9,14,37],[14,38,14,45],[14,46,14,49],[14,50,14,56],[15,1,16,2],[15,3,16,8],[15,9,15,37],[15,38,15,45],[15,46,15,49],[15,50,15,56],[16,9,16,37],[16,38,16,45],[16,46,16,49],[16,50,16,56],[17,1,18,2],[17,3,18,8],[17,9,17,37],[17,38,17,45],[17,46,17,49],[17,50,17,56],[18,9,18,37],[18,38,18,45],[18,46,18,49],[18,50,18,56],[19,1,26,2],[19,3,26,8],[19,9,19,37],[19,38,19,45],[19,46,19,49],[19,50,19,56],[20,9,20,37],[20,38,20,45],[20,46,20,49],[20,50,20,56],[21,9,21,37],[21,38,21,45],[21,46,21,49],[21,50,21,56],[22,9,22,37],[22,38,22,45],[22,46,22,49],[22,50,22,56],[23,9,23,37],[23,38,23,45],[23,46,23,49],[23,50,23,56],[24,9,24,37],[24,38,24,45],[24,46,24,49],[24,50,24,56],[25,9,25,37],[25,38,25,45],[25,46,25,49],[25,50,25,56],[26,9,26,37],[26,38,26,45],[26,46,26,49],[26,50,26,56],[27,1,28,2],[27,3,28,8],[27,9,27,37],[27,38,27,45],[27,46,27,49],[27,50,27,56],[28,9,28,37],[28,38,28,45],[28,46,28,49],[28,50,28,56],[29,1,30,2],[29,3,30,8],[29,9,29,37],[29,38,29,45],[29,46,29,49],[29,50,29,56],[30,9,30,37],[30,38,30,45],[30,46,30,49],[30,50,30,56],[31,1,31,2],[31,3,31,8],[31,9,31,37],[31,38,31,45],[31,46,31,49],[31,50,31,56],[32,1,35,2],[32,3,35,8],[32,9,32,37],[32,38,32,45],[32,46,32,49],[32,50,32,56],[33,9,33,37],[33,38,33,45],[33,46,33,49],[33,50,33,56],[34,9,34,37],[34,38,34,45],[34,46,34,49],[34,50,34,56],[35,9,35,37],[35,38,35,45],[35,46,35,49],[35,50,35,56],[36,1,36,56],[37,1,37,2],[37,3,37,56],[38,3,38,56],[39,1,39,2],[39,3,39,56],[40,1,40,56],[41,1,41,56],[42,1,42,56],[43,1,43,56],[44,1,44,56],[45,1,45,56],[46,1,46,56],[47,1,47,56],[48,1,48,56],[49,1,49,56],[50,1,50,56],[51,1,51,56],[52,1,52,56],[53,1,53,56]]}
[{"$nulls":59},"シートの保護を解除すると編集が可能になります（パスワードなし）"]
[]
[null,"工事監理の状況　C8表（丸太組構法）"]
[]
[]
[]
[null,"監　理　項　目",{"$nulls":36},"監　理　記　録"]
[]
[{"$nulls":38},"A",null,"：","目視検査",{"$nulls":4},"結果",{"$nulls":3},"備考"]
[{"$nulls":38},"B",null,"：","実測検査"]
[{"$nulls":38},"C",null,"：","施工者報告"]
[null,1,null,"全体形状及び\n部材の配置",{"$nulls":5},"①建築物の形状"]
[{"$nulls":9},"②間取り（壁、床の位置）"]
[{"$nulls":9},"③耐力壁の配置"]
[{"$nulls":9},"④小屋組の形状"]
[null,2,null,"基礎",{"$nulls":5},"①床下換気口等の設置"]
[{"$nulls":9},"②構造体のひび割れの有無"]
["○",3,null,"土台",{"$nulls":5},"①部材の形状、寸法、品質等"]
[{"$nulls":9},"②アンカーボルトの据付及び緊結状況"]
[null,4,null,"耐力壁",{"$nulls":5},"①丸太材の断面積、相互の上下に接する部分の幅"]
["○",{"$nulls":8},"②耐力壁の高さ、幅"]
[{"$nulls":9},"③耐力壁線相互における交差部の突出"]
[{"$nulls":9},"④外壁の耐力璧線相互における交差部の緊結"]
[{"$nulls":9},"⑤開口部上部の壁補強"]
[{"$nulls":9},"⑥開口部周囲の補強"]
[{"$nulls":9},"⑦丸太材等の継手の禁止"]
["○",{"$nulls":8},"⑧だぼの材料、長さ、位置、本数"]
["○",5,null,"根太などの\n横架材",{"$nulls":5},"①部材の形状、寸法、品質等"]
[{"$nulls":9},"②部材下部中央の欠き込み禁止"]
["○",6,null,"床版",{"$nulls":5},"①床材の形状、寸法、品質等"]
[{"$nulls":9},"②床版の各部材相互との緊結"]
[null,7,null,"小屋組",{"$nulls":5},"①構造上主要な部分との緊結"]
["○",8,null,"その他",{"$nulls":5},"①地盤面からの床高さ"]
[{"$nulls":9},"②防腐・防蟻措置"]
[{"$nulls":9},"③腐食のおそれのある緊結金物の防錆措置"]
[{"$nulls":9},"④"]
[]
[null,"※",null,"工事監理者は、監理記録欄に監理状況の結果を記入し、中間検査申請書と同時に提出してください。"]
[{"$nulls":3},"なお、否となった事項についてはそれに対する措置等を下記に記入してください。"]
[null,"※",null,"該当する項目のみ記入してください。"]
{"$rows_empty":17}
[{"$nulls":4},"A ・ B ・ C",{"$nulls":5},"A ・ B ・ C",{"$nulls":6},"適 ・否"]
[]
[{"$nulls":4},"Ⓐ",{"$nulls":5},"Ⓐ ・ Ⓑ",{"$nulls":6},"適"]
[{"$nulls":4},"Ⓐ ・ Ⓑ",{"$nulls":5},"Ⓐ ・ Ⓑ ・ Ⓒ",{"$nulls":6},"否"]
[{"$nulls":4},"Ⓐ ・ Ⓒ",{"$nulls":5},"Ⓑ",{"$nulls":6},"該当なし"]
[{"$nulls":4},"Ⓐ ・ Ⓑ ・ Ⓒ",{"$nulls":5},"Ⓑ ・ Ⓒ",{"$nulls":6},"-"]
[{"$nulls":4},"Ⓑ",{"$nulls":5},"-"]
[{"$nulls":4},"Ⓑ ・ Ⓒ"]
[{"$nulls":4},"Ⓒ"]
[{"$nulls":4},"-"]

{"sheet":"完了一面","index":39,"n_rows":55,"n_cols":34,"rows_kept":55,"merged":[[2,0,2,2],[15,23,15,24],[15,25,15,26],[17,18,17,29],[18,18,18,29],[22,18,22,29],[23,18,23,29],[41,0,41,2],[41,24,41,26]]}
["第十九号様式（第四条、第四条の四の二関係）（Ａ4）"]
[{"$nulls":33},"シートの保護を解除すると編集が可能になります（パスワードなし）"]
[]
["完了検査申請書"]
[]
["（第一面）"]
[]
[]
["　建築基準法第７条第１項又は第７条の２第１項（これらの規定を同法第８７条の４又は第８８条"]
["第１項若しくは第２項において準用する場合を含む。）の規定により、検査を申請します。この申"]
["請書及び添付図書に記載の事項は、事実に相違ありません。"]
[]
[]
["指定確認検査機関"]
["株式会社　確認検査機構アネックス  　様"]
[{"$nulls":23},"令和",{"$nulls":3},"年",null,"月",null,"日",null,"建築主等変更届の提出がないか確認してください"]
[]
[]
[{"$nulls":13},"申請者氏名"]
[]
[]
["第四面に記載の事項は、事実に相違ありません。"]
[]
[{"$nulls":13},"工事監理者氏名"]
[]
[]
[null,null,"【検査を申請する建築物等】"]
[null,null,"■","建築物",{"$nulls":7},"□","建築設備（昇降機）",{"$nulls":9},"□","建築設備（昇降機以外）"]
[null,null,"□","工作物（昇降機）",{"$nulls":7},"□","工作物（法第８８条第１項）",{"$nulls":9},"□","工作物（法第８８条第２項）"]
[]
[]
["※","手数料欄"]
[]
[]
[]
[]
["※受付欄　　　　",{"$nulls":7},"※検査の特例欄",{"$nulls":4},"※検査欄",{"$nulls":5},"※決裁欄",{"$nulls":4},"※検査済証欄"]
[]
[]
[{"$f":"IF(X16=\"\",\"\",X16)","v":"令和"},null,null,"年",null,"月",null,"日",{"$nulls":16},{"$f":"IF(X16=\"\",\"\",X16)","v":"令和"},null,null,"年",null,"月",null,"日"]
["第",{"$nulls":5},{"$f":"IF(C28=\"■\",\"完了建機構ア\",IF(L28=\"■\",\"完了昇機構ア\",IF(L29=\"■\",\"完了工機構ア\",IF(W29=\"■\",\"完了工機構ア\",\"完了　　機構ア\"))))","v":"完了建機構ア"},{"$f":"IF(受付用!B13=\"\",\"\",受付用!B13)","v":""},{"$nulls":16},"第",{"$nulls":5},{"$f":"IF(C28=\"■\",\"完了建機構ア\",IF(L28=\"■\",\"完了昇機構ア\",IF(L29=\"■\",\"完了工機構ア\",IF(W29=\"■\",\"完了工機構ア\",\"完了　　機構ア\"))))","v":"完了建機構ア"},{"$f":"IF(受付用!B13=\"\",\"\",受付用!B13)","v":""}]
[{"$f":"IF(受付用!C13=\"\",\"\",受付用!C13)","v":""},{"$nulls":6},"号","有　・　無",{"$nulls":15},{"$f":"IF(受付用!C13=\"\",\"\",受付用!C13)","v":""},{"$nulls":6},"号"]
["係員氏名",{"$nulls":23},"係員氏名"]
[]
[]
[]
[]
[]
[]
[null,"（注意）第一面"]
[null,null,"数字は算用数字を、単位はメートル法を用いてください。"]
[null,"①","「検査を申請する建築物等」の欄は、該当するチェックボックスに「レ」マークを入れてください。"]
[null,null,"建築基準法第88条第１項に規定する工作物のうち同法施行令第138条第２項第１号に掲げるものにあつ"]
[null,null,"ては、「工作物（昇降機）」のチェックボックスに「レ」マークを入れてください。"]
[null,"②","※印のある欄は記入しないでください。"]

{"sheet":"完了二面","index":40,"n_rows":175,"n_cols":35,"rows_kept":175,"merged":[[5,9,5,31],[6,9,6,31],[7,10,7,15],[8,9,8,31],[9,9,9,15],[13,10,13,11],[13,19,13,22],[13,27,13,30],[14,9,14,31],[15,10,15,11],[15,19,15,21],[15,27,15,30],[16,9,16,31],[17,10,17,15],[18,9,18,31],[19,9,19,15],[24,10,24,11],[24,19,24,22],[24,27,24,30],[25,9,25,31],[26,10,26,11],[26,19,26,21],[26,27,26,30],[27,9,27,31],[28,10,28,15],[29,9,29,31],[30,9,30,15],[31,9,31,31],[34,10,34,11],[34,19,34,22],[34,27,34,30],[35,9,35,31],[36,10,36,11],[36,19,36,21],[36,27,36,30],[37,9,37,31],[38,10,38,15],[39,9,39,31],[40,9,40,15],[41,9,41,31],[43,10,43,11],[43,19,43,22],[43,27,43,30],[44,9,44,31],[45,10,45,11],[45,19,45,21],[45,27,45,30],[46,9,46,31],[47,10,47,15],[48,9,48,31],[49,9,49,15],[50,9,50,31],[52,10,52,11],[52,19,52,22],[52,27,52,30],[53,9,53,31],[54,10,54,11],[54,19,54,21],[54,27,54,30],[55,9,55,31],[56,10,56,15],[57,9,57,31],[58,9,58,15],[59,9,59,31],[64,10,64,11],[64,19,64,22],[64,27,64,30],[65,9,65,31],[66,10,66,11],[66,19,66,21],[66,27,66,30],[67,9,67,31],[68,10,68,15],[69,9,69,31],[70,9,70,15],[71,11,71,31],[74,10,74,11],[74,19,74,22],[74,27,74,30],[75,9,75,31],[76,10,76,11],[76,19,76,21],[76,27,76,30],[77,9,77,31],[78,10,78,15],[79,9,79,31],[80,9,80,15],[81,11,81,31],[83,10,83,11],[83,19,83,22],[83,27,83,30],[84,9,84,31],[85,10,85,11],[85,19,85,21],[85,27,85,30],[86,9,86,31],[87,10,87,15],[88,9,88,31],[89,9,89,15],[90,11,90,31],[92,10,92,11],[92,19,92,22],[92,27,92,30],[93,9,93,31],[94,10,94,11],[94,19,94,21],[94,27,94,30],[95,9,95,31],[96,10,96,15],[97,9,97,31],[98,9,98,15],[99,11,99,31],[104,7,104,31],[105,7,105,31],[106,8,106,13],[107,7,107,31],[108,7,108,13],[109,7,109,13],[110,11,110,31],[113,7,113,31],[114,7,114,31],[115,8,115,13],[116,7,116,31],[117,7,117,13],[118,7,118,13],[119,11,119,31],[121,7,121,31],[122,7,122,31],[123,8,123,13],[124,7,124,31],[125,7,125,13],[126,7,126,13],[127,11,127,31],[129,7,129,31],[130,7,130,31],[131,8,131,13],[132,7,132,31],[133,7,133,13],[134,7,134,13],[135,11,135,31],[139,7,139,31],[140,13,140,16],[140,19,140,25],[141,7,141,31],[142,8,142,13],[143,7,143,31],[144,7,144,13],[147,4,147,31],[148,4,148,31],[149,4,149,31],[149,51,149,78],[150,4,150,31]]}
["建築主等変更届、選定届の提出により確認申請書から記載に変更がないか確認してください。"]
["（第二面）"]
[null,"建築主、設置者又は築造主等の概要",{"$nulls":31},"シートの保護を解除すると編集が可能になります（パスワードなし）"]
[]
["【1.建築主、設置者又は築造主】"]
[null,"【イ.氏名のフリガナ】"]
[null,"【ロ.氏名】"]
[null,"【ハ.郵便番号】",{"$nulls":7},"〒"]
[null,"【ニ.住所】"]
[null,"【ホ.電話番号】"]
[]
[]
["【2.代理者】"]
[null,"【イ.資格】",{"$nulls":7},"（",null,null,"）","建築士",{"$nulls":4},"（",{"$nulls":4},"）","登録",null,"第",{"$nulls":4},"号"]
[null,"【ロ.氏名】"]
[null,"【ハ.建築士事務所名】",{"$nulls":7},"（",null,null,"）","建築士事務所",{"$nulls":4},"（",{"$nulls":3},"）","知事登録第",{"$nulls":7},"号"]
[]
[null,"【ニ.郵便番号】",{"$nulls":7},"〒"]
[null,"【ホ.所在地】"]
[null,"【へ.電話番号】"]
[]
[]
["【3.設計者】"]
[null,"(代表となる設計者)"]
[null,"【イ.資格】",{"$nulls":7},"（",null,null,"）","建築士",{"$nulls":4},"（",{"$nulls":4},"）","登録",null,"第",{"$nulls":4},"号"]
[null,"【ロ.氏名】"]
[null,"【ハ.建築士事務所名】",{"$nulls":7},"（",null,null,"）","建築士事務所",{"$nulls":4},"（",{"$nulls":3},"）","知事登録第",{"$nulls":7},"号"]
[]
[null,"【ニ.郵便番号】",{"$nulls":7},"〒"]
[null,"【ホ.所在地】"]
[null,"【へ.電話番号】"]
[null,"【ト.作成した設計図書】"]
[]
[null,"(その他の設計者)"]
[null,"【イ.資格】",{"$nulls":7},"（",null,null,"）","建築士",{"$nulls":4},"（",{"$nulls":4},"）","登録",null,"第",{"$nulls":4},"号"]
[null,"【ロ.氏名】"]
[null,"【ハ.建築士事務所名】",{"$nulls":7},"（",null,null,"）","建築士事務所",{"$nulls":4},"（",{"$nulls":3},"）","知事登録第",{"$nulls":7},"号"]
[]
[null,"【ニ.郵便番号】",{"$nulls":7},{"$f":"IF(K39=\"\",\"\",\"〒\")","v":""}]
[null,"【ホ.所在地】"]
[null,"【へ.電話番号】"]
[null,"【ト.作成した設計図書】"]
[]
[null,"【イ.資格】",{"$nulls":7},"（",null,null,"）","建築士",{"$nulls":4},"（",{"$nulls":4},"）","登録",null,"第",{"$nulls":4},"号"]
[null,"【ロ.氏名】"]
[null,"【ハ.建築士事務所名】",{"$nulls":7},"（",null,null,"）","建築士事務所",{"$nulls":4},"（",{"$nulls":3},"）","知事登録第",{"$nulls":7},"号"]
[]
[null,"【ニ.郵便番号】",{"$nulls":7},{"$f":"IF(K48=\"\",\"\",\"〒\")","v":""}]
[null,"【ホ.所在地】"]
[null,"【へ.電話番号】"]
[null,"【ト.作成した設計図書】"]
[]
[null,"【イ.資格】",{"$nulls":7},"（",null,null,"）","建築士",{"$nulls":4},"（",{"$nulls":4},"）","登録",null,"第",{"$nulls":4},"号"]
[null,"【ロ.氏名】"]
[null,"【ハ.建築士事務所名】",{"$nulls":7},"（",null,null,"）","建築士事務所",{"$nulls":4},"（",{"$nulls":3},"）","知事登録第",{"$nulls":7},"号"]
[]
[null,"【ニ.郵便番号】",{"$nulls":7},{"$f":"IF(K57=\"\",\"\",\"〒\")","v":""}]
[null,"【ホ.所在地】"]
[null,"【へ.電話番号】"]
[null,"【ト.作成した設計図書】"]
[]
[]
["【4.工事監理者】"]
[null,"(代表となる工事監理者)"]
[null,"【イ.資格】",{"$nulls":7},"（",null,null,"）","建築士",{"$nulls":4},"（",{"$nulls":4},"）","登録",null,"第",{"$nulls":4},"号"]
[null,"【ロ.氏名】"]
[null,"【ハ.建築士事務所名】",{"$nulls":7},"（",null,null,"）","建築士事務所",{"$nulls":4},"（",{"$nulls":3},"）","知事登録第",{"$nulls":7},"号"]
[]
[null,"【ニ.郵便番号】",{"$nulls":7},"〒"]
[null,"【ホ.所在地】"]
[null,"【へ.電話番号】"]
[null,"【ト.工事と照合した設計図書】"]
[]
[null,"(その他の工事監理者)"]
[null,"【イ.資格】",{"$nulls":7},"（",null,null,"）","建築士",{"$nulls":4},"（",{"$nulls":4},"）","登録",null,"第",{"$nulls":4},"号"]
[null,"【ロ.氏名】"]
[null,"【ハ.建築士事務所名】",{"$nulls":7},"（",null,null,"）","建築士事務所",{"$nulls":4},"（",{"$nulls":3},"）","知事登録第",{"$nulls":7},"号"]
[]
[null,"【ニ.郵便番号】",{"$nulls":7},{"$f":"IF(K79=\"\",\"\",\"〒\")","v":""}]
[null,"【ホ.所在地】"]
[null,"【へ.電話番号】"]
[null,"【ト.工事と照合した設計図書】"]
[]
[null,"【イ.資格】",{"$nulls":7},"（",null,null,"）","建築士",{"$nulls":4},"（",{"$nulls":4},"）","登録",null,"第",{"$nulls":4},"号"]
[null,"【ロ.氏名】"]
[null,"【ハ.建築士事務所名】",{"$nulls":7},"（",null,null,"）","建築士事務所",{"$nulls":4},"（",{"$nulls":3},"）","知事登録第",{"$nulls":7},"号"]
[]
[null,"【ニ.郵便番号】",{"$nulls":7},{"$f":"IF(K88=\"\",\"\",\"〒\")","v":""}]
[null,"【ホ.所在地】"]
[null,"【へ.電話番号】"]
[null,"【ト.工事と照合した設計図書】"]
[]
[null,"【イ.資格】",{"$nulls":7},"（",null,null,"）","建築士",{"$nulls":4},"（",{"$nulls":4},"）","登録",null,"第",{"$nulls":4},"号"]
[null,"【ロ.氏名】"]
[null,"【ハ.建築士事務所名】",{"$nulls":7},"（",null,null,"）","建築士事務所",{"$nulls":4},"（",{"$nulls":3},"）","知事登録第",{"$nulls":7},"号"]
[]
[null,"【ニ.郵便番号】",{"$nulls":7},{"$f":"IF(K97=\"\",\"\",\"〒\")","v":""}]
[null,"【ホ.所在地】"]
[null,"【へ.電話番号】"]
[null,"【ト.工事と照合した設計図書】"]
[]
[]
["【5.建築設備の設計に関し意見を聴いた者】"]
[null,"(代表となる建築設備の工事監理に関し意見を聴いた者)"]
[null,"【イ.氏名】"]
[null,"【ロ.勤務先】"]
[null,"【ハ.郵便番号】",{"$nulls":5},{"$f":"IF(I107=\"\",\"\",\"〒\")","v":""}]
[null,"【ニ.所在地】"]
[null,"【ホ.電話番号】"]
[null,"【ヘ.登録番号】"]
[null,"【ト.意見を聴いた設計図書】"]
[]
[null,"(その他の建築設備の工事監理に関し意見を聴いた者)"]
[null,"【イ.氏名】"]
[null,"【ロ.勤務先】"]
[null,"【ハ.郵便番号】",{"$nulls":5},{"$f":"IF(I116=\"\",\"\",\"〒\")","v":""}]
[null,"【ニ.所在地】"]
[null,"【ホ.電話番号】"]
[null,"【ヘ.登録番号】"]
[null,"【ト.意見を聴いた設計図書】"]
[]
[null,"【イ.氏名】"]
[null,"【ロ.勤務先】"]
[null,"【ハ.郵便番号】",{"$nulls":5},{"$f":"IF(I124=\"\",\"\",\"〒\")","v":""}]
[null,"【ニ.所在地】"]
[null,"【ホ.電話番号】"]
[null,"【ヘ.登録番号】"]
[null,"【ト.意見を聴いた設計図書】"]
[]
[null,"【イ.氏名】"]
[null,"【ロ.勤務先】"]
[null,"【ハ.郵便番号】",{"$nulls":5},{"$f":"IF(I132=\"\",\"\",\"〒\")","v":""}]
[null,"【ニ.所在地】"]
[null,"【ホ.電話番号】"]
[null,"【ヘ.登録番号】"]
[null,"【ト.意見を聴いた設計図書】"]
[]
[]
["【6.工事施工者】"]
[null,"【イ.氏名】"]
[null,"【ロ.営業所名】",{"$nulls":5},"建設業の許可",{"$nulls":4},"（",{"$nulls":4},"）","第",{"$nulls":7},"号"]
[]
[null,"【ハ.郵便番号】",{"$nulls":5},"〒"]
[null,"【ニ.所在地】"]
[null,"【ホ.電話番号】"]
[]
[]
["【7.備考】"]
[]
[{"$nulls":33},"←","建築物の名称又は工事名(フリガナ）"]
[{"$nulls":33},"←","建築物の名称又は工事名"]
[]
[]
[]
[]
[null,"（注意）第二面"]
[null,null,"数字は算用数字を、単位はメートル法を用いてください。"]
[null,"①","建築主、設置者又は築造主が２以上のときは、１欄は代表となる建築主、設置者又は築造主について"]
[null,null,"記入し、別紙に他の建築主、設置者又は築造主についてそれぞれ必要な事項を記入して添えてください。"]
[null,"②","建築主、設置者又は築造主からの委任を受けて申請を行う者がいる場合においては、２欄に記入して"]
[null,null,"ください。"]
[null,"③","２欄、３欄及び５欄は、代理者、設計者又は工事監理者が建築士事務所に属しているときは、その名"]
[null,null,"称を書き、建築士事務所に属していないときは、所在地はそれぞれ代理者、設計者又は工事監理者の住"]
[null,null,"所を書いてください。"]
[null,"④","３欄、４欄及び５欄は、それぞれ代表となる設計者、工事監理者及び建築設備の工事監理に関し意見"]
[null,null,"を聴いた者並びに申請に係る建築物に係る他のすべての設計者、工事監理者及び建築設備の工事監理に"]
[null,null,"関し意見を聴いた者について記入してください。記入欄が不足する場合には、別紙に必要な事項を記入"]
[null,null,"して添えてください。"]
[null,"⑤","５欄は、建築士法第20条第５項に規定する場合（工事監理に係る場合に限る。）に、同項に定める資"]
[null,null,"格を有する者について記入し、所在地は、その者が勤務しているときは勤務先の所在地を、勤務してい"]
[null,null,"ないときはその者の住所を登録番号は建築士法施行規則（昭和25年建設省令第38号）第17条の35第"]
[null,null,"１項の規定による登録を受けている場合の当該登録番号を書いてください。"]
[null,"⑥","６欄は、工事施工者が２以上のときは、代表となる工事施工者について記入し、別紙に他の工事施工者"]
[null,null,"について棟別にそれぞれ必要な事項を記入して添えてください。"]
[null,"⑦","建築物又は工作物の名称又は工事名が定まつているときは、７欄に記入してください。"]

{"sheet":"完了三面","index":41,"n_rows":64,"n_cols":66,"rows_kept":64,"merged":[[3,7,3,32],[4,7,4,32],[6,22,6,27],[9,22,9,31],[10,12,10,13],[10,14,10,17],[10,19,10,20],[10,21,10,23],[11,12,11,13],[11,14,11,15],[11,17,11,18],[11,20,11,21],[12,10,12,29],[13,12,13,13],[13,14,13,15],[13,17,13,18],[13,20,13,21],[14,12,14,13],[14,14,14,15],[14,17,14,18],[14,20,14,21],[15,12,15,21],[16,14,16,19],[16,24,16,29],[17,13,17,20],[17,23,17,30],[18,13,18,20],[18,23,18,30],[19,13,19,20],[19,23,19,30],[20,13,20,14],[20,23,20,24],[22,11,22,32],[23,6,23,32],[24,1,24,32],[25,1,25,32],[26,1,26,32],[27,1,27,32],[28,1,28,32],[29,1,29,32],[31,1,31,32],[32,1,32,32],[33,1,33,32],[34,1,34,32],[35,1,35,32],[36,1,36,32],[41,37,41,39],[42,37,42,39],[43,37,43,39],[44,37,44,39]]}
["（第三面）"]
[null,"申請する工事の概要",{"$nulls":33},"シートの保護を解除すると編集が可能になります（パスワードなし）",{"$nulls":29},"確認建機構ア"]
["【1.建築場所、設置場所又は築造場所】",{"$nulls":64},"変認建機構ア"]
[null,"【イ.地名地番】",{"$nulls":63},"㈱確認検査機構アネックス"]
[null,"【ロ.住居表示】",{"$nulls":63},"第○○中間建機構ア○○○"]
["【2.工事種別】",{"$nulls":64},1]
[null,"【イ.建築基準法施行令第１０条各号に掲げる建築物の区分】",{"$nulls":19},"第",{"$nulls":6},"号",{"$nulls":36},2]
[null,"【ロ.工事種別】",{"$nulls":5},"□","新築",{"$nulls":5},"□","増築",{"$nulls":5},"□","改築",{"$nulls":5},"□","移転",{"$nulls":35},3]
[{"$nulls":7},"□","大規模の修繕",{"$nulls":5},"□","大規模の模様替",{"$nulls":5},"□","建築設備の設置",{"$nulls":42},4]
[null,"【ハ.建築基準法第68条の20第2項の検査の特例に係る認証番号】"]
["【3.確認済証番号】",{"$nulls":10},"第",{"$nulls":6},{"$f":"IF(受付用!B13=\"\",\"\",受付用!B13)","v":""},{"$f":"IF(受付用!C13=\"\",\"\",受付用!C13)","v":""},{"$nulls":4},"号"]
["【4.確認済証交付年月日】",{"$nulls":11},"令和",{"$nulls":3},"年",null,null,"月",null,null,"日"]
["【5.確認済証交付者】",{"$nulls":9},"　　　株式会社確認検査機構アネックス"]
["【6.工事着手年月日】",{"$nulls":11},"令和",{"$nulls":3},"年",null,null,"月",null,null,"日",{"$nulls":14},"●滋賀県●"]
["【7.工事完了（予定）年月日】",{"$nulls":11},"令和",{"$nulls":3},"年",null,null,"月",null,null,"日",{"$nulls":14},"土台、柱、はりおよび筋かいを金物等により接合する工事の工程"]
["【8.検査対象床面積】",{"$nulls":21},"㎡",{"$nulls":14},"壁を設置する工事の工程"]
["【9.検査経過】",{"$nulls":11},"（第",{"$nulls":7},"回","）","（第",{"$nulls":7},"回","）",{"$nulls":5},"鉄骨の軸組を溶接し、またはボルト等により接合する工事(建て方)の工程"]
[null,"【イ.特定工程】",{"$nulls":10},"（",{"$nulls":8},"）","（",{"$nulls":8},"）",{"$nulls":5},"2階の床版の取り付けまたは床版の鉄筋を配置する工事の工程"]
[null,"【ロ.中間検査合格証交付者】 ",{"$nulls":10},"（",{"$nulls":8},"）","（",{"$nulls":8},"）",{"$nulls":5},"基礎および地中梁に鉄筋を配置する工事の工程"]
[null,"【ハ.中間検査合格証番号】",{"$nulls":10},"（",{"$nulls":8},"）","（",{"$nulls":8},"）",{"$nulls":5},"2階の床およびこれを支持する梁に鉄筋を配置する工事の工程"]
[null,"【ニ.交付年月日】　",{"$nulls":10},"（","令和",null,null,"年",null,"月",null,"日","）","（","令和",null,null,"年",null,"月",null,"日","）",{"$nulls":5},"●京都市●特殊な構造の場合は名称が異なりますのでご注意ください。"]
["【10.確認以降の軽微な変更の概要】",{"$nulls":36},"地中はりの鉄筋を配置する工事の工程"]
[null,"【イ.変更された設計図書の種類】",{"$nulls":35},"構造耐力上主要な部分である壁、柱、横架材、筋かい及び木板その他これに類するものの仕口、継手を金物等により接合する工事の工程"]
[null,"【ロ.変更の概要】",{"$nulls":35},"耐力壁、小屋ばり組及び屋根版を設置する工事の工程"]
[{"$nulls":37},"軸組、床組及び小屋ばり組をボルト等により接合、また溶接する工事の工程"]
[{"$nulls":37},"２階の床（平家にあっては屋根）及びこれを支持するはりに鉄筋を配置する工事の工程"]
[{"$nulls":37},"2階の床及びこれを支持するはりに鉄筋を配置する工事の工程"]
[{"$nulls":37},"●京都府●"]
[{"$nulls":37},"木造の軸組を金物等により接合する工事の工程"]
[{"$nulls":37},"耐力壁の設置工事の工程"]
["【11.備考】",{"$nulls":36},"２階の床及びこれを支持するはりの配筋工事の工程"]
[{"$nulls":37},"２階のはり及び床版の取付け工事の工程"]
[{"$nulls":37},"屋根床版の配筋工事又は建方工事の工程"]
[{"$nulls":37},"●宇治市●　★★木造の軸組については京都府の欄をご利用ください★★"]
[{"$nulls":37},"木造の軸組を金物等により接合する工事の工程"]
[{"$nulls":37},"木材で組まれた枠組を設置する工事の工程"]
[{"$nulls":37},"2階の床の配筋工事の工程"]
[{"$nulls":37},"2階のはりおよび床版の取付け工事の工程"]
[{"$nulls":37},"屋根床版の配筋工事または建方工事の工程"]
[{"$nulls":37},"●大阪府・奈良県は直接入力してください●"]
[null,"（注意）第一面"]
[null,null,"数字は算用数字を、単位はメートル法を用いてください。",{"$nulls":34},"2024"]
[null,"①","住居表示が定まつているときは、１欄の「ロ」に記入してください。",{"$nulls":34},"2025"]
[null,"②","２欄の「イ」は、建築物が建築基準法施行令第10条各号に掲げる建築物に該当する場合に、当該各号",{"$nulls":34},"2026"]
[null,null,"の数字を記入してください。",{"$nulls":34},"2027"]
[null,"③","２欄の「ロ」は、該当するチェックボックスに「レ」マークを入れてください。"]
[null,"④","２欄の「ハ」は、認証型式部材等製造者が製造をした当該認証に係る型式部材等を有する場合に、その"]
[null,null,"認証番号を記載してください。"]
[null,"⑤","３欄、４欄及び５欄は、計画変更の確認を受けている場合は直前の計画変更の確認について記載して"]
[null,null,"ください。"]
[null,"⑥","９欄は、記入欄が不足する場合には、別紙に必要な事項を記入して添えてください。"]
[null,"⑦","10欄は、軽微な設計変更が２以上あるときは、その一について記入し、別紙にその他の軽微な設計変"]
[null,null,"更について、必要な事項を記入して添えてください。"]
[null,"⑧","10欄の「ロ」は、変更の内容、変更の理由等の概要を記入してください。"]
[null,"⑨","10欄は、特定工程に係る建築物にあつては、この申請を直前の中間検査を申請した建築主事に対"]
[null,null,"して行う場合には、確認から直前の中間検査までに生じた軽微な設計変更の概要について記入する"]
[null,null,"必要はありません。また、それ以外の場合で、確認から直前の中間検査までに生じた軽微な設計変"]
[null,null,"更の概要についてこの欄に記載すべき事項を記載した書類を別に添付すれば、その部分について記"]
[null,null,"入する必要はありません。"]
[null,"⑩","10欄は、申請建築物について変更後も建築物の計画が建築基準関係規定に適合することが明らかなこ"]
[null,null,"とが確かめられた旨の図書を添えてください。"]
[null,"⑪","検査後も引き続き建築基準法第３条第２項（同法第86条の９第１項において準用する場合を含"]
[null,null,"む。）の規定の適用を受ける場合は、その根拠となる規定及び不適合の規定を11欄又は別紙に記載"]
[null,null,"して添えてください。"]

{"sheet":"完了四面","index":42,"n_rows":52,"n_cols":9,"rows_kept":52,"merged":[[3,0,4,0],[3,1,4,1],[3,2,4,2],[3,3,4,3],[3,4,4,4],[3,5,4,5],[3,7,4,7],[16,1,16,6]]}
["（第四面）"]
["工事監理の状況",{"$nulls":7},"シートの保護を解除すると編集が可能になります（パスワードなし）"]
[]
[null,"確認を行つた部位、材料の種類等","照合内容","照合を行つた設計図書","設計図書の内容について設計者に確認した事項","照合方法","照合結果"]
[{"$nulls":6},"（不適の場合には建築主に対して行った報告の内容）"]
["敷地の形状、高さ、衛生及び安全"]
["主要構造部及び主要構造部以外の構造耐力上主要な部分に用いる材料（接合材料を含む。）の種類、品質、形状及び寸法"]
["主要構造部及び主要構造部以外の構造耐力上主要な部分に用いる材料の接合状況、接合部分の形状等"]
["建築物の各部分の位置、形状及び大きさ"]
["構造耐力上主要な部分の防錆、防腐及び防蟻措置及び状況"]
["特定天井に用いる材料の種類並びに当該特定天井の構造及び施工状況"]
["居室の内装仕上げに用いる建築材料の種別及び当該材料を用いる部分の面積"]
["天井及び壁の室内に面する部分に係る仕上げの材料の種別及び厚さ"]
["開口部に設ける建具の種類及び大きさ"]
["建築設備に用いる材料の種類並びにその照合した内容、構造及び施工状況（区画貫通部の処理状況を含む。）"]
["備         考\n（住宅用防災機器）\n(省エネ基準に係る状況)"]
["備         考"]
[]
[]
["（注意）第一面"]
[null,"数字は算用数字を、単位はメートル法を用いてください。"]
["①","申請建築物（建築基準法第７条の５及び第68条の20第２項（建築物である認証型式部材等に係"]
[null,"る場合に限る。）の適用を受けず、かつ、建築士法第３条から第３条の３までの規定に含まれない"]
[null,"ものを除く。以下同じ。）に関する工事監理の状況について記載してください。ただし、特定工程"]
[null,"に係る建築物にあつては、この申請を直前の中間検査を申請した建築主事に対して行う場合には、"]
[null,"確認から直前の中間検査までの工事監理の状況について記入する必要はありません。また、それ以"]
[null,"外の場合で、確認から直前の中間検査までの工事監理の状況についてこの書類に記載すべき事項を"]
[null,"記載した書類を別に添付すれば、その部分について記入する必要はありません。"]
["②","申請建築物が複数の構造方法からなる場合には、それぞれの構造の部分ごとに記載してください。"]
["③","接合状況のうち、鋼材等の金属材料の溶接又は圧接部分に係る内部欠陥の検査、強度検査等の確"]
[null,"認については、当該部分に係る検査を行つた者の氏名及び資格並びに当該検査に係るサンプル数及"]
[null,"びその結果を記載してください。"]
["④","材料のうち、コンクリートについては、四週圧縮強度、塩化物量、アルカリ骨材反応等の試験又は検査"]
[null,"（以下「試験等」という。）を行つた者、試験等に係るサンプル数及び試験等の結果について記載してく"]
[null,"ださい。"]
["⑤","「特定天井に用いる材料の種類並びに当該特定天井の構造及び施工状況」は、建築基準法施行令第39"]
[null,"条第３項、第81条第１項第３号、第82条の５第７号又は第137条の２第１号イ(3)の規定の適用を受ける"]
[null,"部分について記載してください。"]
["⑥","「居室の内装の仕上げに用いる建築材料の種別及び当該建築材料を用いる部分の面積」は、建築基準法"]
[null,"施行令第20条の７第１項第１号に規定する内装の仕上げに用いる建築材料の種別並びに当該建築材料を"]
[null,"用いる内装の仕上げの部分及び当該部分の面積について記載してください。"]
["⑦","「天井及び壁の室内に面する部分に係る仕上げ」は、建築基準法第35条の２の規定の適用を受ける部"]
[null,"分について記載してください。"]
["⑧","「開口部」は、防火設備の設置が義務付けられている部分、建築基準法第28条第１項の規定の適用を"]
[null,"受ける部分及び同法第35条の適用を受ける部分について記載してください。"]
["⑨","「照合結果」は、「適」・「不適」のいずれかを記入し、工事施工者が注意に従わなかつた場合には「不"]
[null,"適」を記入してください。また、不適の場合には建築主に対して行つた報告の内容を記載してください。"]
["⑩","消防法（昭和23年法律第186号）第９条の２第１項に規定する住宅用防災機器の位置及び種類"]
[null,"その他ここに書き表せない事項で特に報告すべき事項は、備考欄又は別紙に記載して添えてくださ"]
[null,"い。"]
["⑪","この書類に記載すべき事項を含む報告書を別に添付すれば、この書類を別途提出する必要はありませ"]
[null,"ん。"]

{"sheet":"完了ﾁｪｯｸ（12号）","index":43,"n_rows":257,"n_cols":59,"rows_kept":257,"merged":[[11,1,11,56],[12,1,13,36],[12,37,13,56],[14,1,14,56],[15,1,15,2],[15,3,15,10],[15,11,15,12],[15,13,15,15],[15,16,15,21],[15,22,15,23],[15,24,15,26],[15,27,15,29],[15,30,15,31],[15,32,15,41],[15,42,15,44],[15,45,15,46],[15,47,15,48],[15,49,15,50],[15,51,15,52],[15,53,15,54],[15,55,15,56],[16,1,17,2],[16,3,16,10],[16,11,16,56],[17,3,17,10],[17,11,17,56],[18,1,19,2],[18,3,18,10],[18,11,18,14],[18,15,18,22],[18,23,18,30],[18,31,18,40],[18,41,18,44],[18,45,18,46],[18,47,18,54],[18,55,18,56],[19,3,19,10],[19,11,19,56],[20,1,20,56],[22,1,26,8],[22,9,26,37],[22,38,23,56],[24,38,24,39],[24,41,24,45],[24,46,26,49],[24,50,26,56],[25,38,25,39],[25,41,25,45],[26,38,26,39],[26,41,26,45],[27,1,27,2],[27,3,27,8],[27,9,27,37],[27,38,27,45],[27,46,27,49],[27,50,27,56],[28,1,29,2],[28,3,29,8],[28,9,28,37],[28,38,28,45],[28,46,28,49],[28,50,28,56],[29,9,29,37],[29,38,29,45],[29,46,29,49],[29,50,29,56],[30,1,34,2],[30,3,34,8],[30,9,30,37],[30,38,30,45],[30,46,30,49],[30,50,30,56],[31,9,31,37],[31,38,31,45],[31,46,31,49],[31,50,31,56],[32,9,32,37],[32,38,32,45],[32,46,32,49],[32,50,32,56],[33,9,33,37],[33,38,33,45],[33,46,33,49],[33,50,33,56],[34,9,34,37],[34,38,34,45],[34,46,34,49],[34,50,34,56],[35,1,38,2],[35,3,38,8],[35,9,35,37],[35,38,35,45],[35,46,35,49],[35,50,35,56],[36,9,36,37],[36,38,36,45],[36,46,36,49],[36,50,36,56],[37,9,37,37],[37,38,37,45],[37,46,37,49],[37,50,37,56],[38,9,38,37],[38,38,38,45],[38,46,38,49],[38,50,38,56],[39,1,39,2],[39,3,39,8],[39,15,39,17],[39,18,39,37],[39,38,39,45],[39,46,39,49],[39,50,39,56],[40,1,42,2],[40,3,42,8],[40,9,40,37],[40,38,40,45],[40,46,40,49],[40,50,40,56],[41,9,41,37],[41,38,41,45],[41,46,41,49],[41,50,41,56],[42,9,42,37],[42,38,42,45],[42,46,42,49],[42,50,42,56],[43,1,45,2],[43,3,45,8],[43,9,43,37],[43,38,43,45],[43,46,43,49],[43,50,43,56],[44,9,44,37],[44,38,44,45],[44,46,44,49],[44,50,44,56],[45,9,45,37],[45,38,45,45],[45,46,45,49],[45,50,45,56],[46,1,46,56],[47,1,47,2],[47,3,47,56],[48,3,48,56],[49,1,49,2],[49,3,49,56],[50,1,50,56],[51,1,51,56],[52,1,52,56],[53,1,53,56],[54,1,54,56],[55,1,55,56],[56,1,56,56],[57,1,57,56],[58,1,58,56],[59,1,59,56],[61,1,65,8],[61,9,65,37],[61,38,62,56],[63,38,63,39],[63,41,63,45],[63,46,65,49],[63,50,65,56],[64,38,64,39],[64,41,64,45],[65,38,65,39],[65,41,65,45],[66,1,69,2],[66,3,69,8],[66,9,66,37],[66,38,66,45],[66,46,66,49],[66,50,66,56],[67,9,67,37],[67,38,67,45],[67,46,67,49],[67,50,67,56],[68,9,68,37],[68,38,68,45],[68,46,68,49],[68,50,68,56],[69,9,69,37],[69,38,69,45],[69,46,69,49],[69,50,69,56],[70,1,71,2],[70,3,71,8],[70,9,70,37],[70,38,70,45],[70,46,70,49],[70,50,70,56],[71,9,71,37],[71,38,71,45],[71,46,71,49],[71,50,71,56],[72,1,73,2],[72,3,73,8],[72,9,72,37],[72,38,72,45],[72,46,72,49],[72,50,72,56],[73,9,73,37],[73,38,73,45],[73,46,73,49],[73,50,73,56],[74,1,76,2],[74,3,76,8],[74,9,74,37],[74,38,74,45],[74,46,74,49],[74,50,74,56],[75,9,75,37],[75,38,75,45],[75,46,75,49],[75,50,75,56],[76,9,76,37],[76,38,76,45],[76,46,76,49],[76,50,76,56],[77,1,77,2],[77,3,77,8],[77,9,77,37],[77,38,77,45],[77,46,77,49],[77,50,77,56],[78,1,81,2],[78,3,81,8],[78,9,78,37],[78,38,78,45],[78,46,78,49],[78,50,78,56],[79,9,79,37],[79,38,79,45],[79,46,79,49],[79,50,79,56],[80,9,80,37],[80,38,80,45],[80,46,80,49],[80,50,80,56],[81,9,81,37],[81,38,81,45],[81,46,81,49],[81,50,81,56],[82,1,99,2],[82,3,82,56],[83,4,83,8],[83,9,83,37],[83,38,83,45],[83,46,83,49],[83,50,83,56],[84,5,85,8],[84,9,84,37],[84,38,84,45],[84,46,84,49],[84,50,84,56],[85,9,85,37],[85,38,85,45],[85,46,85,49],[85,50,85,56],[86,5,87,8],[86,9,86,37],[86,38,86,45],[86,46,86,49],[86,50,86,56],[87,9,87,37],[87,38,87,45],[87,46,87,49],[87,50,87,56],[88,5,89,8],[88,9,88,37],[88,38,88,45],[88,46,88,49],[88,50,88,56],[89,9,89,37],[89,38,89,45],[89,46,89,49],[89,50,89,56],[90,4,90,8],[90,9,90,37],[90,38,90,45],[90,46,90,49],[90,50,90,56],[91,5,91,8],[91,9,91,37],[91,38,91,45],[91,46,91,49],[91,50,91,56],[92,5,93,8],[92,9,92,37],[92,38,92,45],[92,46,92,49],[92,50,92,56],[93,9,93,37],[93,38,93,45],[93,46,93,49],[93,50,93,56],[94,5,95,8],[94,9,94,37],[94,38,94,45],[94,46,94,49],[94,50,94,56],[95,9,95,37],[95,38,95,45],[95,46,95,49],[95,50,95,56],[96,4,99,8],[96,9,96,37],[96,38,96,45],[96,46,96,49],[96,50,96,56],[97,9,97,37],[97,38,97,45],[97,46,97,49],[97,50,97,56],[98,9,98,37],[98,38,98,45],[98,46,98,49],[98,50,98,56],[99,9,99,37],[99,38,99,45],[99,46,99,49],[99,50,99,56],[100,1,100,56],[102,1,106,8],[102,9,106,37],[102,38,103,56],[104,38,104,39],[104,41,104,45],[104,46,106,49],[104,50,106,56],[105,38,105,39],[105,41,105,45],[106,38,106,39],[106,41,106,45],[107,1,115,2],[107,4,110,8],[107,9,107,37],[107,38,107,45],[107,46,107,49],[107,50,107,56],[108,9,108,37],[108,38,108,45],[108,46,108,49],[108,50,108,56],[109,9,109,37],[109,38,109,45],[109,46,109,49],[109,50,109,56],[110,9,110,37],[110,38,110,45],[110,46,110,49],[110,50,110,56],[111,4,112,8],[111,9,111,37],[111,38,111,45],[111,46,111,49],[111,50,111,56],[112,9,112,37],[112,38,112,45],[112,46,112,49],[112,50,112,56],[113,4,115,8],[113,9,113,37],[113,38,113,45],[113,46,113,49],[113,50,113,56],[114,9,114,37],[114,38,114,45],[114,46,114,49],[114,50,114,56],[115,9,115,37],[115,38,115,45],[115,46,115,49],[115,50,115,56],[116,1,117,2],[116,3,117,8],[116,9,116,37],[116,38,116,45],[116,46,116,49],[116,50,116,56],[117,9,117,37],[117,38,117,45],[117,46,117,49],[117,50,117,56],[118,1,143,2],[118,3,118,56],[119,4,119,8],[119,9,119,37],[119,38,119,45],[119,46,119,49],[119,50,119,56],[120,4,122,8],[120,9,120,37],[120,38,120,45],[120,46,120,49],[120,50,120,56],[121,9,121,16],[121,17,121,20],[121,21,121,26],[121,38,121,45],[121,46,121,49],[121,50,121,56],[122,9,122,37],[122,38,122,45],[122,46,122,49],[122,50,122,56],[123,4,125,8],[123,9,123,16],[123,17,123,20],[123,21,123,37],[123,38,123,45],[123,46,123,49],[123,50,123,56],[124,9,124,37],[124,38,124,45],[124,46,124,49],[124,50,124,56],[125,9,125,37],[125,38,125,45],[125,46,125,49],[125,50,125,56],[126,4,126,8],[126,9,126,37],[126,38,126,56],[127,5,128,8],[127,9,127,37],[127,38,127,45],[127,46,127,49],[127,50,127,56],[128,9,128,37],[128,38,128,45],[128,46,128,49],[128,50,128,56],[129,5,130,8],[129,9,129,37],[129,38,129,45],[129,46,129,49],[129,50,129,56],[130,9,130,37],[130,38,130,45],[130,46,130,49],[130,50,130,56],[131,5,134,8],[131,9,131,37],[131,38,131,45],[131,46,131,49],[131,50,131,56],[132,9,132,37],[132,38,132,45],[132,46,132,49],[132,50,132,56],[133,9,133,37],[133,38,133,45],[133,46,133,49],[133,50,133,56],[134,9,134,37],[134,38,134,45],[134,46,134,49],[134,50,134,56],[135,5,135,8],[135,9,135,37],[135,38,135,45],[135,46,135,49],[135,50,135,56],[136,4,137,8],[136,9,136,37],[136,38,136,45],[136,46,136,49],[136,50,136,56],[137,9,137,37],[137,38,137,45],[137,46,137,49],[137,50,137,56],[138,4,139,8],[138,9,138,37],[138,38,138,45],[138,46,138,49],[138,50,138,56],[139,9,139,37],[139,38,139,45],[139,46,139,49],[139,50,139,56],[140,4,141,8],[140,9,140,22],[140,23,140,26],[140,27,140,37],[140,38,140,45],[140,46,140,49],[140,50,140,56],[141,9,141,37],[141,38,141,45],[141,46,141,49],[141,50,141,56],[142,4,143,8],[142,9,142,37],[142,38,142,45],[142,46,142,49],[142,50,142,56],[143,9,143,37],[143,38,143,45],[143,46,143,49],[143,50,143,56],[144,1,144,56],[146,1,150,8],[146,9,150,37],[146,38,147,56],[148,38,148,39],[148,41,148,45],[148,46,150,49],[148,50,150,56],[149,38,149,39],[149,41,149,45],[150,38,150,39],[150,41,150,45],[151,1,159,2],[151,3,159,8],[151,9,151,37],[151,38,151,45],[151,46,151,49],[151,50,151,56],[152,9,152,37],[152,38,152,45],[152,46,152,49],[152,50,152,56],[153,10,153,37],[153,38,153,45],[153,46,153,49],[153,50,153,56],[154,10,154,37],[154,38,154,45],[154,46,154,49],[154,50,154,56],[155,10,155,37],[155,38,155,45],[155,46,155,49],[155,50,155,56],[156,10,156,37],[156,38,156,45],[156,46,156,49],[156,50,156,56],[157,9,157,37],[157,38,157,45],[157,46,157,49],[157,50,157,56],[158,9,158,37],[158,38,158,45],[158,46,158,49],[158,50,158,56],[159,9,159,37],[159,38,159,45],[159,46,159,49],[159,50,159,56],[160,1,164,2],[160,3,164,8],[160,9,160,37],[160,38,160,45],[160,46,160,49],[160,50,160,56],[161,9,161,37],[161,38,161,45],[161,46,161,49],[161,50,161,56],[162,9,162,37],[162,38,162,45],[162,46,162,49],[162,50,162,56],[163,9,163,37],[163,38,163,45],[163,46,163,49],[163,50,163,56],[164,9,164,37],[164,38,164,45],[164,46,164,49],[164,50,164,56],[165,1,171,2],[165,3,171,8],[165,9,165,37],[165,38,165,45],[165,46,165,49],[165,50,165,56],[166,9,166,37],[166,38,166,45],[166,46,166,49],[166,50,166,56],[167,9,167,37],[167,38,167,45],[167,46,167,49],[167,50,167,56],[168,9,168,37],[168,38,168,45],[168,46,168,49],[168,50,168,56],[169,9,169,37],[169,38,169,45],[169,46,169,49],[169,50,169,56],[170,10,170,37],[170,38,170,45],[170,46,170,49],[170,50,170,56],[171,10,171,37],[171,38,171,45],[171,46,171,49],[171,50,171,56],[172,1,173,2],[172,3,173,8],[172,9,172,28],[172,29,172,32],[172,33,172,37],[172,38,172,45],[172,46,172,49],[172,50,172,56],[173,9,173,28],[173,29,173,32],[173,33,173,37],[173,38,173,45],[173,46,173,49],[173,50,173,56],[174,1,174,2],[174,3,174,8],[174,9,174,37],[174,38,174,45],[174,46,174,49],[174,50,174,56],[175,1,179,2],[175,3,179,8],[175,9,175,37],[175,38,175,45],[175,46,175,49],[175,50,175,56],[176,9,176,37],[176,38,176,45],[176,46,176,49],[176,50,176,56],[177,9,177,37],[177,38,177,45],[177,46,177,49],[177,50,177,56],[178,9,178,37],[178,38,178,45],[178,46,178,49],[178,50,178,56],[179,9,179,37],[179,38,179,45],[179,46,179,49],[179,50,179,56],[180,1,183,2],[180,3,183,8],[180,9,180,37],[180,38,180,45],[180,46,180,49],[180,50,180,56],[181,9,181,37],[181,38,181,45],[181,46,181,49],[181,50,181,56],[182,9,182,37],[182,38,182,45],[182,46,182,49],[182,50,182,56],[183,9,183,37],[183,38,183,45],[183,46,183,49],[183,50,183,56],[184,1,184,2],[184,3,184,8],[184,9,184,37],[184,38,184,45],[184,46,184,49],[184,50,184,56],[185,1,185,2],[185,3,185,8],[185,9,185,37],[185,38,185,45],[185,46,185,49],[185,50,185,56],[186,1,193,2],[186,3,193,8],[186,9,186,37],[186,38,186,45],[186,46,186,49],[186,50,186,56],[187,9,187,37],[187,38,187,45],[187,46,187,49],[187,50,187,56],[188,9,188,37],[188,38,188,45],[188,46,188,49],[188,50,188,56],[189,9,189,37],[189,38,189,45],[189,46,189,49],[189,50,189,56],[190,9,190,37],[190,38,190,45],[190,46,190,49],[190,50,190,56],[191,9,191,37],[191,38,191,45],[191,46,191,49],[191,50,191,56],[192,9,192,37],[192,38,192,45],[192,46,192,49],[192,50,192,56],[193,9,193,37],[193,38,193,45],[193,46,193,49],[193,50,193,56],[196,1,196,56],[197,1,201,8],[197,9,201,37],[197,38,198,56],[199,38,199,39],[199,41,199,45],[199,46,201,49],[199,50,201,56],[200,38,200,39],[200,41,200,45],[201,38,201,39],[201,41,201,45],[202,1,208,2],[202,3,208,8],[202,9,202,37],[202,38,202,45],[202,46,202,49],[202,50,202,56],[203,9,203,37],[203,38,203,45],[203,46,203,49],[203,50,203,56],[204,9,204,37],[204,38,204,45],[204,46,204,49],[204,50,204,56],[205,9,205,37],[205,38,205,45],[205,46,205,49],[205,50,205,56],[206,9,206,37],[206,38,206,45],[206,46,206,49],[206,50,206,56],[207,9,207,37],[207,38,207,45],[207,46,207,49],[207,50,207,56],[208,9,208,37],[208,38,208,45],[208,46,208,49],[208,50,208,56],[209,1,214,2],[209,3,214,8],[209,9,209,37],[209,38,209,45],[209,46,209,49],[209,50,209,56],[210,9,210,37],[210,38,210,45],[210,46,210,49],[210,50,210,56],[211,9,211,37],[211,38,211,45],[211,46,211,49],[211,50,211,56],[212,9,212,37],[212,38,212,45],[212,46,212,49],[212,50,212,56],[213,9,213,37],[213,38,213,45],[213,46,213,49],[213,50,213,56],[214,9,214,37],[214,38,214,45],[214,46,214,49],[214,50,214,56],[215,1,218,2],[215,3,218,8],[215,9,215,37],[215,38,215,45],[215,46,215,49],[215,50,215,56],[216,9,216,37],[216,38,216,45],[216,46,216,49],[216,50,216,56],[217,9,217,37],[217,38,217,45],[217,46,217,49],[217,50,217,56],[218,9,218,37],[218,38,218,45],[218,46,218,49],[218,50,218,56],[219,1,221,2],[219,3,221,8],[219,9,219,37],[219,38,219,45],[219,46,219,49],[219,50,219,56],[220,9,220,37],[220,38,220,45],[220,46,220,49],[220,50,220,56],[221,9,221,37],[221,38,221,45],[221,46,221,49],[221,50,221,56],[222,1,222,53],[223,1,223,2],[223,3,223,56],[224,3,224,56],[225,1,225,2],[225,3,225,56],[226,1,226,56],[227,1,227,56],[228,1,228,56],[229,1,229,56],[230,1,230,56],[231,1,231,56],[232,1,232,56],[233,1,233,56],[234,1,234,56],[235,1,235,56],[236,1,236,56],[237,1,237,56],[238,1,238,56],[239,1,239,56],[240,1,240,56],[241,1,241,56],[242,1,242,56],[243,1,243,56],[244,1,244,56]]}
[null,"工事監理の状況（完了検査時チェックシート）の取扱いについて（概要）"]
[null,"1・2号建築物用",{"$nulls":56},"シートの保護を解除すると編集が可能になります（パスワードなし）"]
[null,null,"◆","設備に関しては項目のないものもありますので、各申請物件に合った設備項目をその他欄に追加記入して下さい。"]
[null,null,"◆","防火区画、界壁等の検査時見え隠れ部分の施工状況が確認できる資料(施工写真等)を提出してください。"]
[null,null,"◆","内装仕上げの完了した写真を提出してください。"]
[null,null,"◆","上記確認資料(写真)については、黒板等で物件名、撮影年月日が確認できるように撮影してください。"]
[null,null,"◆","中間検査が対象外の建築物に関しては、工事監理の状況（中間検査時チェックシート）も併せて添付してください。"]
[null,null,"◆","中間検査以降に行われる構造耐力上主要な部分の施工についての工事監理の状況（中間検査時チェックシート）"]
[{"$nulls":3},"も併せて添付してください。"]
[]
[]
[]
[null,"工事監理の状況　"]
[]
[]
[null,1,null,"確認済証番号",{"$nulls":7},"第",null,{"$f":"IF(完了三面!M11=\"\",\"\",完了三面!M11)","v":""},null,null,{"$f":"IF(完了三面!O11=\"\",\"\",完了三面!O11)","v":""},{"$nulls":5},{"$f":"IF(完了三面!S11=\"\",\"\",完了三面!S11)","v":""},null,{"$f":"IF(完了三面!T11=\"\",\"\",完了三面!T11)","v":""},null,null,{"$f":"IF(完了三面!V11=\"\",\"\",完了三面!V11)","v":""},null,null,"号",null,"確認済証交付日",{"$nulls":9},{"$f":"IF(完了三面!M12=\"\",\"\",完了三面!M12)","v":"令和"},null,null,{"$f":"IF(完了三面!O12=\"\",\"\",完了三面!O12)","v":""},null,"年",null,{"$f":"IF(完了三面!R12=\"\",\"\",完了三面!R12)","v":""},null,"月",null,{"$f":"IF(完了三面!U12=\"\",\"\",完了三面!U12)","v":""},null,"日"]
[null,2,null,"建築場所",{"$nulls":7},{"$f":"IF(完了三面!H4=\"\",\"\",完了三面!H4)","v":""}]
[{"$nulls":3},"建築主氏名",{"$nulls":7},{"$f":"IF(完了二面!J7=\"\",\"\",IF(別紙追加様式!J6=\"\",完了二面!J7,完了二面!J7&\"　・　\"&別紙追加様式!J6))","v":""}]
[null,3,null,"工事監理者",{"$nulls":7},"資格",{"$nulls":3},{"$f":"IF(完了二面!K65=\"\",\"\",完了二面!K65&\"建築士\")","v":""},{"$nulls":7},"建築士番号",{"$nulls":7},{"$f":"IF(完了二面!T65=\"\",\"\",完了二面!T65)","v":""},{"$nulls":9},"登録",{"$nulls":3},"第",null,{"$f":"IF(完了二面!AB65=\"\",\"\",完了二面!AB65)","v":""},{"$nulls":7},"号"]
[{"$nulls":3},"監理者氏名",{"$nulls":7},{"$f":"IF(完了二面!J66=\"\",\"\",完了二面!J66)","v":""}]
[]
[null," 集団規定　（中間検査対象物件については再確認）                                                                                        "]
[null,"監　理　項　目",{"$nulls":36},"監　理　記　録"]
[]
[{"$nulls":38},"A",null,"：","目視検査",{"$nulls":4},"結果",{"$nulls":3},"備考"]
[{"$nulls":38},"B",null,"：","実測検査"]
[{"$nulls":38},"C",null,"：","施工者報告"]
[null,1,null,"確認の表示\n(法89条)",{"$nulls":5},"①確認表示板の設置及び記載内容の確認"]
[null,2,null,"敷地の安全性\n(法19条)",{"$nulls":5},"①がけ、又は擁壁の安全性について"]
[{"$nulls":9},"②切り土、盛り土の状況"]
["○",3,null,"敷地と道路\nの関係\n(法42条､43条)",{"$nulls":5},"①道路の幅員"]
["○",{"$nulls":8},"②接道長さの確認"]
["○",{"$nulls":8},"③路地状通路の幅、距離"]
["○",{"$nulls":8},"④法42条2項道路の後退"]
[{"$nulls":9},"⑤法43条許可条件との整合"]
["○",4,null,"敷地形状及び\n建物配置等\n(法52条～\n53条の2)",{"$nulls":5},"①敷地形状等（敷地の形、境界明示及び高低差等）"]
["○",{"$nulls":8},"②建物配置（道路・隣地境界からの寸法距離）"]
[{"$nulls":9},"③確認申請の平面図との照合（平面プランの確認）"]
[{"$nulls":9},"④既存建物の有無（建ぺい率、容積率等）"]
["○",5,null,"壁面後退等\n(法54条)",{"$nulls":5},"①外壁後退【",{"$nulls":8},"m】の確認（検査項目4にも関連）"]
[null,6,null,"道路斜線等\n(法56条､\n56条の2)",{"$nulls":5},"①建築確認図面の立面図、断面図との照合"]
["○",{"$nulls":8},"②最高高さ、軒高さ、庇・軒出寸法の確認"]
["○",{"$nulls":8},"③"]
[null,7,null,"その他",{"$nulls":5},"①"]
[{"$nulls":9},"②"]
[{"$nulls":9},"③"]
[]
[null,"※",null,"工事監理者は、監理記録欄に監理状況の結果を記入し、完了検査申請書と同時に提出してください。"]
[{"$nulls":3},"なお、否となった事項についてはそれに対する措置等を下記に記入してください。"]
[null,"※",null,"該当する項目のみ記入してください。"]
{"$rows_empty":10}
[null," 防火・避難関係(1/3)                                                                                         "]
[null,"監　理　項　目",{"$nulls":36},"監　理　記　録"]
[]
[{"$nulls":38},"A",null,"：","目視検査",{"$nulls":4},"結果",{"$nulls":3},"備考"]
[{"$nulls":38},"B",null,"：","実測検査"]
[{"$nulls":38},"C",null,"：","施工者報告"]
[null,1,null,"耐火建築物等の\n要求\n防火地域・準防火地域内の建築物\n(法21条､27条､\n61条、\n令136条の2)",{"$nulls":5},"①主要構造部の仕様"]
[{"$nulls":9},"②屋根の構造"]
[{"$nulls":9},"③延焼のおそれのある部分の外壁・軒裏の構造"]
[{"$nulls":9},"④延焼のおそれのある部分の外壁の開口部の仕様"]
[null,2,null,"法22条区域内の制限\n(法22条､23条)",{"$nulls":5},"①屋根の構造"]
[{"$nulls":9},"②延焼のおそれのある部分の外壁の構造"]
[null,3,null,"大規模の木造\n建築物の外壁等\n(法25条)",{"$nulls":5},"①延焼のおそれのある部分の外壁及び軒裏の構造"]
[{"$nulls":9},"②屋根の構造"]
[null,4,null,"防火壁等\n(法26条、\n令113条)",{"$nulls":5},"①防火壁、防火床の位置、構造､形状等"]
[{"$nulls":9},"②防火壁に設ける開口部の形状､防火設備の構造"]
[{"$nulls":9},"③防火壁、防火床を貫通する給水管等の配管、換気等の風道の構造"]
[null,5,null,"看板等の\n防火措置\n(法64条)",{"$nulls":5},"①看板、広告塔等の工作物の主要な部分の仕様"]
["○",6,null,"階段\n(令23条\n～26条)",{"$nulls":5},"①階段及び踊場の幅、けあげ、踏面"]
[{"$nulls":9},"②踊場の位置、踏幅"]
[{"$nulls":9},"③側壁、手すり､中間手すりの設置"]
[{"$nulls":9},"④傾斜路の構造"]
[null,7,null,"防火区画(令112条)"]
[{"$nulls":4},"1)面積区画",{"$nulls":4},"①区画の位置（スプリンクラー等の設置）"]
[{"$nulls":5},"ｱ)1,500㎡区画",{"$nulls":3},"②床､壁の仕様"]
[{"$nulls":9},"③防火設備の仕様・作動"]
[{"$nulls":5},"ｲ)500㎡\n区画",{"$nulls":3},"②床､壁の仕様"]
[{"$nulls":9},"③防火設備の仕様・作動"]
[{"$nulls":5},"ｳ)1,000㎡区画",{"$nulls":3},"②床､壁の仕様"]
[{"$nulls":9},"③防火設備の仕様・作動"]
[{"$nulls":4},"2)高層区画\n[11階以上］",{"$nulls":4},"①区画の位置"]
[{"$nulls":5},"ｱ)100㎡\n区画",{"$nulls":3},"②防火設備の仕様・作動"]
[{"$nulls":5},"ｲ)200㎡\n区画",{"$nulls":3},"②床､壁の仕様"]
[{"$nulls":9},"③防火設備の仕様・作動"]
[{"$nulls":5},"ｳ)500㎡\n区画",{"$nulls":3},"②床､壁の仕様"]
[{"$nulls":9},"③防火設備の仕様・作動"]
[{"$nulls":4},"3)竪穴区画",{"$nulls":4},"①区画の位置"]
[{"$nulls":9},"②床､壁の仕様"]
[{"$nulls":9},"③防火戸の仕様・作動"]
[{"$nulls":9},"④内装（ただし書適用）"]
[]
[null," 防火・避難関係(2/3)                                                                             "]
[null,"監　理　項　目",{"$nulls":36},"監　理　記　録"]
[]
[{"$nulls":38},"A",null,"：","目視検査",{"$nulls":4},"結果",{"$nulls":3},"備考"]
[{"$nulls":38},"B",null,"：","実測検査"]
[{"$nulls":38},"C",null,"：","施工者報告"]
[null,7,null,null,"4)異種用途\n区画",{"$nulls":4},"①区画の位置"]
[{"$nulls":9},"②床､壁の仕様"]
[{"$nulls":9},"③防火設備の仕様・作動"]
[{"$nulls":9},"④警報設備の設置・作動(ただし書適用)"]
[{"$nulls":4},"5)スパンドレル",{"$nulls":4},"①スパンドレル（構造､幅等）"]
[{"$nulls":9},"②防火設備の仕様"]
[{"$nulls":4},"6)区画の\n貫通分",{"$nulls":4},"①給水管等（すき間の処理）"]
[{"$nulls":9},"②給水管等（貫通部分等の仕様）"]
[{"$nulls":9},"③ダクト等（すき間の処理、ﾀﾞﾝﾊﾟｰ）"]
[null,8,null,"建築物の界壁、\n間仕切壁及び\n隔壁\n(令114条)",{"$nulls":5},"①構造防火措置"]
[{"$nulls":9},"②界壁等貫通部分の措置"]
[null,9,null,"廊下、避難階段及び出入口(令117条)"]
["○",{"$nulls":3},"1)廊下\n(令119条)",{"$nulls":4},"①幅員、形態（避難経路）"]
[{"$nulls":4},"2)直通階段\n(令120条)",{"$nulls":4},"①直通性"]
[{"$nulls":9},"②歩行距離（最長　　",{"$nulls":11},"ｍ）・内装"]
[{"$nulls":9},"③内装の緩和規定適用"]
["○",{"$nulls":3},"3)2以上の\n直通階段\n(令121条)",{"$nulls":4},"①重複距離（最長",{"$nulls":11},"ｍ）"]
[{"$nulls":9},"②重複距離のただし書適用"]
[{"$nulls":9},"③2以上の直通階段の設置免除"]
[{"$nulls":4},"4)避難階段\nの設置\n(令122条)"]
[{"$nulls":5},"ｱ)屋内避難階段",{"$nulls":3},"①構造（耐火壁・内装・非常用の照明装置等）"]
[{"$nulls":9},"②防火設備の仕様・作動"]
["○",{"$nulls":4},"ｲ)屋外避難階段",{"$nulls":3},"①2ｍ以内の開口部"]
[{"$nulls":9},"②防火設備の仕様・作動"]
[{"$nulls":5},"ｳ)特別避難階段",{"$nulls":3},"①階段室構造（耐火壁・内装・非常用の照明装置等）"]
[{"$nulls":9},"②附室等構造（耐火壁・内装・排煙設備・非常用の照明設備等）"]
[{"$nulls":9},"③階段室・附室等の規模"]
[{"$nulls":9},"④防火設備の仕様・作動"]
[{"$nulls":5},"ｴ)ただし書適用",{"$nulls":3},"①設置免除の要件"]
[{"$nulls":4},"5)ﾒｿﾞﾈｯﾄ住戸緩和\n(令120条､\n123条の2)",{"$nulls":4},"①階数・出入口"]
[{"$nulls":9},"②歩行距離"]
[{"$nulls":4},"6)大規模物品売店舗\n(令124条)",{"$nulls":4},"①避難階段、特別避難階段の構造"]
["○",{"$nulls":8},"②各階の階段幅・出入口幅"]
[{"$nulls":4},"7)屋外への\n出口等\n(令125条､\n125の2)",{"$nulls":4},"①階段及び居室からの距離（最長",{"$nulls":17},"ｍ）"]
[{"$nulls":9},"②施錠装置の構造"]
[{"$nulls":4},"8)屋上広場等\n(令126条)",{"$nulls":4},"①屋上広場の設置"]
["○",{"$nulls":8},"②手すりの設置"]
[]
[null," 防火・避難関係(3/3)                                                                              "]
[null,"監　理　項　目",{"$nulls":36},"監　理　記　録"]
[]
[{"$nulls":38},"A",null,"：","目視検査",{"$nulls":4},"結果",{"$nulls":3},"備考"]
[{"$nulls":38},"B",null,"：","実測検査"]
[{"$nulls":38},"C",null,"：","施工者報告"]
[null,10,null,"排煙設備\n(令126条の2､\n   126条の3)",{"$nulls":5},"①自然排煙（排煙窓の位置､大きさ）"]
[{"$nulls":9},"②機械排煙"]
[{"$nulls":10},"a)排煙機の能力"]
[{"$nulls":10},"b)排煙口の位置、風量"]
[{"$nulls":10},"c)ダクトの構造"]
[{"$nulls":10},"d)予備電源"]
[{"$nulls":9},"③防煙区画"]
[{"$nulls":9},"④手動開放装置の位置"]
[{"$nulls":9},"⑤設置免除部分の確認"]
[null,11,null,"非常用の照明装置\n(令126条の4､\n  126条の5)",{"$nulls":5},"①居室部分における設置位置"]
[{"$nulls":9},"②避難経路における設置位置"]
[{"$nulls":9},"③器具の作動"]
[{"$nulls":9},"④床面での照度"]
[{"$nulls":9},"⑤告示1411号の特例（歩行距離の確認）"]
[null,12,null,"非常用の進入口\n(令126条の6､\n   126条の7)",{"$nulls":5},"①設置位置・間隔"]
["○",{"$nulls":8},"②幅、高さ及び下端の床面からの高さ"]
["○",{"$nulls":8},"③バルコニーの奥行き及び長さ"]
[{"$nulls":9},"④赤色灯及び赤色の進入口表示"]
[{"$nulls":9},"⑤ただし書適用"]
["○",{"$nulls":9},"a)代替進入口の設置、仕様"]
[{"$nulls":10},"b)非常用の昇降機の設置"]
[null,15,null,"敷地内の通路\n(令128条)",{"$nulls":5},"①屋外避難階段から道等に通ずる通路（最小幅",{"$nulls":23},"ｍ）"]
[{"$nulls":9},"②屋外への出口から道等に通じる通路（最小幅",{"$nulls":23},"ｍ）"]
[null,16,null,"大規模な木造等の建築物の敷地内における通路\n(令128条の2)",{"$nulls":5},"①建築物の周囲に設ける通路"]
[null,17,null,"特殊建築物等の内装\n(令128条の3の2､\n  128条の4､\n128条の5)",{"$nulls":5},"①居室（不燃、準不燃、難燃材料）"]
[{"$nulls":9},"②避難経路（不燃、準不燃材料）"]
[{"$nulls":9},"③火気使用室（不燃、準不燃材料）"]
[{"$nulls":9},"④車庫、無窓居室、地階にある特殊建築物の居室"]
[{"$nulls":9},"⑤内装制限の免除"]
[null,18,null,"非常用の昇降機\n(令129条の13の2､\n   129条の13の3)",{"$nulls":5},"①非常用の昇降機の位置、台数"]
[{"$nulls":9},"②乗降ロビーの構造、規模"]
[{"$nulls":9},"③非常用エレベーターの構造等"]
[{"$nulls":9},"④設置免除の要件"]
["○",19,null,"天井高(令21条)",{"$nulls":5},"①居室の天井高"]
[null,20,null,"住宅用火災\n警報器",{"$nulls":5},"①位置、種類、性能及び作動"]
[null,21,null,"その他",{"$nulls":5},"①"]
[{"$nulls":9},"②"]
[{"$nulls":9},"③"]
[{"$nulls":9},"④"]
[{"$nulls":9},"⑤"]
[{"$nulls":9},"⑥"]
[{"$nulls":9},"⑦"]
[{"$nulls":9},"⑧"]
[]
[null," シックハウス関係"]
[null,"【法68条の11第1項の認証に係る型式の建築物については、各項目の確認図書を型式適合認定仕様書に読み替えます。】"]
[null,"監　理　項　目",{"$nulls":36},"監　理　記　録"]
[]
[{"$nulls":38},"A",null,"：","目視検査",{"$nulls":4},"結果",{"$nulls":3},"備考"]
[{"$nulls":38},"B",null,"：","実測検査"]
[{"$nulls":38},"C",null,"：","施工者報告"]
[null,1,null,"居室等の\n使用建築材料\n（令20条の7）",{"$nulls":5},"①各居室等の下地材(種別及び使用面積)確認図書との整合"]
[{"$nulls":9},"②各居室等の接着剤(種別及び使用面積)確認図書との整合"]
[{"$nulls":9},"③各居室等の仕上げ材(種別及び使用面積)確認図書との整合"]
[{"$nulls":9},"④各居室等の建具等(種別及び使用面積)確認図書との整合"]
[{"$nulls":9},"⑤各居室等の塗料(種類及び使用面積)確認図書との整合"]
[{"$nulls":9},"⑥各居室等の造付家具等(種別及び使用面積)確認図書との整合"]
[{"$nulls":9},"⑦その他"]
[null,2,null,"居室等の\n換気設備\n（令20条の8）",{"$nulls":5},"①各居室等の換気計画の確認図書との整合\n（換気種別、換気経路、換気エリア、気積等）"]
[{"$nulls":9},"②各居室等の建具の形状・位置の確認図書(換気計画)との整合"]
[{"$nulls":9},"③各居室の換気設備の確認図書との整合\n　　　　（形状、規格、性能等）"]
[{"$nulls":9},"④各居室等の換気スイッチの措置"]
[{"$nulls":9},"⑤各居室等のダクトの配置の確認図書との整合"]
[{"$nulls":9},"⑥その他"]
[null,3,null,"天井裏等の\n使用建築材料\n（令20条の8）",{"$nulls":5},"①天井裏等の使用材料(種別)確認図書との整合"]
[{"$nulls":9},"②天井裏等の気密層又は通気止めの確認図書との整合"]
[{"$nulls":9},"③天井裏等の換気設備の確認図書との整合\n　　　　（形状、規格、性能、ダクトの配置等）"]
[{"$nulls":9},"④その他"]
[null,4,null,"その他",{"$nulls":5},"①"]
[{"$nulls":9},"②"]
[{"$nulls":9},"③"]
[]
[null,"※",null,"工事監理者は、監理記録欄に監理状況の結果を記入し、完了検査申請書と同時に提出してください。"]
[{"$nulls":3},"なお、否となった事項についてはそれに対する措置等を下記に記入してください。"]
[null,"※",null,"該当する項目のみ記入してください。"]
{"$rows_empty":19}
["中間二面建築主",{"$nulls":3},"中間二面建築主",{"$nulls":8},{"$f":"IF(完了二面!J7=\"\",\"\",完了二面!J7)","v":""}]
[]
[{"$nulls":4},"A ・ B ・ C",{"$nulls":5},"A ・ B ・ C",{"$nulls":6},"適 ・否"]
[]
[{"$nulls":4},"Ⓐ",{"$nulls":5},"Ⓐ ・ Ⓑ",{"$nulls":6},"適"]
[{"$nulls":4},"Ⓐ ・ Ⓑ",{"$nulls":5},"Ⓐ ・ Ⓑ ・ Ⓒ",{"$nulls":6},"否"]
[{"$nulls":4},"Ⓐ ・ Ⓒ",{"$nulls":5},"Ⓑ",{"$nulls":6},"該当なし"]
[{"$nulls":4},"Ⓐ ・ Ⓑ ・ Ⓒ",{"$nulls":5},"Ⓑ ・ Ⓒ",{"$nulls":6},"-"]
[{"$nulls":4},"Ⓑ",{"$nulls":5},"-"]
[{"$nulls":4},"Ⓑ ・ Ⓒ"]
[{"$nulls":4},"Ⓒ"]
[{"$nulls":4},"-"]

{"sheet":"完了ﾁｪｯｸ（3号）","index":44,"n_rows":166,"n_cols":59,"rows_kept":166,"merged":[[7,1,7,56],[8,1,9,36],[8,37,9,56],[8,58,8,67],[10,1,10,56],[11,1,11,2],[11,3,11,10],[11,11,11,12],[11,13,11,15],[11,16,11,21],[11,22,11,23],[11,24,11,26],[11,27,11,29],[11,30,11,31],[11,32,11,41],[11,42,11,44],[11,45,11,46],[11,47,11,48],[11,49,11,50],[11,51,11,52],[11,53,11,54],[11,55,11,56],[11,59,11,67],[12,1,13,2],[12,3,12,10],[12,11,12,56],[12,59,12,67],[13,3,13,10],[13,11,13,56],[13,59,13,67],[14,1,15,2],[14,3,14,10],[14,11,14,14],[14,15,14,22],[14,23,14,30],[14,31,14,40],[14,41,14,44],[14,45,14,46],[14,47,14,54],[14,55,14,56],[15,3,15,10],[15,11,15,56],[16,1,16,56],[18,1,22,8],[18,9,22,37],[18,38,19,56],[20,38,20,39],[20,41,20,45],[20,46,22,49],[20,50,22,56],[21,38,21,39],[21,41,21,45],[22,38,22,39],[22,41,22,45],[23,1,23,2],[23,3,23,8],[23,9,23,37],[23,38,23,45],[23,46,23,49],[23,50,23,56],[24,1,25,2],[24,3,25,8],[24,9,24,37],[24,38,24,45],[24,46,24,49],[24,50,24,56],[25,9,25,37],[25,38,25,45],[25,46,25,49],[25,50,25,56],[26,1,30,2],[26,3,30,8],[26,9,26,37],[26,38,26,45],[26,46,26,49],[26,50,26,56],[27,9,27,37],[27,38,27,45],[27,46,27,49],[27,50,27,56],[28,9,28,37],[28,38,28,45],[28,46,28,49],[28,50,28,56],[29,9,29,37],[29,38,29,45],[29,46,29,49],[29,50,29,56],[30,9,30,37],[30,38,30,45],[30,46,30,49],[30,50,30,56],[31,1,34,2],[31,3,34,8],[31,9,31,37],[31,38,31,45],[31,46,31,49],[31,50,31,56],[32,9,32,37],[32,38,32,45],[32,46,32,49],[32,50,32,56],[33,9,33,37],[33,38,33,45],[33,46,33,49],[33,50,33,56],[34,9,34,37],[34,38,34,45],[34,46,34,49],[34,50,34,56],[35,1,35,2],[35,3,35,8],[35,15,35,17],[35,18,35,37],[35,38,35,45],[35,46,35,49],[35,50,35,56],[36,1,38,2],[36,3,38,8],[36,9,36,37],[36,38,36,45],[36,46,36,49],[36,50,36,56],[37,9,37,37],[37,38,37,45],[37,46,37,49],[37,50,37,56],[38,9,38,37],[38,38,38,45],[38,46,38,49],[38,50,38,56],[39,1,41,2],[39,3,41,8],[39,9,39,37],[39,38,39,45],[39,46,39,49],[39,50,39,56],[40,9,40,37],[40,38,40,45],[40,46,40,49],[40,50,40,56],[41,9,41,37],[41,38,41,45],[41,46,41,49],[41,50,41,56],[42,1,42,56],[43,1,43,2],[43,3,43,56],[44,3,44,56],[45,1,45,2],[45,3,45,56],[46,1,46,56],[47,1,47,56],[48,1,48,56],[49,1,49,56],[50,1,50,56],[52,1,52,56],[53,1,53,56],[54,1,54,56],[55,1,55,56],[56,1,56,56],[58,1,62,8],[58,9,62,37],[58,38,59,56],[60,38,60,39],[60,41,60,45],[60,46,62,49],[60,50,62,56],[61,38,61,39],[61,41,61,45],[62,38,62,39],[62,41,62,45],[63,0,66,2],[63,3,66,8],[63,9,63,37],[63,38,63,45],[63,46,63,49],[63,50,63,56],[64,9,64,37],[64,38,64,45],[64,46,64,49],[64,50,64,56],[65,9,65,37],[65,38,65,45],[65,46,65,49],[65,50,65,56],[66,9,66,37],[66,38,66,45],[66,46,66,49],[66,50,66,56],[67,1,68,2],[67,3,68,8],[67,9,67,37],[67,38,67,45],[67,46,67,49],[67,50,67,56],[68,9,68,37],[68,38,68,45],[68,46,68,49],[68,50,68,56],[69,1,71,2],[69,3,71,8],[69,9,69,37],[69,38,69,45],[69,46,69,49],[69,50,69,56],[70,9,70,37],[70,38,70,45],[70,46,70,49],[70,50,70,56],[71,9,71,37],[71,38,71,45],[71,46,71,49],[71,50,71,56],[72,1,75,2],[72,3,75,8],[72,9,72,37],[72,38,72,45],[72,46,72,49],[72,50,72,56],[73,9,73,37],[73,38,73,45],[73,46,73,49],[73,50,73,56],[74,9,74,37],[74,38,74,45],[74,46,74,49],[74,50,74,56],[75,9,75,37],[75,38,75,45],[75,46,75,49],[75,50,75,56],[76,1,77,2],[76,3,77,8],[76,9,76,37],[76,38,76,45],[76,46,76,49],[76,50,76,56],[77,9,77,37],[77,38,77,45],[77,46,77,49],[77,50,77,56],[78,1,86,2],[78,3,86,8],[78,9,78,37],[78,38,78,45],[78,46,78,49],[78,50,78,56],[79,9,79,37],[79,38,79,45],[79,46,79,49],[79,50,79,56],[80,10,80,37],[80,38,80,45],[80,46,80,49],[80,50,80,56],[81,10,81,37],[81,38,81,45],[81,46,81,49],[81,50,81,56],[82,10,82,37],[82,38,82,45],[82,46,82,49],[82,50,82,56],[83,10,83,37],[83,38,83,45],[83,46,83,49],[83,50,83,56],[84,9,84,37],[84,38,84,45],[84,46,84,49],[84,50,84,56],[85,9,85,37],[85,38,85,45],[85,46,85,49],[85,50,85,56],[86,9,86,37],[86,38,86,45],[86,46,86,49],[86,50,86,56],[87,1,91,2],[87,3,91,8],[87,9,87,37],[87,38,87,45],[87,46,87,49],[87,50,87,56],[88,9,88,37],[88,38,88,45],[88,46,88,49],[88,50,88,56],[89,9,89,37],[89,38,89,45],[89,46,89,49],[89,50,89,56],[90,9,90,37],[90,38,90,45],[90,46,90,49],[90,50,90,56],[91,9,91,37],[91,38,91,45],[91,46,91,49],[91,50,91,56],[92,1,93,2],[92,3,93,8],[92,9,92,28],[92,29,92,32],[92,33,92,37],[92,38,92,45],[92,46,92,49],[92,50,92,56],[93,9,93,28],[93,29,93,32],[93,33,93,37],[93,38,93,45],[93,46,93,49],[93,50,93,56],[94,1,98,2],[94,3,98,8],[94,9,94,37],[94,38,94,45],[94,46,94,49],[94,50,94,56],[95,9,95,37],[95,38,95,45],[95,46,95,49],[95,50,95,56],[96,9,96,37],[96,38,96,45],[96,46,96,49],[96,50,96,56],[97,9,97,37],[97,38,97,45],[97,46,97,49],[97,50,97,56],[98,9,98,37],[98,38,98,45],[98,46,98,49],[98,50,98,56],[99,1,99,2],[99,3,99,8],[99,9,99,37],[99,38,99,45],[99,46,99,49],[99,50,99,56],[100,1,100,2],[100,3,100,8],[100,9,100,37],[100,38,100,45],[100,46,100,49],[100,50,100,56],[101,1,103,2],[101,3,103,8],[101,9,101,37],[101,38,101,45],[101,46,101,49],[101,50,101,56],[102,9,102,37],[102,38,102,45],[102,46,102,49],[102,50,102,56],[103,9,103,37],[103,38,103,45],[103,46,103,49],[103,50,103,56],[106,1,106,56],[107,1,111,8],[107,9,111,37],[107,38,108,56],[109,38,109,39],[109,41,109,45],[109,46,111,49],[109,50,111,56],[110,38,110,39],[110,41,110,45],[111,38,111,39],[111,41,111,45],[112,1,118,2],[112,3,118,8],[112,9,112,37],[112,38,112,45],[112,46,112,49],[112,50,112,56],[113,9,113,37],[113,38,113,45],[113,46,113,49],[113,50,113,56],[114,9,114,37],[114,38,114,45],[114,46,114,49],[114,50,114,56],[115,9,115,37],[115,38,115,45],[115,46,115,49],[115,50,115,56],[116,9,116,37],[116,38,116,45],[116,46,116,49],[116,50,116,56],[117,9,117,37],[117,38,117,45],[117,46,117,49],[117,50,117,56],[118,9,118,37],[118,38,118,45],[118,46,118,49],[118,50,118,56],[119,1,124,2],[119,3,124,8],[119,9,119,37],[119,38,119,45],[119,46,119,49],[119,50,119,56],[120,9,120,37],[120,38,120,45],[120,46,120,49],[120,50,120,56],[121,9,121,37],[121,38,121,45],[121,46,121,49],[121,50,121,56],[122,9,122,37],[122,38,122,45],[122,46,122,49],[122,50,122,56],[123,9,123,37],[123,38,123,45],[123,46,123,49],[123,50,123,56],[124,9,124,37],[124,38,124,45],[124,46,124,49],[124,50,124,56],[125,1,128,2],[125,3,128,8],[125,9,125,37],[125,38,125,45],[125,46,125,49],[125,50,125,56],[126,9,126,37],[126,38,126,45],[126,46,126,49],[126,50,126,56],[127,9,127,37],[127,38,127,45],[127,46,127,49],[127,50,127,56],[128,9,128,37],[128,38,128,45],[128,46,128,49],[128,50,128,56],[129,1,131,2],[129,3,131,8],[129,9,129,37],[129,38,129,45],[129,46,129,49],[129,50,129,56],[130,9,130,37],[130,38,130,45],[130,46,130,49],[130,50,130,56],[131,9,131,37],[131,38,131,45],[131,46,131,49],[131,50,131,56],[132,1,132,53],[133,1,133,2],[133,3,133,56],[134,3,134,56],[135,1,135,2],[135,3,135,56],[136,1,136,56],[137,1,137,56],[138,1,138,56],[139,1,139,56],[140,1,140,56],[141,1,141,56],[142,1,142,56],[143,1,143,56],[144,1,144,56],[145,1,145,56],[146,1,146,56],[147,1,147,56],[148,1,148,56],[149,1,149,56],[150,1,150,56],[151,1,151,56],[155,2,155,6],[155,8,155,13],[155,15,155,19]]}
[null,"工事監理の状況（完了検査時チェックシート）の取扱いについて（概要）"]
[null,"3号建築物用",{"$nulls":56},"シートの保護を解除すると編集が可能になります（パスワードなし）"]
[null,null,"◆","設備に関しては項目のないものもありますので、各申請物件に合った設備項目をその他欄に追加記入して下さい。"]
[null,null,"◆","界壁等の検査時見え隠れ部分の施工状況が確認できる資料(施工写真等)を提出してください。"]
[null,null,"◆","中間検査が対象外の建築物に関しては、工事監理の状況（中間検査時チェックシート）も併せて添付してください。"]
[]
[]
[]
[null,"工事監理の状況　"]
[]
[]
[null,1,null,"確認済証番号",{"$nulls":7},"第",null,{"$f":"IF(完了三面!M11=\"\",\"\",完了三面!M11)","v":""},null,null,{"$f":"IF(完了三面!O11=\"\",\"\",完了三面!O11)","v":""},{"$nulls":5},{"$f":"IF(完了三面!S11=\"\",\"\",完了三面!S11)","v":""},null,{"$f":"IF(完了三面!T11=\"\",\"\",完了三面!T11)","v":""},null,null,{"$f":"IF(完了三面!V11=\"\",\"\",完了三面!V11)","v":""},null,null,"号",null,"確認済証交付日",{"$nulls":9},{"$f":"IF(完了三面!M12=\"\",\"\",完了三面!M12)","v":"令和"},null,null,{"$f":"IF(完了三面!O12=\"\",\"\",完了三面!O12)","v":""},null,"年",null,{"$f":"IF(完了三面!R12=\"\",\"\",完了三面!R12)","v":""},null,"月",null,{"$f":"IF(完了三面!U12=\"\",\"\",完了三面!U12)","v":""},null,"日"]
[null,2,null,"建築場所",{"$nulls":7},{"$f":"IF(完了三面!H4=\"\",\"\",完了三面!H4)","v":""}]
[{"$nulls":3},"建築主氏名",{"$nulls":7},{"$f":"IF(完了二面!J7=\"\",\"\",IF(別紙追加様式!J6=\"\",完了二面!J7,完了二面!J7&\"　・　\"&別紙追加様式!J6))","v":""}]
[null,3,null,"工事監理者",{"$nulls":7},"資格",{"$nulls":3},{"$f":"IF(完了二面!K65=\"\",\"\",完了二面!K65&\"建築士\")","v":""},{"$nulls":7},"建築士番号",{"$nulls":7},{"$f":"IF(完了二面!T65=\"\",\"\",完了二面!T65)","v":""},{"$nulls":9},"登録",{"$nulls":3},"第",null,{"$f":"IF(完了二面!AB65=\"\",\"\",完了二面!AB65)","v":""},{"$nulls":7},"号"]
[{"$nulls":3},"監理者氏名",{"$nulls":7},{"$f":"IF(完了二面!J66=\"\",\"\",完了二面!J66)","v":""}]
[]
[null," 集団規定　（中間検査対象物件については再確認）                                                                                        "]
[null,"監　理　項　目",{"$nulls":36},"監　理　記　録"]
[]
[{"$nulls":38},"A",null,"：","目視検査",{"$nulls":4},"結果",{"$nulls":3},"備考"]
[{"$nulls":38},"B",null,"：","実測検査"]
[{"$nulls":38},"C",null,"：","施工者報告"]
[null,1,null,"確認の表示\n(法89条)",{"$nulls":5},"①確認表示板の設置及び記載内容の確認"]
[null,2,null,"敷地の安全性\n(法19条)",{"$nulls":5},"①がけ、又は擁壁の安全性について"]
[{"$nulls":9},"②切り土、盛り土の状況"]
["○",3,null,"敷地と道路\nの関係\n(法42条､43条)",{"$nulls":5},"①道路の幅員"]
["○",{"$nulls":8},"②接道長さの確認"]
["○",{"$nulls":8},"③路地状通路の幅、距離"]
["○",{"$nulls":8},"④法42条2項道路の後退"]
[{"$nulls":9},"⑤法43条2項2号許可条件との整合"]
["○",4,null,"敷地形状及び\n建物配置等\n(法52条～\n53条の2)",{"$nulls":5},"①敷地形状等（敷地の形、境界明示及び高低差等）"]
["○",{"$nulls":8},"②建物配置（道路・隣地境界からの寸法距離）"]
[{"$nulls":9},"③確認申請の平面図との照合（平面プランの確認）"]
[{"$nulls":9},"④既存建物の有無（建ぺい率、容積率等）"]
["○",5,null,"壁面後退等\n(法54条)",{"$nulls":5},"①外壁後退【",{"$nulls":8},"m】の確認（検査項目4にも関連）"]
[null,6,null,"道路斜線等\n(法56条､\n56条の2)",{"$nulls":5},"①建築確認図面の立面図、断面図との照合"]
["○",{"$nulls":8},"②最高高さ、軒高さ、庇・軒出寸法の確認"]
["○",{"$nulls":8},"③"]
[null,7,null,"その他",{"$nulls":5},"①"]
[{"$nulls":9},"②"]
[{"$nulls":9},"③"]
[]
[null,"※",null,"工事監理者は、監理記録欄に監理状況の結果を記入し、完了検査申請書と同時に提出してください。"]
[{"$nulls":3},"なお、否となった事項についてはそれに対する措置等を下記に記入してください。"]
[null,"※",null,"該当する項目のみ記入してください。"]
{"$rows_empty":11}
[null," 防火・避難関係(3号建築物・２号戸建住宅用 )"]
[null,"監　理　項　目",{"$nulls":36},"監　理　記　録"]
[]
[{"$nulls":38},"A",null,"：","目視検査",{"$nulls":4},"結果",{"$nulls":3},"備考"]
[{"$nulls":38},"B",null,"：","実測検査"]
[{"$nulls":38},"C",null,"：","施工者報告"]
[1,null,null,"耐火建築物等の\n要求\n防火地域・準防火地域内の建築物\n(法21条､27条､\n61条、\n令136条の2)",{"$nulls":5},"①主要構造部の仕様"]
[{"$nulls":9},"②屋根の構造"]
[{"$nulls":9},"③延焼のおそれのある部分の外壁・軒裏の構造"]
[{"$nulls":9},"④延焼のおそれのある部分の外壁の開口部の仕様"]
[null,2,null,"法22条区域内の制限\n(法22条､23条)",{"$nulls":5},"①屋根の構造"]
[{"$nulls":9},"②延焼のおそれのある部分の外壁の構造"]
[null,3,null,"防火壁等\n(法26条、\n令113条)",{"$nulls":5},"①防火壁、防火床の位置、構造､形状等"]
[{"$nulls":9},"②防火壁に設ける開口部の形状､防火設備の構造"]
[{"$nulls":9},"③防火壁、防火床を貫通する給水管等の配管、換気等の風道の構造"]
["○",4,null,"階段\n(令23条\n～26条)",{"$nulls":5},"①階段及び踊場の幅、けあげ、踏面"]
[{"$nulls":9},"②踊場の位置、踏幅"]
[{"$nulls":9},"③側壁、手すり､中間手すりの設置"]
[{"$nulls":9},"④傾斜路の構造"]
[null,5,null,"建築物の界壁、\n間仕切壁及び\n隔壁\n(令114条)",{"$nulls":5},"①構造防火措置"]
[{"$nulls":9},"②界壁等貫通部分の措置"]
[null,6,null,"排煙設備\n(令126条の2､\n   126条の3)",{"$nulls":5},"①自然排煙（排煙窓の位置､大きさ）"]
[{"$nulls":9},"②機械排煙"]
[{"$nulls":10},"a)排煙機の能力"]
[{"$nulls":10},"b)排煙口の位置、風量"]
[{"$nulls":10},"c)ダクトの構造"]
[{"$nulls":10},"d)予備電源"]
[{"$nulls":9},"③防煙区画"]
[{"$nulls":9},"④手動開放装置の位置"]
[{"$nulls":9},"⑤設置免除部分の確認"]
[null,7,null,"非常用の照明装置\n(令126条の4､\n  126条の5)",{"$nulls":5},"①居室部分における設置位置"]
[{"$nulls":9},"②避難経路における設置位置"]
[{"$nulls":9},"③器具の作動"]
[{"$nulls":9},"④床面での照度"]
[{"$nulls":9},"⑤告示1411号の特例（歩行距離の確認）"]
[null,8,null,"敷地内の通路\n(令128条)",{"$nulls":5},"①屋外避難階段から道等に通ずる通路（最小幅",{"$nulls":23},"ｍ）"]
[{"$nulls":9},"②屋外への出口から道等に通じる通路（最小幅",{"$nulls":23},"ｍ）"]
[null,9,null,"特殊建築物等の内装\n(令128条の3の2､\n  128条の4､\n128条の5)",{"$nulls":5},"①居室（不燃、準不燃、難燃材料）"]
[{"$nulls":9},"②避難経路（不燃、準不燃材料）"]
[{"$nulls":9},"③火気使用室（不燃、準不燃材料）"]
[{"$nulls":9},"④車庫、無窓居室、地階にある特殊建築物の居室"]
[{"$nulls":9},"⑤内装制限の免除"]
["○",10,null,"天井高(令21条)",{"$nulls":5},"①居室の天井高"]
[null,11,null,"住宅用火災\n警報器",{"$nulls":5},"①位置、種類、性能及び作動"]
[null,12,null,"その他",{"$nulls":5},"①"]
[{"$nulls":9},"②"]
[{"$nulls":9},"③  "]
[]
[null," シックハウス関係"]
[null,"【法68条の11第1項の認証に係る型式の建築物については、各項目の確認図書を型式適合認定仕様書に読み替えます。】"]
[null,"監　理　項　目",{"$nulls":36},"監　理　記　録"]
[]
[{"$nulls":38},"A",null,"：","目視検査",{"$nulls":4},"結果",{"$nulls":3},"備考"]
[{"$nulls":38},"B",null,"：","実測検査"]
[{"$nulls":38},"C",null,"：","施工者報告"]
[null,1,null,"居室等の\n使用建築材料\n（令20条の7）",{"$nulls":5},"①各居室等の下地材(種別及び使用面積)確認図書との整合"]
[{"$nulls":9},"②各居室等の接着剤(種別及び使用面積)確認図書との整合"]
[{"$nulls":9},"③各居室等の仕上げ材(種別及び使用面積)確認図書との整合"]
[{"$nulls":9},"④各居室等の建具等(種別及び使用面積)確認図書との整合"]
[{"$nulls":9},"⑤各居室等の塗料(種類及び使用面積)確認図書との整合"]
[{"$nulls":9},"⑥各居室等の造付家具等(種別及び使用面積)確認図書との整合"]
[{"$nulls":9},"⑦その他"]
[null,2,null,"居室等の\n換気設備\n（令20条の8）",{"$nulls":5},"①各居室等の換気計画の確認図書との整合\n（換気種別、換気経路、換気エリア、気積等）"]
[{"$nulls":9},"②各居室等の建具の形状・位置の確認図書(換気計画)との整合"]
[{"$nulls":9},"③各居室の換気設備の確認図書との整合\n　　　　（形状、規格、性能等）"]
[{"$nulls":9},"④各居室等の換気スイッチの措置"]
[{"$nulls":9},"⑤各居室等のダクトの配置の確認図書との整合"]
[{"$nulls":9},"⑥その他"]
[null,3,null,"天井裏等の\n使用建築材料\n（令20条の8）",{"$nulls":5},"①天井裏等の使用材料(種別)確認図書との整合"]
[{"$nulls":9},"②天井裏等の気密層又は通気止めの確認図書との整合"]
[{"$nulls":9},"③天井裏等の換気設備の確認図書との整合\n　　　　（形状、規格、性能、ダクトの配置等）"]
[{"$nulls":9},"④その他"]
[null,4,null,"その他",{"$nulls":5},"①"]
[{"$nulls":9},"②"]
[{"$nulls":9},"③"]
[]
[null,"※",null,"工事監理者は、監理記録欄に監理状況の結果を記入し、完了検査申請書と同時に提出してください。"]
[{"$nulls":3},"なお、否となった事項についてはそれに対する措置等を下記に記入してください。"]
[null,"※",null,"該当する項目のみ記入してください。"]
{"$rows_empty":18}
[null,null,"中間二面建築主",{"$nulls":8},{"$f":"IF(完了二面!J7=\"\",\"\",完了二面!J7)","v":""}]
[]
[null,null,"A ・ B ・ C",{"$nulls":5},"A ・ B ・ C",{"$nulls":6},"適 ・否"]
[]
[null,null,"Ⓐ",{"$nulls":5},"Ⓐ ・ Ⓑ",{"$nulls":6},"適"]
[null,null,"Ⓐ ・ Ⓑ",{"$nulls":5},"Ⓐ ・ Ⓑ ・ Ⓒ",{"$nulls":6},"否"]
[null,null,"Ⓐ ・ Ⓒ",{"$nulls":5},"Ⓑ",{"$nulls":6},"該当なし"]
[null,null,"Ⓐ ・ Ⓑ ・ Ⓒ",{"$nulls":5},"Ⓑ ・ Ⓒ",{"$nulls":6},"-"]
[null,null,"Ⓑ",{"$nulls":5},"-"]
[null,null,"Ⓑ ・ Ⓒ"]
[null,null,"Ⓒ"]
[null,null,"-"]

{"sheet":"受付用","index":45,"n_rows":207,"n_cols":94,"rows_kept":207,"merged":[[4,21,4,25],[5,19,5,22],[6,19,6,26]]}
["申請者氏名","代理者事務所名","担当者","代理者TEL","代理者FAX","主要用途","申請地（地名地番）","建築主1","建築主2","代理者事務所（申請上）","代理者\n（申請上）","建築物名称","敷地\n面積","建築\n面積","延べ\n面積","階数\n（地上）","階数\n（地下）"]
[{"$f":"受理審査表!H6","v":""},{"$f":"受理審査表!H8","v":""},{"$f":"受理審査表!Z8","v":""},{"$f":"受理審査表!AI8","v":0},{"$f":"受理審査表!AU8","v":0},{"$f":"受理審査表!AU6","v":""},{"$f":"受理審査表!H7","v":""},{"$f":"申二面!J7","v":0},{"$f":"別紙追加様式!J6","v":0},{"$f":"申二面!J17","v":0},{"$f":"申二面!J15","v":0},{"$f":"申二面!E186","v":0},{"$f":"申三面!M24","v":""},{"$f":"申三面!AA33","v":""},{"$f":"申三面!AA38","v":""},{"$f":"申三面!L62","v":0},{"$f":"申三面!L63","v":0}]
[]
["※このシートはアネックス処理用です。さわらないで下さい。(anex20180401)",{"$nulls":86},"新築","増築","改築","移転","用途変更","大規模の修繕","大規模の模様替"]
[]
[]
[]
[{"$f":"IF(申三面!G3=\"\",\"\",申三面!G3)","v":""},"確認時"]
[{"$f":"LEFT(A8,MIN(FIND({\"市\",\"町\",\"村\"},A8&\"市町村\")))","v":""},{"$f":"IF(A9=\"\",\"\",IFERROR(VLOOKUP(A9,A15:C207,2,FALSE),\"\"))","v":""},{"$f":"IF(A9=\"\",\"\",IFERROR(VLOOKUP(A9,A15:C207,3,FALSE),\"\"))","v":""}]
[{"$f":"IF(中間三面!H4=\"\",\"\",中間三面!H4)","v":""},"中間検査時"]
[{"$f":"LEFT(A10,MIN(FIND({\"市\",\"町\",\"村\"},A10&\"市町村\")))","v":""},{"$f":"IF(A11=\"\",\"\",IFERROR(VLOOKUP(A11,A15:C207,2,FALSE),\"\"))","v":""},{"$f":"IF(A11=\"\",\"\",IFERROR(VLOOKUP(A11,A15:C207,3,FALSE),\"\"))","v":""}]
[{"$f":"IF(完了三面!H4=\"\",\"\",完了三面!H4)","v":""},"完了検査時"]
[{"$f":"LEFT(A12,MIN(FIND({\"市\",\"町\",\"村\"},A12&\"市町村\")))","v":""},{"$f":"IF(A13=\"\",\"\",IFERROR(VLOOKUP(A13,A15:C207,2,FALSE),\"\"))","v":""},{"$f":"IF(A13=\"\",\"\",IFERROR(VLOOKUP(A13,A15:C207,3,FALSE),\"\"))","v":""}]
[]
["滋賀県大津市","滋","大津"]
["大津市","滋","大津"]
["滋賀県草津市","滋","草津"]
["草津市","滋","草津"]
["滋賀県守山市","滋","守山"]
["守山市","滋","守山"]
["滋賀県近江八幡市","滋","近江"]
["近江八幡市","滋","近江"]
["滋賀県東近江市","滋","八日"]
["東近江市","滋","八日"]
["滋賀県彦根市","滋","彦根"]
["彦根市","滋","彦根"]
["滋賀県長浜市","滋","長浜"]
["長浜市","滋","長浜"]
["滋賀県湖南市","滋","甲賀"]
["湖南市","滋","甲賀"]
["滋賀県甲賀市","滋","甲賀"]
["甲賀市","滋","甲賀"]
["滋賀県蒲生郡竜王町","滋","東近"]
["蒲生郡竜王町","滋","東近"]
["竜王町","滋","東近"]
["滋賀県蒲生郡日野町","滋","東近"]
["蒲生郡日野町","滋","東近"]
["日野町","滋","東近"]
["滋賀県栗東市","滋","湖南"]
["栗東市","滋","湖南"]
["滋賀県野洲市","滋","湖南"]
["野洲市","滋","湖南"]
["滋賀県高島市","滋","湖西"]
["高島市","滋","湖西"]
["滋賀県愛知郡愛荘町","滋","湖東"]
["愛知郡愛荘町","滋","湖東"]
["愛荘町","滋","湖東"]
["滋賀県犬上郡多賀町","滋","湖東"]
["犬上郡多賀町","滋","湖東"]
["多賀町","滋","湖東"]
["滋賀県犬上郡豊郷町","滋","湖東"]
["犬上郡豊郷町","滋","湖東"]
["豊郷町","滋","湖東"]
["滋賀県犬上郡甲良町","滋","湖東"]
["犬上郡甲良町","滋","湖東"]
["甲良町","滋","湖東"]
["滋賀県米原市","滋","湖北"]
["米原市","滋","湖北"]
["京都府京都市","京","市"]
["京都市","京","市"]
["京都府宇治市","京","府"]
["宇治市","京","府"]
["京都府城陽市","京","宇"]
["城陽市","京","宇"]
["京都府久世郡久御山町","京","宇"]
["久世郡久御山町","京","宇"]
["久御山町","京","宇"]
["京都府向日市","京","乙"]
["向日市","京","乙"]
["京都府長岡京市","京","乙"]
["長岡京市","京","乙"]
["京都府乙訓郡大山崎町","京","乙"]
["乙訓郡大山崎町","京","乙"]
["大山崎町","京","乙"]
["京都府京田辺市","京","田"]
["京田辺市","京","田"]
["京都府綴喜郡井手町","京","田"]
["綴喜郡井手町","京","田"]
["井手町","京","田"]
["京都府綴喜郡宇治田原町","京","田"]
["綴喜郡宇治田原町","京","田"]
["宇治田原町","京","田"]
["京都府八幡市","京","田"]
["八幡市","京","田"]
["京都府相楽郡精華町","京","木"]
["相楽郡精華町","京","木"]
["精華町","京","木"]
["京都府木津川市","京","木"]
["木津川市","京","木"]
["京都府相楽郡笠置町","京","木"]
["相楽郡笠置町","京","木"]
["笠置町","京","木"]
["京都府相楽郡和束町","京","木"]
["相楽郡和束町","京","木"]
["和束町","京","木"]
["京都府相楽郡南山城村","京","木"]
["相楽郡南山城村","京","木"]
["南山城村","京","木"]
["京都府亀岡市","京","亀"]
["亀岡市","京","亀"]
["京都府南丹市","京","園"]
["南丹市","京","園"]
["京都府船井郡京丹波町","京","園"]
["船井郡京丹波町","京","園"]
["京丹波町","京","園"]
["大阪府大阪市","大","大阪"]
["大阪市","大","大阪"]
["大阪府箕面市","大","箕面"]
["箕面市","大","箕面"]
["大阪府池田市","大","池田"]
["池田市","大","池田"]
["大阪府豊中市","大","豊中"]
["豊中市","大","豊中"]
["大阪府吹田市","大","吹田"]
["吹田市","大","吹田"]
["大阪府茨木市","大","茨木"]
["茨木市","大","茨木"]
["大阪府高槻市","大","高槻"]
["高槻市","大","高槻"]
["大阪府守口市","大","守口"]
["守口市","大","守口"]
["大阪府門真市","大","門真"]
["門真市","大","門真"]
["大阪府寝屋川市","大","寝屋"]
["寝屋川市","大","寝屋"]
["大阪府枚方市","大","枚方"]
["枚方市","大","枚方"]
["大阪府東大阪市","大","東大"]
["東大阪市","大","東大"]
["大阪府八尾市","大","八尾"]
["八尾市","大","八尾"]
["大阪府豊能郡能勢町","大","府"]
["豊能郡能勢町","大","府"]
["能勢町","大","府"]
["大阪府豊能郡豊能町","大","府"]
["豊能郡豊能町","大","府"]
["豊能町","大","府"]
["大阪府摂津市","大","府"]
["摂津市","大","府"]
["大阪府三島郡島本町","大","府"]
["三島郡島本町","大","府"]
["島本町","大","府"]
["大阪府交野市","大","府"]
["交野市","大","府"]
["大阪府四条畷市","大","府"]
["四条畷市","大","府"]
["大阪府大東市","大","府"]
["大東市","大","府"]
["奈良県奈良市","奈","奈良"]
["奈良市","奈","奈良"]
["奈良県生駒市","奈","生駒"]
["生駒市","奈","生駒"]
["奈良県橿原市","奈","橿原"]
["橿原市","奈","橿原"]
["奈良県天理市","奈","奈土"]
["天理市","奈","奈土"]
["奈良県大和郡山市","奈","郡山"]
["大和郡山市","奈","郡山"]
["奈良県生駒郡安堵町","奈","郡山"]
["生駒郡安堵町","奈","郡山"]
["安堵町","奈","郡山"]
["奈良県生駒郡平群町","奈","郡山"]
["生駒郡平群町","奈","郡山"]
["平群町","奈","郡山"]
["奈良県生駒郡三郷町","奈","郡山"]
["生駒郡三郷町","奈","郡山"]
["三郷町","奈","郡山"]
["奈良県生駒郡斑鳩町","奈","郡山"]
["生駒郡斑鳩町","奈","郡山"]
["斑鳩町","奈","郡山"]
["奈良県北葛城郡上牧町","奈","高田"]
["北葛城郡上牧町","奈","高田"]
["上牧町","奈","高田"]
["奈良県北葛城郡河合町","奈","高田"]
["北葛城郡河合町","奈","高田"]
["河合町","奈","高田"]
["奈良県北葛城郡王寺町","奈","高田"]
["北葛城郡王寺町","奈","高田"]
["王寺町","奈","高田"]
["奈良県大和高田市","奈","高田"]
["大和高田市","奈","高田"]
["奈良県香芝市","奈","高田"]
["香芝市","奈","高田"]
["奈良県北葛城郡広陵町","奈","高田"]
["北葛城郡広陵町","奈","高田"]
["広陵町","奈","高田"]
["奈良県御所市","奈","高田"]
["御所市","奈","高田"]
["奈良県葛城市","奈","高田"]
["葛城市","奈","高田"]
["奈良県桜井市","奈","桜井"]
["桜井市","奈","桜井"]
["奈良県磯城郡川西町","奈","桜井"]
["磯城郡川西町","奈","桜井"]
["川西町","奈","桜井"]
["奈良県磯城郡三宅町","奈","桜井"]
["磯城郡三宅町","奈","桜井"]
["三宅町","奈","桜井"]
["奈良県磯城郡田原本町","奈","桜井"]
["磯城郡田原本町","奈","桜井"]
["田原本町","奈","桜井"]
["奈良県高市郡高取町","奈","桜井"]
["高市郡高取町","奈","桜井"]
["高取町","奈","桜井"]
["奈良県高市郡明日香村","奈","桜井"]
["高市郡明日香村","奈","桜井"]
["明日香村","奈","桜井"]

{"sheet":"確認台帳一覧(データ取込用)","index":46,"n_rows":55,"n_cols":219,"rows_kept":55}
["受付番号","受付年月日","確認番号","確認日付","確認機関","ﾌﾘｶﾞﾅ","建築主","郵便番号","建築主住所","建築主電話番号","代理者資格","代理者登録機関","代理者建築士番号","代理者氏名","代理者事務所資格","代理者事務所登録機関","代理者事務所番号","代理者事務所名","代理者郵便番号","代理者所在地","代理者電話番号","設計者資格","設計者登録機関","設計者建築士番号","設計者氏名","設計者事務所資格","設計者事務所登録機関","設計者事務所番号","設計者事務所名","設計者郵便番号","設計者所在地","設計者電話番号","建築設備氏名","建築設備勤務先","建築設備郵便番号","建築設備所在地","建築設備電話番号","監理者資格","監理者登録機関","監理者建築士番号","監理者氏名","監理者事務所資格","監理者事務所登録機関","監理者事務所番号","監理者事務所名","監理者郵便番号","監理者所在地","監理者電話番号","施工者氏名","施工者許可機関","施工者番号","施工者営業所","施工者郵便番号","施工者所在地","施工者電話番号","備考1面","建築物名フリガナ","建築物名","申請者フリガナ","申請者名","地名地番","住居表示","都市計画","市街化","調整区域","未設定","防火地域","準防火地域","指定なし","その他区域","道路幅員","接道長さ","敷地面積A1","敷地面積A2","用途地域A","用途地域ACode","指定容積率A","指定建ぺい率Ａ","敷地面積B1","敷地面積B2","用途地域B","用途地域BCode","指定容積率Ｂ","指定建ぺい率B","敷地面積合計1","敷地面積合計2","容積率上限","建ぺい率上限","敷地面積備考","主要用途Code","主要用途","工事種別1","工事種別2","建築面積申請","建築面積申請外","建築面積合計","実質建ぺい率","建築物全体申請","建築物全体申請外","建築物全体合計","地階申請","地階申請外","地階合計","共用廊下申請","共用廊下申請外","共用廊下合計","車庫申請","車庫申請外","車庫合計","住宅申請","住宅申請外","住宅合計","延べ面積","実質容積率","申請建築物の数","申請外建築物の数","申請高さ","申請地上階数","申請地下階数","申請外高さ","申請外地上階数","申請外地下階数","構造Code1","構造1","構造Code2","構造2","許可認定等","工事着手","工事完了","指定工程回数1","指定工程日程1","特定工程1","指定工程回数2","指定工程日程2","特定工程2","指定工程回数3","指定工程日程3","特定工程3","その他","備考2面","建築主フリガナ2","建築主氏名2","建築主郵便番号2","建築主住所2","建築主電話番号2","建築主フリガナ3","建築主氏名3","建築主郵便番号3","建築主住所3","建築主電話番号3","消防提出日","確認済み届出日付","確認検査員","種別","用途","積載重量","最大定員","定格速度","高さ","長さ","個数","号","木３","工業化","特建","公庫","旧確認番号","新確認番号","パト結果","受付場所","通し番号","更新日付","メモ","法第3条第2項規定関係","浄化槽","確認申請手数料","工事届報告日","浄化槽報告日","行政仮受番号","行政仮受日","56条の7特例有無","56条の7特例区分","適用除外規定","既存不適格適用日","既存不適格適用理由","既存不適格備考","確認契約日","備蓄倉庫申請","備蓄倉庫申請外","備蓄倉庫合計","自家発電設備申請","自家発電設備申請外","自家発電設備合計","蓄電池申請","蓄電池申請外","蓄電池合計","貯水槽申請","貯水槽申請外","貯水槽合計","EV昇降路申請","EV昇降路申請外","EV昇降路合計","適判申請済チェック","適判申請済判定機関名","適判未申請チェック","適判未申請判定機関名","適判申請不要チェック","老人ホーム申請","老人ホーム申請外","老人ホーム合計","省エネ適判申請済チェック","省エネ適判申請済判定機関名","省エネ適判未申請チェック","省エネ適判未申請判定機関名","省エネ適判申請不要チェック","省エネ適判申請不要理由","宅配ボックス申請","宅配ボックス申請外","宅配ボックス合計"]
[{"$nulls":5},{"$f":"申二面!J6","v":0},{"$f":"申二面!J7","v":0},{"$f":"REPLACE(申二面!K8,4,1,\"\")","v":""},{"$f":"申二面!J9","v":0},{"$f":"申二面!J10","v":0},{"$f":"申二面!K14","v":0},{"$f":"申二面!T14","v":0},{"$f":"申二面!AB14","v":0},{"$f":"申二面!J15","v":0},{"$f":"申二面!K16","v":0},{"$f":"申二面!T16","v":0},{"$f":"申二面!AB16","v":0},{"$f":"申二面!J17","v":0},{"$f":"申二面!K18","v":0},{"$f":"申二面!J19","v":0},{"$f":"申二面!J20","v":0},"","","","","","","","","","","","","","","","","","","","","","","","","","","",{"$f":"申二面!H164","v":0},{"$f":"申二面!N165","v":0},{"$f":"申二面!T165","v":0},{"$f":"申二面!H166","v":0},{"$f":"申二面!I167","v":0},{"$f":"申二面!H168","v":0},{"$f":"申二面!H169","v":0},{"$f":"申二面!E184","v":0},{"$f":"申二面!E185","v":0},{"$f":"申二面!E186","v":0},"","",{"$f":"申三面!G3","v":0},{"$f":"申二面!G4","v":0},{"$f":"IF(申三面!B6=\"■\",\"都市計画区域内\",IF(申三面!B7=\"■\",\"準都市計画区域内\",IF(申三面!J7=\"■\",\"都市計画区域及び準都市計画区域外\",\"\")))","v":""},{"$f":"申三面!J6","v":"□"},{"$f":"申三面!P6","v":"□"},{"$f":"申三面!X6","v":"□"},{"$f":"申三面!H8","v":"□"},{"$f":"申三面!M8","v":"□"},{"$f":"申三面!S8","v":"□"},{"$f":"IF(申三面!X8=\"■\",申三面!O9&申三面!B11&\"法22条区域\",申三面!O9&申三面!B11)","v":""},{"$f":"申三面!P13","v":0},{"$f":"申三面!P14","v":0},{"$f":"申三面!J16","v":0},{"$f":"申三面!J17","v":0},{"$f":"申三面!J18","v":0},"",{"$f":"申三面!J21","v":0},{"$f":"申三面!J23","v":0},{"$f":"申三面!P16","v":0},{"$f":"申三面!P17","v":0},{"$f":"申三面!P18","v":0},"",{"$f":"申三面!P21","v":0},{"$f":"申三面!P23","v":0},{"$f":"申三面!M24","v":""},{"$f":"申三面!M25","v":""},{"$f":"申三面!X26","v":0},{"$f":"申三面!X27","v":0},{"$f":"申三面!F28","v":0},{"$f":"申三面!J29","v":0},{"$f":"申三面!N29","v":0},{"$f":"CJ7&CK7&CL7&CM7","v":""},{"$f":"CN7&CO7&CP7","v":""},{"$f":"申三面!M33","v":0},{"$f":"申三面!T33","v":0},{"$f":"申三面!AA33","v":""},{"$f":"申三面!Q36","v":0},{"$f":"申三面!M38","v":0},{"$f":"申三面!T38","v":0},{"$f":"申三面!AA38","v":""},{"$f":"申三面!M40","v":0},{"$f":"申三面!T40","v":0},{"$f":"申三面!AA40","v":""},{"$f":"申三面!M44","v":0},{"$f":"申三面!T44","v":0},{"$f":"申三面!AA44","v":""},{"$f":"申三面!M46","v":0},{"$f":"申三面!T46","v":0},{"$f":"申三面!AA46","v":""},{"$f":"申三面!M53","v":0},{"$f":"申三面!T53","v":0},{"$f":"申三面!AA53","v":""},{"$f":"申三面!R55","v":0},{"$f":"申三面!R56","v":""},{"$f":"申三面!P58","v":0},{"$f":"申三面!P59","v":0},{"$f":"申三面!L61","v":0},{"$f":"申三面!L62","v":0},{"$f":"申三面!L63","v":0},{"$f":"申三面!S61","v":0},{"$f":"申三面!S62","v":0},{"$f":"申三面!S63","v":0},{"$f":"申三面!I64","v":0},"",{"$f":"申三面!U64","v":0},"",{"$f":"申三面!C69&申三面!C70&申三面!C71&申三面!C72","v":""},{"$f":"IF(申三面!N73=\"\",\"\",TEXT(\"H\"&申三面!N73&\"/\"&申三面!Q73&\"/\"&申三面!T73,\"yyyy/mm/dd\"))","v":""},{"$f":"IF(申三面!N74=\"\",\"\",TEXT(\"H\"&申三面!N74&\"/\"&申三面!Q74&\"/\"&申三面!T74,\"yyyy/mm/dd\"))","v":""},{"$f":"申三面!D76","v":0},{"$f":"IF(申三面!I76=\"\",\"\",TEXT(\"H\"&申三面!I76&\"/\"&申三面!K76&\"/\"&申三面!M76,\"yyyy/mm/dd\"))","v":""},{"$f":"申三面!P76","v":0},{"$f":"申三面!D77","v":0},{"$f":"IF(申三面!I77=\"\",\"\",TEXT(\"H\"&申三面!I77&\"/\"&申三面!K77&\"/\"&申三面!M77,\"yyyy/mm/dd\"))","v":""},{"$f":"申三面!P77","v":0},{"$f":"申三面!D78","v":0},{"$f":"IF(申三面!I78=\"\",\"\",TEXT(\"H\"&申三面!I78&\"/\"&申三面!K78&\"/\"&申三面!M78,\"yyyy/mm/dd\"))","v":""},{"$f":"申三面!P78","v":0},{"$f":"申三面!C85&申三面!C86&申三面!C87","v":""},{"$f":"申三面!C89&申三面!C90&申三面!C91&申三面!C92","v":""},{"$f":"別紙追加様式!J5","v":0},{"$f":"別紙追加様式!J6","v":0},{"$f":"別紙追加様式!K7","v":0},{"$f":"別紙追加様式!J8","v":0},{"$f":"別紙追加様式!J9","v":0},{"$f":"別紙追加様式!J66","v":""},{"$f":"別紙追加様式!J67","v":""},{"$f":"別紙追加様式!K68","v":""},{"$f":"別紙追加様式!J69","v":""},"","",null,null,"","","","","","","",null,null,"","","","","","",{"$f":"IF(ISERROR(FIND(\"滋\",A3)),IF(ISERROR(FIND(\"京\",A3)),IF(ISERROR(FIND(\"大\",A3)),29,27),26),25)","v":29},"大津",{"$f":"IF(FM2=25,RIGHT(A6,3)&\"1\"&B55,IF(FM2=26,RIGHT(A6,3)&\"2\"&B55,IF(FM2=27,RIGHT(A6,3)&\"3\"&B55,RIGHT(A6,3)&\"4\"&B55)))","v":{"$error":"#N/A"}},null,null,"","",{"$nulls":3},"",null,{"$f":"申三面!I80","v":"□"},{"$f":"GA8","v":""},"","","","",null,{"$f":"申三面!M47","v":0},{"$f":"申三面!T47","v":0},{"$f":"申三面!AA47","v":""},{"$f":"申三面!M49","v":0},{"$f":"申三面!T49","v":0},{"$f":"申三面!AA49","v":""},{"$f":"申三面!M48","v":0},{"$f":"申三面!T48","v":0},{"$f":"申三面!AA48","v":""},{"$f":"申三面!M50","v":0},{"$f":"申三面!T50","v":0},{"$f":"申三面!AA50","v":""},{"$f":"申三面!M42","v":0},{"$f":"申三面!T42","v":0},{"$f":"申三面!AA42","v":""},{"$f":"申二面!D173","v":"□"},{"$f":"申二面!I173","v":0},{"$f":"申二面!D174","v":"□"},{"$f":"申二面!I174","v":0},{"$f":"申二面!D175","v":"□"},{"$f":"申三面!M54","v":0},{"$f":"申三面!T54","v":0},{"$f":"申三面!AA54","v":""},{"$f":"申二面!D179","v":"□"},{"$f":"申二面!I179","v":0},{"$f":"申二面!D180","v":"□"},{"$f":"申二面!I180","v":0},{"$f":"申二面!D181","v":"□"},{"$f":"申二面!I181","v":0},{"$f":"申三面!M51","v":0},{"$f":"申三面!T51","v":0},{"$f":"申三面!AA51","v":""}]
[{"$f":"A55&B55","v":{"$error":"#N/A"}},{"$f":"TODAY()","v":"2025-04-09"},{"$f":"REPLACE(A3,6,1,\"認\")","v":{"$error":"#N/A"}},null,"株式会社　確認検査機構アネックス　代表取締役　稲垣雄一",{"$f":"IF(ISERROR(F2),\"\",IF(OR(F2=0,F2=\"\"),\"\",IF(ISNUMBER(F2),F2,ASC(TRIM(F2)))))","v":""},{"$f":"IF(ISERROR(G2),\"\",IF(OR(G2=0,G2=\"\"),\"\",IF(ISNUMBER(G2),G2,ASC(TRIM(G2)))))","v":""},{"$f":"IF(ISERROR(H2),\"\",IF(OR(H2=0,H2=\"\"),\"\",IF(ISNUMBER(H2),H2,ASC(TRIM(H2)))))","v":""},"",{"$f":"SUBSTITUTE(SUBSTITUTE(J4,\"(\",\"\"),\")\",\"\")","v":""},"","","","","","","","","","",{"$f":"SUBSTITUTE(SUBSTITUTE(U4,\"(\",\"\"),\")\",\"\")","v":""},"","","","","","","","","","",{"$f":"SUBSTITUTE(SUBSTITUTE(AF4,\"(\",\"\"),\")\",\"\")","v":""},"","","","",{"$f":"SUBSTITUTE(SUBSTITUTE(AK4,\"(\",\"\"),\")\",\"\")","v":""},"","","","","","","","","","",{"$f":"SUBSTITUTE(SUBSTITUTE(AV4,\"(\",\"\"),\")\",\"\")","v":""},"","","","","","",{"$f":"SUBSTITUTE(SUBSTITUTE(BC4,\"(\",\"\"),\")\",\"\")","v":""},"","","","","","","","",{"$f":"IF(ISERROR(BL2),\"\",IF(OR(BL2=0,BL2=\"\"),\"\",IF(BL2=\"■\",-1,0)))","v":0},0,0,0,0,0,{"$f":"IF(ISERROR(BR2),\"\",IF(OR(BR2=0,BR2=\"\"),\"\",IF(ISNUMBER(BR2),BR2,ASC(TRIM(BR2)))))","v":""},{"$f":"IF(ISERROR(BS2),\"\",IF(OR(BS2=0,BS2=\"\"),\"\",IF(ISNUMBER(BS2),BS2,ASC(TRIM(BS2)))))","v":""},{"$f":"IF(ISERROR(BT2),\"\",IF(OR(BT2=0,BT2=\"\"),\"\",IF(ISNUMBER(BT2),BT2,ASC(TRIM(BT2)))))","v":""},"","","","","","","","","","","","","","","","","","","","","","","","","","","","","","","","","","","","","","","","","","","","","","","","","","","","","","","","","","","","","","",{"$f":"IF(ISERROR(EE2),\"\",IF(OR(EE2=0,EE2=\"\"),\"\",IF(ISNUMBER(EE2),EE2,ASC(TRIM(EE2)))))","v":""},{"$f":"IF(ISERROR(EF2),\"\",IF(OR(EF2=0,EF2=\"\"),\"\",IF(ISNUMBER(EF2),EF2,ASC(TRIM(EF2)))))","v":""},"","","","","","","","",{"$f":"SUBSTITUTE(SUBSTITUTE(EO4,\"(\",\"\"),\")\",\"\")","v":""},"","","","",{"$f":"SUBSTITUTE(SUBSTITUTE(ET4,\"(\",\"\"),\")\",\"\")","v":""},"","","","","","","","","","","","","","","","","","",29,"大津",{"$f":"C6","v":""},"","","","","","","","","",{"$f":"IF(ISERROR(FY2),\"\",IF(OR(FY2=0,FY2=\"\"),\"\",IF(FY2=\"■\",-1,0)))","v":0},{"$f":"IF(ISERROR(FZ2),\"\",IF(OR(FZ2=0,FZ2=\"\"),\"\",IF(ISNUMBER(FZ2),FZ2,ASC(TRIM(FZ2)))))","v":""},{"$f":"IF(ISERROR(GA2),\"\",IF(OR(GA2=0,GA2=\"\"),\"\",IF(ISNUMBER(GA2),GA2,ASC(TRIM(GA2)))))","v":""},"","","","","","","","","","","","","","","",{"$f":"IF(ISERROR(GQ2),\"\",IF(OR(GQ2=0,GQ2=\"\"),\"\",IF(ISNUMBER(GQ2),GQ2,ASC(TRIM(GQ2)))))","v":""},{"$f":"IF(ISERROR(GR2),\"\",IF(OR(GR2=0,GR2=\"\"),\"\",IF(ISNUMBER(GR2),GR2,ASC(TRIM(GR2)))))","v":""},{"$f":"IF(ISERROR(GS2),\"\",IF(OR(GS2=0,GS2=\"\"),\"\",IF(ISNUMBER(GS2),GS2,ASC(TRIM(GS2)))))","v":""},{"$f":"IF(ISERROR(GT2),\"\",IF(OR(GT2=0,GT2=\"\"),\"\",IF(ISNUMBER(GT2),GT2,ASC(TRIM(GT2)))))","v":""},{"$f":"IF(ISERROR(GU2),\"\",IF(OR(GU2=0,GU2=\"\"),\"\",IF(GU2=\"■\",-1,0)))","v":0},{"$f":"IF(ISERROR(GV2),\"\",IF(OR(GV2=0,GV2=\"\"),\"\",IF(ISNUMBER(GV2),GV2,ASC(TRIM(GV2)))))","v":""},{"$f":"IF(ISERROR(GW2),\"\",IF(OR(GW2=0,GW2=\"\"),\"\",IF(GW2=\"■\",-1,0)))","v":0},{"$f":"IF(ISERROR(GX2),\"\",IF(OR(GX2=0,GX2=\"\"),\"\",IF(ISNUMBER(GX2),GX2,ASC(TRIM(GX2)))))","v":""},{"$f":"IF(ISERROR(GY2),\"\",IF(OR(GY2=0,GY2=\"\"),\"\",IF(GY2=\"■\",-1,0)))","v":0},{"$f":"IF(ISERROR(GZ2),\"\",IF(OR(GZ2=0,GZ2=\"\"),\"\",IF(ISNUMBER(GZ2),GZ2,ASC(TRIM(GZ2)))))","v":""},{"$f":"IF(ISERROR(HA2),\"\",IF(OR(HA2=0,HA2=\"\"),\"\",IF(ISNUMBER(HA2),HA2,ASC(TRIM(HA2)))))","v":""},{"$f":"IF(ISERROR(HB2),\"\",IF(OR(HB2=0,HB2=\"\"),\"\",IF(ISNUMBER(HB2),HB2,ASC(TRIM(HB2)))))","v":""},{"$f":"IF(ISERROR(HC2),\"\",IF(OR(HC2=0,HC2=\"\"),\"\",IF(HC2=\"■\",-1,0)))","v":0},{"$f":"IF(ISERROR(HD2),\"\",IF(OR(HD2=0,HD2=\"\"),\"\",IF(ISNUMBER(HD2),HD2,ASC(TRIM(HD2)))))","v":""},{"$f":"IF(ISERROR(HE2),\"\",IF(OR(HE2=0,HE2=\"\"),\"\",IF(HE2=\"■\",-1,0)))","v":0},{"$f":"IF(ISERROR(HF2),\"\",IF(OR(HF2=0,HF2=\"\"),\"\",IF(ISNUMBER(HF2),HF2,ASC(TRIM(HF2)))))","v":""},{"$f":"IF(ISERROR(HG2),\"\",IF(OR(HG2=0,HG2=\"\"),\"\",IF(HG2=\"■\",-1,0)))","v":0},{"$f":"IF(ISERROR(HH2),\"\",IF(OR(HH2=0,HH2=\"\"),\"\",IF(ISNUMBER(HH2),HH2,ASC(TRIM(HH2)))))","v":""},{"$f":"IF(ISERROR(HI2),\"\",IF(OR(HI2=0,HI2=\"\"),\"\",IF(ISNUMBER(HI2),HI2,ASC(TRIM(HI2)))))","v":""},{"$f":"IF(ISERROR(HJ2),\"\",IF(OR(HJ2=0,HJ2=\"\"),\"\",IF(ISNUMBER(HJ2),HJ2,ASC(TRIM(HJ2)))))","v":""},{"$f":"IF(ISERROR(HK2),\"\",IF(OR(HK2=0,HK2=\"\"),\"\",IF(ISNUMBER(HK2),HK2,ASC(TRIM(HK2)))))","v":""}]
[{"$nulls":9},{"$f":"IF(ISERROR(J2),\"\",IF(OR(J2=0,J2=\"\"),\"\",IF(ISNUMBER(J2),J2,ASC(TRIM(J2)))))","v":""},{"$nulls":10},{"$f":"IF(ISERROR(U2),\"\",IF(OR(U2=0,U2=\"\"),\"\",IF(ISNUMBER(U2),U2,ASC(TRIM(U2)))))","v":""},{"$nulls":10},{"$f":"IF(ISERROR(AF2),\"\",IF(OR(AF2=0,AF2=\"\"),\"\",IF(ISNUMBER(AF2),AF2,ASC(TRIM(AF2)))))","v":""},{"$nulls":4},{"$f":"IF(ISERROR(AK2),\"\",IF(OR(AK2=0,AK2=\"\"),\"\",IF(ISNUMBER(AK2),AK2,ASC(TRIM(AK2)))))","v":""},{"$nulls":10},{"$f":"IF(ISERROR(AV2),\"\",IF(OR(AV2=0,AV2=\"\"),\"\",IF(ISNUMBER(AV2),AV2,ASC(TRIM(AV2)))))","v":""},{"$nulls":6},{"$f":"IF(ISERROR(BC2),\"\",IF(OR(BC2=0,BC2=\"\"),\"\",IF(ISNUMBER(BC2),BC2,ASC(TRIM(BC2)))))","v":""},{"$nulls":72},{"$f":"IF(申三面!L73=\"平成\",\"H\",\"R\")","v":"R"},{"$f":"IF(申三面!L74=\"平成\",\"H\",\"R\")","v":"R"},null,{"$f":"IF(申三面!G76=\"平成\",\"H\",\"R\")","v":"R"},null,null,{"$f":"IF(申三面!G77=\"平成\",\"H\",\"R\")","v":"R"},null,null,{"$f":"IF(申三面!G78=\"平成\",\"H\",\"R\")","v":"R"},{"$nulls":7},{"$f":"IF(ISERROR(EO2),\"\",IF(OR(EO2=0,EO2=\"\"),\"\",IF(ISNUMBER(EO2),EO2,ASC(TRIM(EO2)))))","v":""},{"$nulls":4},{"$f":"IF(ISERROR(ET2),\"\",IF(OR(ET2=0,ET2=\"\"),\"\",IF(ISNUMBER(ET2),ET2,ASC(TRIM(ET2)))))","v":""}]
["※このシートはアネックス処理用です。さわらないで下さい。(anex20181001)",{"$nulls":86},"新築","増築","改築","移転","用途変更","大規模の修繕","大規模の模様替",{"$nulls":33},{"$f":"IF(ISERROR(SEARCH(\"元\",申三面!N73))=TRUE,申三面!N73,1)","v":0},{"$f":"IF(ISERROR(SEARCH(\"元\",申三面!N74))=TRUE,申三面!N74,1)","v":0},null,{"$f":"IF(ISERROR(SEARCH(\"元\",申三面!I76))=TRUE,申三面!I76,1)","v":0},null,null,{"$f":"IF(ISERROR(SEARCH(\"元\",申三面!I77))=TRUE,申三面!I77,1)","v":0},null,null,{"$f":"IF(ISERROR(SEARCH(\"元\",申三面!I78))=TRUE,申三面!I78,1)","v":0}]
["2019",null,{"$f":"IF(ISERROR(FO2),\"\",IF(OR(FO2=0,FO2=\"\"),\"\",IF(ISNUMBER(FO2),FO2,VALUE(ASC(TRIM(FO2))))))","v":""},{"$nulls":84},{"$f":"申三面!B31","v":"□"},{"$f":"申三面!E31","v":"□"},{"$f":"申三面!H31","v":"□"},{"$f":"申三面!K31","v":"□"},{"$f":"申三面!N31","v":"□"},{"$f":"申三面!S31","v":"□"},{"$f":"申三面!Y31","v":"□"},{"$nulls":85},"道路高さ制限不適用","隣地高さ制限不適用","北側高さ制限不適用"]
[{"$f":"$A$6&\"確申建機構ア滋大津\"","v":"2019確申建機構ア滋大津"},{"$nulls":86},{"$f":"IF(CJ6=\"■\",\"新築\",\"\")","v":""},{"$f":"IF(CK6=\"■\",\"増築\",\"\")","v":""},{"$f":"IF(CL6=\"■\",\"改築\",\"\")","v":""},{"$f":"IF(CM6=\"■\",\"移転\",\"\")","v":""},{"$f":"IF(CN6=\"■\",\"用途変更\",\"\")","v":""},{"$f":"IF(CO6=\"■\",\"大規模の修繕\",\"\")","v":""},{"$f":"IF(CP6=\"■\",\"大規模の模様替\",\"\")","v":""},{"$nulls":85},{"$f":"申三面!D67","v":"□"},{"$f":"申三面!M67","v":"□"},{"$f":"申三面!V67","v":"□"}]
[{"$f":"$A$6&\"確申建機構ア滋草津\"","v":"2019確申建機構ア滋草津"},{"$nulls":178},{"$f":"IF(FX7=\"■\",FX6,\"\")","v":""},{"$f":"IF(FY7=\"■\",FY6,\"\")","v":""},{"$f":"IF(FZ7=\"■\",FZ6,\"\")","v":""},{"$f":"FX8&FY8&FZ8","v":""}]
[{"$f":"$A$6&\"確申建機構ア滋守山\"","v":"2019確申建機構ア滋守山"}]
[{"$f":"$A$6&\"確申建機構ア滋近江\"","v":"2019確申建機構ア滋近江"}]
[{"$f":"$A$6&\"確申建機構ア滋彦根\"","v":"2019確申建機構ア滋彦根"}]
[{"$f":"$A$6&\"確申建機構ア滋八日\"","v":"2019確申建機構ア滋八日"}]
[{"$f":"$A$6&\"確申建機構ア滋長浜\"","v":"2019確申建機構ア滋長浜"}]
[{"$f":"$A$6&\"確申建機構ア滋湖南\"","v":"2019確申建機構ア滋湖南"}]
[{"$f":"$A$6&\"確申建機構ア滋湖西\"","v":"2019確申建機構ア滋湖西"}]
[{"$f":"$A$6&\"確申建機構ア滋東近\"","v":"2019確申建機構ア滋東近"}]
[{"$f":"$A$6&\"確申建機構ア滋湖東\"","v":"2019確申建機構ア滋湖東"}]
[{"$f":"$A$6&\"確申建機構ア滋甲賀\"","v":"2019確申建機構ア滋甲賀"}]
[{"$f":"$A$6&\"確申建機構ア滋湖北\"","v":"2019確申建機構ア滋湖北"}]
[]
[{"$f":"$A$6&\"確申建機構ア京市\"","v":"2019確申建機構ア京市"}]
[{"$f":"$A$6&\"確申建機構ア京府\"","v":"2019確申建機構ア京府"}]
[{"$f":"$A$6&\"確申建機構ア京宇\"","v":"2019確申建機構ア京宇"}]
[{"$f":"$A$6&\"確申建機構ア京乙\"","v":"2019確申建機構ア京乙"}]
[{"$f":"$A$6&\"確申建機構ア京田\"","v":"2019確申建機構ア京田"}]
[{"$f":"$A$6&\"確申建機構ア京木\"","v":"2019確申建機構ア京木"}]
[{"$f":"$A$6&\"確申建機構ア京園\"","v":"2019確申建機構ア京園"}]
[{"$f":"$A$6&\"確申建機構ア京亀\"","v":"2019確申建機構ア京亀"}]
[]
[{"$f":"$A$6&\"確申建機構ア大大阪\"","v":"2019確申建機構ア大大阪"}]
[{"$f":"$A$6&\"確申建機構ア大枚方\"","v":"2019確申建機構ア大枚方"}]
[{"$f":"$A$6&\"確申建機構ア大茨木\"","v":"2019確申建機構ア大茨木"}]
[{"$f":"$A$6&\"確申建機構ア大高槻\"","v":"2019確申建機構ア大高槻"}]
[{"$f":"$A$6&\"確申建機構ア大門真\"","v":"2019確申建機構ア大門真"}]
[{"$f":"$A$6&\"確申建機構ア大箕面\"","v":"2019確申建機構ア大箕面"}]
[{"$f":"$A$6&\"確申建機構ア大八尾\"","v":"2019確申建機構ア大八尾"}]
[{"$f":"$A$6&\"確申建機構ア大東大\"","v":"2019確申建機構ア大東大"}]
[{"$f":"$A$6&\"確申建機構ア大池田\"","v":"2019確申建機構ア大池田"}]
[{"$f":"$A$6&\"確申建機構ア大寝屋\"","v":"2019確申建機構ア大寝屋"}]
[{"$f":"$A$6&\"確申建機構ア大守口\"","v":"2019確申建機構ア大守口"}]
[{"$f":"$A$6&\"確申建機構ア大豊中\"","v":"2019確申建機構ア大豊中"}]
[{"$f":"$A$6&\"確申建機構ア大吹田\"","v":"2019確申建機構ア大吹田"}]
[{"$f":"$A$6&\"確申建機構ア大府\"","v":"2019確申建機構ア大府"}]
[]
[{"$f":"$A$6&\"確申建機構ア奈奈良\"","v":"2019確申建機構ア奈奈良"}]
[{"$f":"$A$6&\"確申建機構ア奈奈土\"","v":"2019確申建機構ア奈奈土"}]
[{"$f":"$A$6&\"確申建機構ア奈桜井\"","v":"2019確申建機構ア奈桜井"}]
[{"$f":"$A$6&\"確申建機構ア奈橿原\"","v":"2019確申建機構ア奈橿原"}]
[{"$f":"$A$6&\"確申建機構ア奈高田\"","v":"2019確申建機構ア奈高田"}]
[{"$f":"$A$6&\"確申建機構ア奈郡山\"","v":"2019確申建機構ア奈郡山"}]
[{"$f":"$A$6&\"確申建機構ア奈生駒\"","v":"2019確申建機構ア奈生駒"}]
[]
[]
[]
[{"$f":"INDEX(A7:A54,MATCH(\"?*\",B7:B54,0),1)","v":{"$error":"#N/A"}},{"$f":"DBCS(INDEX(B7:B54,MATCH(\"?*\",B7:B54,0),1))","v":{"$error":"#N/A"}}]

{"sheet":"Sheet1","index":47,"n_rows":0,"n_cols":0,"rows_kept":0}

{"sheet":"Sheet2","index":48,"n_rows":0,"n_cols":0,"rows_kept":0}